{"text_format":"1","workbook":"xlsx","n_sheets":9,"sheets":["J13","J14","J15","J16","G13","G14","G15","G16","Poeng"],"not_rendered":{"charts":0,"images":0,"macros":1,"external_links":0,"defined_names":15,"comments":1,"pivot_tables":0},"unopened":[],"bounds":{"document_bytes":16777216,"sheet_cells":100000,"rows_first":2000,"rows_last":500,"rows_between":2000,"halvings":0,"cell_chars":16384,"cell_head_chars":4096},"cells_cut":0,"cells_raw":0,"read":"whole","date_system":"1900"}

{"sheet":"J13","index":0,"n_rows":97,"n_cols":32,"rows_kept":97,"cut":false,"hidden":false,"merged":[[0,2,0,16],[1,5,1,6],[1,7,1,8],[1,9,1,10],[1,11,1,12],[1,13,1,14],[1,15,1,16],[2,15,2,16],[2,5,2,6],[2,7,2,8],[2,9,2,10],[2,11,2,12],[2,13,2,14]]}
["Jenter 13",null,"  Sparebank1-CUP 2021"]
[null,null,null,null,null,"SP1- CUP 1 ",null,"SP1- CUP 2 ",null,"SP1- CUP 3",null,"SP1- CUP 4",null,"SP1- CUP 5",null,"SP1- CUP 6",null,"Poeng",null,null,null,null,null,null,"Fire beste",null,null,null,"Sum"]
["Nr","NAVN","KLUBB","POENG","Fullført","Nr.  Poeng ",null,"Nr.  Poeng ",null,"Nr.   Poeng ",null,"Nr.  Poeng ",null,"Nr.  Poeng ",null,"Nr. Poeng ",null,1,2,3,4,5,6,7,1,2,3,4]
[{"$f":"AF4","v":1},"Hanna Fløttum Bones","Rognes IL",{"$f":"IF(B4<>\"\",AC4,\"\")","v":380},{"$f":"IF(AD4<4,\" \",\"F\")","v":"F"},1,{"$f":"IF(F4>0,INDEX(Poeng!$A$1:$B$100,F4,2),\"\")","v":100},3,{"$f":"IF(H4>0,INDEX(Poeng!$A$1:$B$100,H4,2),\"\")","v":60},1,{"$f":"IF(J4>0,INDEX(Poeng!$A$1:$B$100,J4,2),\"\")","v":100},1,{"$f":"IF(L4>0,INDEX(Poeng!$A$1:$B$100,L4,2),\"\")","v":100},3,{"$f":"IF(N4>0,INDEX(Poeng!$A$1:$B$100,N4,2),\"\")","v":60},2,{"$f":"IF(P4>0,INDEX(Poeng!$A$1:$B$100,P4,2),\"\")","v":80},{"$f":"IF(F4>0,G4,0)","v":100},{"$f":"IF(H4>0,I4,0)","v":60},{"$f":"IF(J4>0,K4,0)","v":100},{"$f":"IF(L4>0,M4,0)","v":100},{"$f":"IF(N4>0,O4,0)","v":60},{"$f":"IF(P4>0,Q4,0)","v":80},{"$f":"IF(#REF!>0,#REF!,0)","v":{"$error":"#REF!"}},{"$f":"LARGE(R4:W4,1)","v":100},{"$f":"LARGE(R4:W4,2)","v":100},{"$f":"LARGE(R4:W4,3)","v":100},{"$f":"LARGE(R4:W4,4)","v":80},{"$f":"SUM(Y4:AB4)","v":380},{"$f":"COUNT(F4:Q4)/2","v":6},{"$f":"AC4*10^8+Y4*10^6/2+Z4*10^4/2+AA4*10^2/2+AB4/2","v":38050505040},{"$f":"IF(B4<>\"\",RANK(AE4,AE$4:AE$72,0),\"\")","v":1}]
[2,"Marie Furuhaug","Byåsen IL",360,"F",2,{"$f":"IF(F5>0,INDEX(Poeng!$A$1:$B$100,F5,2),\"\")","v":80},1,{"$f":"IF(H5>0,INDEX(Poeng!$A$1:$B$100,H5,2),\"\")","v":100},2,{"$f":"IF(J5>0,INDEX(Poeng!$A$1:$B$100,J5,2),\"\")","v":80},2,{"$f":"IF(L5>0,INDEX(Poeng!$A$1:$B$100,L5,2),\"\")","v":80},2,{"$f":"IF(N5>0,INDEX(Poeng!$A$1:$B$100,N5,2),\"\")","v":80},1,{"$f":"IF(P5>0,INDEX(Poeng!$A$1:$B$100,P5,2),\"\")","v":100},80,100,80,80,80,100,{"$f":"IF(#REF!>0,#REF!,0)","v":{"$error":"#REF!"}},100,100,80,80,360,6,36050504040,2]
[3,"Karianne Sundset","Klæbu IL",260,"F",4,{"$f":"IF(F6>0,INDEX(Poeng!$A$1:$B$100,F6,2),\"\")","v":50},4,{"$f":"IF(H6>0,INDEX(Poeng!$A$1:$B$100,H6,2),\"\")","v":50},3,{"$f":"IF(J6>0,INDEX(Poeng!$A$1:$B$100,J6,2),\"\")","v":60},4,{"$f":"IF(L6>0,INDEX(Poeng!$A$1:$B$100,L6,2),\"\")","v":50},1,{"$f":"IF(N6>0,INDEX(Poeng!$A$1:$B$100,N6,2),\"\")","v":100},4,{"$f":"IF(P6>0,INDEX(Poeng!$A$1:$B$100,P6,2),\"\")","v":50},50,50,60,50,100,50,{"$f":"IF(#REF!>0,#REF!,0)","v":{"$error":"#REF!"}},100,60,50,50,260,6,26050302525,3]
{"$rows_left_out":92}
{"sheet":"J14","index":1,"n_rows":98,"n_cols":32,"rows_kept":98,"cut":false,"hidden":false,"merged":[[0,2,0,16],[1,5,1,6],[1,7,1,8],[1,9,1,10],[1,11,1,12],[1,13,1,14],[1,15,1,16],[2,15,2,16],[2,5,2,6],[2,7,2,8],[2,9,2,10],[2,11,2,12],[2,13,2,14]]}
["Jenter 14",null,"  Sparebank1-CUP 2021"]
[null,null,null,null,null,"SP1- CUP 1 ",null,"SP1- CUP 2 ",null,"SP1- CUP 3",null,"SP1- CUP 4",null,"SP1- CUP 5",null,"SP1- CUP 6",null,"Poeng",null,null,null,null,null,null,"Fire beste",null,null,null,"Sum"]
["Nr","NAVN","KLUBB","POENG","Fullført","Nr.  Poeng ",null,"Nr.  Poeng ",null,"Nr.   Poeng ",null,"Nr.  Poeng ",null,"Nr.  Poeng ",null,"Nr. Poeng ",null,1,2,3,4,5,6,7,1,2,3,4]
[{"$f":"AF4","v":1},"Ingrid Wollan Benum","Byåsen IL",{"$f":"IF(B4<>\"\",AC4,\"\")","v":400},{"$f":"IF(AD4<4,\" \",\"F\")","v":"F"},2,{"$f":"IF(F4>0,INDEX(Poeng!$A$1:$B$100,F4,2),\"\")","v":80},1,{"$f":"IF(H4>0,INDEX(Poeng!$A$1:$B$100,H4,2),\"\")","v":100},1,{"$f":"IF(J4>0,INDEX(Poeng!$A$1:$B$100,J4,2),\"\")","v":100},1,{"$f":"IF(L4>0,INDEX(Poeng!$A$1:$B$100,L4,2),\"\")","v":100},1,{"$f":"IF(N4>0,INDEX(Poeng!$A$1:$B$100,N4,2),\"\")","v":100},1,{"$f":"IF(P4>0,INDEX(Poeng!$A$1:$B$100,P4,2),\"\")","v":100},{"$f":"IF(F4>0,G4,0)","v":80},{"$f":"IF(H4>0,I4,0)","v":100},{"$f":"IF(J4>0,K4,0)","v":100},{"$f":"IF(L4>0,M4,0)","v":100},{"$f":"IF(N4>0,O4,0)","v":100},{"$f":"IF(P4>0,Q4,0)","v":100},{"$f":"IF(#REF!>0,#REF!,0)","v":{"$error":"#REF!"}},{"$f":"LARGE(R4:W4,1)","v":100},{"$f":"LARGE(R4:W4,2)","v":100},{"$f":"LARGE(R4:W4,3)","v":100},{"$f":"LARGE(R4:W4,4)","v":100},{"$f":"SUM(Y4:AB4)","v":400},{"$f":"COUNT(F4:Q4)/2","v":6},{"$f":"AC4*10^8+Y4*10^6/2+Z4*10^4/2+AA4*10^2/2+AB4/2","v":40050505050},{"$f":"IF(B4<>\"\",RANK(AE4,AE$4:AE$73,0),\"\")","v":1}]
[2,"Ida Bjørgen","Lundamo IL",270,"F",7,{"$f":"IF(F5>0,INDEX(Poeng!$A$1:$B$100,F5,2),\"\")","v":36},2,{"$f":"IF(H5>0,INDEX(Poeng!$A$1:$B$100,H5,2),\"\")","v":80},2,{"$f":"IF(J5>0,INDEX(Poeng!$A$1:$B$100,J5,2),\"\")","v":80},4,{"$f":"IF(L5>0,INDEX(Poeng!$A$1:$B$100,L5,2),\"\")","v":50},3,{"$f":"IF(N5>0,INDEX(Poeng!$A$1:$B$100,N5,2),\"\")","v":60},6,{"$f":"IF(P5>0,INDEX(Poeng!$A$1:$B$100,P5,2),\"\")","v":40},36,80,80,50,60,40,{"$f":"IF(#REF!>0,#REF!,0)","v":{"$error":"#REF!"}},80,80,60,50,270,6,27040403025,2]
[3,"Wilma Skjetlein","Byåsen IL",250,"F",6,{"$f":"IF(F6>0,INDEX(Poeng!$A$1:$B$100,F6,2),\"\")","v":40},null,{"$f":"IF(H6>0,INDEX(Poeng!$A$1:$B$100,H6,2),\"\")","v":""},null,{"$f":"IF(J6>0,INDEX(Poeng!$A$1:$B$100,J6,2),\"\")","v":""},2,{"$f":"IF(L6>0,INDEX(Poeng!$A$1:$B$100,L6,2),\"\")","v":80},2,{"$f":"IF(N6>0,INDEX(Poeng!$A$1:$B$100,N6,2),\"\")","v":80},4,{"$f":"IF(P6>0,INDEX(Poeng!$A$1:$B$100,P6,2),\"\")","v":50},40,0,0,80,80,50,{"$f":"IF(#REF!>0,#REF!,0)","v":{"$error":"#REF!"}},80,80,50,40,250,4,25040402520,3]
{"$rows_left_out":93}
{"sheet":"J15","index":2,"n_rows":96,"n_cols":32,"rows_kept":96,"cut":false,"hidden":false,"merged":[[0,2,0,16],[1,5,1,6],[1,7,1,8],[1,9,1,10],[1,11,1,12],[1,13,1,14],[1,15,1,16],[2,15,2,16],[2,5,2,6],[2,7,2,8],[2,9,2,10],[2,11,2,12],[2,13,2,14]]}
["Jenter 15",null,"  Sparebank1-CUP 2021"]
[null,null,null,null,null,"SP1- CUP 1 ",null,"SP1- CUP 2 ",null,"SP1- CUP 3",null,"SP1- CUP 4",null,"SP1- CUP 5",null,"SP1- CUP 6",null,"Poeng",null,null,null,null,null,null,"Fire beste",null,null,null,"Sum"]
["Nr","NAVN","KLUBB","POENG","Fullført","Nr.  Poeng ",null,"Nr.  Poeng ",null,"Nr.   Poeng ",null,"Nr.  Poeng ",null,"Nr.  Poeng ",null,"Nr. Poeng ",null,1,2,3,4,5,6,7,1,2,3,4]
[{"$f":"AF4","v":1},"Marie Wollan Benum","Byåsen IL",{"$f":"IF(B4<>\"\",AC4,\"\")","v":400},{"$f":"IF(AD4<4,\" \",\"F\")","v":"F"},null,{"$f":"IF(F4>0,INDEX(Poeng!$A$1:$B$100,F4,2),\"\")","v":""},1,{"$f":"IF(H4>0,INDEX(Poeng!$A$1:$B$100,H4,2),\"\")","v":100},1,{"$f":"IF(J4>0,INDEX(Poeng!$A$1:$B$100,J4,2),\"\")","v":100},1,{"$f":"IF(L4>0,INDEX(Poeng!$A$1:$B$100,L4,2),\"\")","v":100},1,{"$f":"IF(N4>0,INDEX(Poeng!$A$1:$B$100,N4,2),\"\")","v":100},1,{"$f":"IF(P4>0,INDEX(Poeng!$A$1:$B$100,P4,2),\"\")","v":100},{"$f":"IF(F4>0,G4,0)","v":0},{"$f":"IF(H4>0,I4,0)","v":100},{"$f":"IF(J4>0,K4,0)","v":100},{"$f":"IF(L4>0,M4,0)","v":100},{"$f":"IF(N4>0,O4,0)","v":100},{"$f":"IF(P4>0,Q4,0)","v":100},{"$f":"IF(#REF!>0,#REF!,0)","v":{"$error":"#REF!"}},{"$f":"LARGE(R4:W4,1)","v":100},{"$f":"LARGE(R4:W4,2)","v":100},{"$f":"LARGE(R4:W4,3)","v":100},{"$f":"LARGE(R4:W4,4)","v":100},{"$f":"SUM(Y4:AB4)","v":400},{"$f":"COUNT(F4:Q4)/2","v":5},{"$f":"AC4*10^8+Y4*10^6/2+Z4*10^4/2+AA4*10^2/2+AB4/2","v":40050505050},{"$f":"IF(B4<>\"\",RANK(AE4,AE$4:AE$71,0),\"\")","v":1}]
[2,"Nora Hafsmo","Byåsen IL",340,"F",1,{"$f":"IF(F5>0,INDEX(Poeng!$A$1:$B$100,F5,2),\"\")","v":100},2,{"$f":"IF(H5>0,INDEX(Poeng!$A$1:$B$100,H5,2),\"\")","v":80},3,{"$f":"IF(J5>0,INDEX(Poeng!$A$1:$B$100,J5,2),\"\")","v":60},2,{"$f":"IF(L5>0,INDEX(Poeng!$A$1:$B$100,L5,2),\"\")","v":80},2,{"$f":"IF(N5>0,INDEX(Poeng!$A$1:$B$100,N5,2),\"\")","v":80},2,{"$f":"IF(P5>0,INDEX(Poeng!$A$1:$B$100,P5,2),\"\")","v":80},100,80,60,80,80,80,{"$f":"IF(#REF!>0,#REF!,0)","v":{"$error":"#REF!"}},100,80,80,80,340,6,34050404040,2]
[3,"Agnes Vatterholm Jernberg","Byaasen Skiklub",230,"F",3,{"$f":"IF(F6>0,INDEX(Poeng!$A$1:$B$100,F6,2),\"\")","v":60},3,{"$f":"IF(H6>0,INDEX(Poeng!$A$1:$B$100,H6,2),\"\")","v":60},6,{"$f":"IF(J6>0,INDEX(Poeng!$A$1:$B$100,J6,2),\"\")","v":40},4,{"$f":"IF(L6>0,INDEX(Poeng!$A$1:$B$100,L6,2),\"\")","v":50},3,{"$f":"IF(N6>0,INDEX(Poeng!$A$1:$B$100,N6,2),\"\")","v":60},5,{"$f":"IF(P6>0,INDEX(Poeng!$A$1:$B$100,P6,2),\"\")","v":45},60,60,40,50,60,45,{"$f":"IF(#REF!>0,#REF!,0)","v":{"$error":"#REF!"}},60,60,60,50,230,6,23030303025,3]
{"$rows_left_out":91}
{"sheet":"J16","index":3,"n_rows":94,"n_cols":32,"rows_kept":94,"cut":false,"hidden":false,"merged":[[0,2,0,16],[1,5,1,6],[1,7,1,8],[1,9,1,10],[1,11,1,12],[1,13,1,14],[1,15,1,16],[2,15,2,16],[2,5,2,6],[2,7,2,8],[2,9,2,10],[2,11,2,12],[2,13,2,14]]}
["Jenter 16",null,"  Sparebank1-CUP 2021"]
[null,null,null,null,null,"SP1- CUP 1 ",null,"SP1- CUP 2 ",null,"SP1- CUP 3",null,"SP1- CUP 4",null,"SP1- CUP 5",null,"SP1- CUP 6",null,"Poeng",null,null,null,null,null,null,"Fire beste",null,null,null,"Sum"]
["Nr","NAVN","KLUBB","POENG","Fullført","Nr.  Poeng ",null,"Nr.  Poeng ",null,"Nr.   Poeng ",null,"Nr.  Poeng ",null,"Nr.  Poeng ",null,"Nr. Poeng ",null,1,2,3,4,5,6,7,1,2,3,4]
[{"$f":"AF4","v":1},"Petronella Haram","Strindheim IL ",{"$f":"IF(B4<>\"\",AC4,\"\")","v":400},{"$f":"IF(AD4<4,\" \",\"F\")","v":"F"},1,{"$f":"IF(F4>0,INDEX(Poeng!$A$1:$B$100,F4,2),\"\")","v":100},1,{"$f":"IF(H4>0,INDEX(Poeng!$A$1:$B$100,H4,2),\"\")","v":100},2,{"$f":"IF(J4>0,INDEX(Poeng!$A$1:$B$100,J4,2),\"\")","v":80},1,{"$f":"IF(L4>0,INDEX(Poeng!$A$1:$B$100,L4,2),\"\")","v":100},1,{"$f":"IF(N4>0,INDEX(Poeng!$A$1:$B$100,N4,2),\"\")","v":100},1,{"$f":"IF(P4>0,INDEX(Poeng!$A$1:$B$100,P4,2),\"\")","v":100},{"$f":"IF(F4>0,G4,0)","v":100},{"$f":"IF(H4>0,I4,0)","v":100},{"$f":"IF(J4>0,K4,0)","v":80},{"$f":"IF(L4>0,M4,0)","v":100},{"$f":"IF(N4>0,O4,0)","v":100},{"$f":"IF(P4>0,Q4,0)","v":100},{"$f":"IF(#REF!>0,#REF!,0)","v":{"$error":"#REF!"}},{"$f":"LARGE(R4:W4,1)","v":100},{"$f":"LARGE(R4:W4,2)","v":100},{"$f":"LARGE(R4:W4,3)","v":100},{"$f":"LARGE(R4:W4,4)","v":100},{"$f":"SUM(Y4:AB4)","v":400},{"$f":"COUNT(F4:Q4)/2","v":6},{"$f":"AC4*10^8+Y4*10^6/2+Z4*10^4/2+AA4*10^2/2+AB4/2","v":40050505050},{"$f":"IF(B4<>\"\",RANK(AE4,AE$4:AE$70,0),\"\")","v":1}]
[2,"Emma Kalvøy Bye","Byåsen IL",300,"F",3,{"$f":"IF(F5>0,INDEX(Poeng!$A$1:$B$100,F5,2),\"\")","v":60},11,{"$f":"IF(H5>0,INDEX(Poeng!$A$1:$B$100,H5,2),\"\")","v":24},1,{"$f":"IF(J5>0,INDEX(Poeng!$A$1:$B$100,J5,2),\"\")","v":100},2,{"$f":"IF(L5>0,INDEX(Poeng!$A$1:$B$100,L5,2),\"\")","v":80},4,{"$f":"IF(N5>0,INDEX(Poeng!$A$1:$B$100,N5,2),\"\")","v":50},3,{"$f":"IF(P5>0,INDEX(Poeng!$A$1:$B$100,P5,2),\"\")","v":60},60,24,100,80,50,60,{"$f":"IF(#REF!>0,#REF!,0)","v":{"$error":"#REF!"}},100,80,60,60,300,6,30050403030,2]
[3,"Una Arnesen Kittelsen","Byaasen Skiklub",260,"F",null,{"$f":"IF(F6>0,INDEX(Poeng!$A$1:$B$100,F6,2),\"\")","v":""},3,{"$f":"IF(H6>0,INDEX(Poeng!$A$1:$B$100,H6,2),\"\")","v":60},3,{"$f":"IF(J6>0,INDEX(Poeng!$A$1:$B$100,J6,2),\"\")","v":60},3,{"$f":"IF(L6>0,INDEX(Poeng!$A$1:$B$100,L6,2),\"\")","v":60},3,{"$f":"IF(N6>0,INDEX(Poeng!$A$1:$B$100,N6,2),\"\")","v":60},2,{"$f":"IF(P6>0,INDEX(Poeng!$A$1:$B$100,P6,2),\"\")","v":80},0,60,60,60,60,80,{"$f":"IF(#REF!>0,#REF!,0)","v":{"$error":"#REF!"}},80,60,60,60,260,5,26040303030,3]
{"$rows_left_out":89}
{"sheet":"G13","index":4,"n_rows":66,"n_cols":32,"rows_kept":66,"cut":false,"hidden":false,"merged":[[0,2,0,16],[1,5,1,6],[1,7,1,8],[1,9,1,10],[1,11,1,12],[1,13,1,14],[1,15,1,16],[2,15,2,16],[2,5,2,6],[2,7,2,8],[2,9,2,10],[2,11,2,12],[2,13,2,14]]}
["Gutter 13",null,"  Sparebank1-CUP 2021"]
[null,null,null,null,null,"SP1- CUP 1 ",null,"SP1- CUP 2 ",null,"SP1- CUP 3",null,"SP1- CUP 4",null,"SP1- CUP 5",null,"SP1- CUP 6",null,"Poeng",null,null,null,null,null,null,"Fire beste",null,null,null,"Sum"]
["Nr","NAVN","KLUBB","POENG","Fullført","Nr.  Poeng ",null,"Nr.  Poeng ",null,"Nr.   Poeng ",null,"Nr.  Poeng ",null,"Nr.  Poeng ",null,"Nr. Poeng ",null,1,2,3,4,5,6,7,1,2,3,4]
[{"$f":"AF4","v":1},"Halvor Sellesbakk","Byåsen IL",{"$f":"IF(B4<>\"\",AC4,\"\")","v":400},{"$f":"IF(AD4<4,\" \",\"F\")","v":"F"},1,{"$f":"IF(F4>0,INDEX(Poeng!$A$1:$B$100,F4,2),\"\")","v":100},1,{"$f":"IF(H4>0,INDEX(Poeng!$A$1:$B$100,H4,2),\"\")","v":100},1,{"$f":"IF(J4>0,INDEX(Poeng!$A$1:$B$100,J4,2),\"\")","v":100},1,{"$f":"IF(L4>0,INDEX(Poeng!$A$1:$B$100,L4,2),\"\")","v":100},1,{"$f":"IF(N4>0,INDEX(Poeng!$A$1:$B$100,N4,2),\"\")","v":100},1,{"$f":"IF(P4>0,INDEX(Poeng!$A$1:$B$100,P4,2),\"\")","v":100},{"$f":"IF(F4>0,G4,0)","v":100},{"$f":"IF(H4>0,I4,0)","v":100},{"$f":"IF(J4>0,K4,0)","v":100},{"$f":"IF(L4>0,M4,0)","v":100},{"$f":"IF(N4>0,O4,0)","v":100},{"$f":"IF(P4>0,Q4,0)","v":100},{"$f":"IF(#REF!>0,#REF!,0)","v":{"$error":"#REF!"}},{"$f":"LARGE(R4:W4,1)","v":100},{"$f":"LARGE(R4:W4,2)","v":100},{"$f":"LARGE(R4:W4,3)","v":100},{"$f":"LARGE(R4:W4,4)","v":100},{"$f":"SUM(Y4:AB4)","v":400},{"$f":"COUNT(F4:Q4)/2","v":6},{"$f":"AC4*10^8+Y4*10^6/2+Z4*10^4/2+AA4*10^2/2+AB4/2","v":40050505050},{"$f":"IF(B4<>\"\",RANK(AE4,AE$4:AE$41,0),\"\")","v":1}]
[2,"Torarin Osland","Byåsen IL",290,"F",2,{"$f":"IF(F5>0,INDEX(Poeng!$A$1:$B$100,F5,2),\"\")","v":80},2,{"$f":"IF(H5>0,INDEX(Poeng!$A$1:$B$100,H5,2),\"\")","v":80},null,{"$f":"IF(J5>0,INDEX(Poeng!$A$1:$B$100,J5,2),\"\")","v":""},null,{"$f":"IF(L5>0,INDEX(Poeng!$A$1:$B$100,L5,2),\"\")","v":""},2,{"$f":"IF(N5>0,INDEX(Poeng!$A$1:$B$100,N5,2),\"\")","v":80},4,{"$f":"IF(P5>0,INDEX(Poeng!$A$1:$B$100,P5,2),\"\")","v":50},80,80,0,0,80,50,{"$f":"IF(#REF!>0,#REF!,0)","v":{"$error":"#REF!"}},80,80,80,50,290,4,29040404025,2]
[3,"Markus Rekstad","Byåsen IL",280,"F",2,{"$f":"IF(F6>0,INDEX(Poeng!$A$1:$B$100,F6,2),\"\")","v":80},5,{"$f":"IF(H6>0,INDEX(Poeng!$A$1:$B$100,H6,2),\"\")","v":45},2,{"$f":"IF(J6>0,INDEX(Poeng!$A$1:$B$100,J6,2),\"\")","v":80},3,{"$f":"IF(L6>0,INDEX(Poeng!$A$1:$B$100,L6,2),\"\")","v":60},3,{"$f":"IF(N6>0,INDEX(Poeng!$A$1:$B$100,N6,2),\"\")","v":60},3,{"$f":"IF(P6>0,INDEX(Poeng!$A$1:$B$100,P6,2),\"\")","v":60},80,45,80,60,60,60,{"$f":"IF(#REF!>0,#REF!,0)","v":{"$error":"#REF!"}},80,80,60,60,280,6,28040403030,3]
{"$rows_left_out":61}
{"sheet":"G14","index":5,"n_rows":80,"n_cols":31,"rows_kept":80,"cut":false,"hidden":false,"merged":[[0,2,0,16],[1,5,1,6],[1,7,1,8],[1,9,1,10],[1,11,1,12],[1,13,1,14],[1,15,1,16],[2,15,2,16],[2,5,2,6],[2,7,2,8],[2,9,2,10],[2,11,2,12],[2,13,2,14]]}
["Gutter 14",null,"  Sparebank1-CUP 2021"]
[null,null,null,null,null,"SP1- CUP 1 ",null,"SP1- CUP 2 ",null,"SP1- CUP 3",null,"SP1- CUP 4",null,"SP1- CUP 5",null,"SP1- CUP 6",null,"Poeng",null,null,null,null,null,"Fire beste",null,null,null,"Sum"]
["Nr","NAVN","KLUBB","POENG","Fullført","Nr.  Poeng ",null,"Nr.  Poeng ",null,"Nr.   Poeng ",null,"Nr.  Poeng ",null,"Nr.  Poeng ",null,"Nr. Poeng "]
[{"$f":"AE4","v":1},"Henrik Garmo Hov","Byåsen IL",{"$f":"IF(B4<>\"\",AB4,\"\")","v":380},{"$f":"IF(AC4<4,\" \",\"F\")","v":"F"},1,{"$f":"IF(F4>0,INDEX(Poeng!$A$1:$B$100,F4,2),\"\")","v":100},1,{"$f":"IF(H4>0,INDEX(Poeng!$A$1:$B$100,H4,2),\"\")","v":100},1,{"$f":"IF(J4>0,INDEX(Poeng!$A$1:$B$100,J4,2),\"\")","v":100},3,{"$f":"IF(L4>0,INDEX(Poeng!$A$1:$B$100,L4,2),\"\")","v":60},2,{"$f":"IF(N4>0,INDEX(Poeng!$A$1:$B$100,N4,2),\"\")","v":80},2,{"$f":"IF(P4>0,INDEX(Poeng!$A$1:$B$100,P4,2),\"\")","v":80},{"$f":"IF(F4>0,G4,0)","v":100},{"$f":"IF(H4>0,I4,0)","v":100},{"$f":"IF(J4>0,K4,0)","v":100},{"$f":"IF(L4>0,M4,0)","v":60},{"$f":"IF(N4>0,O4,0)","v":80},{"$f":"IF(P4>0,Q4,0)","v":80},{"$f":"LARGE(R4:W4,1)","v":100},{"$f":"LARGE(R4:W4,2)","v":100},{"$f":"LARGE(R4:W4,3)","v":100},{"$f":"LARGE(R4:W4,4)","v":80},{"$f":"SUM(X4:AA4)","v":380},{"$f":"COUNT(F4:Q4)/2","v":6},{"$f":"AB4*10^8+X4*10^6/2+Y4*10^4/2+Z4*10^2/2+AA4/2","v":38050505040},{"$f":"IF(B4<>\"\",RANK(AD4,AD$4:AD$55,0),\"\")","v":1}]
[1,"Iver Lund Gjerde","Byåsen IL",380,"F",2,{"$f":"IF(F5>0,INDEX(Poeng!$A$1:$B$100,F5,2),\"\")","v":80},1,{"$f":"IF(H5>0,INDEX(Poeng!$A$1:$B$100,H5,2),\"\")","v":100},5,{"$f":"IF(J5>0,INDEX(Poeng!$A$1:$B$100,J5,2),\"\")","v":45},1,{"$f":"IF(L5>0,INDEX(Poeng!$A$1:$B$100,L5,2),\"\")","v":100},1,{"$f":"IF(N5>0,INDEX(Poeng!$A$1:$B$100,N5,2),\"\")","v":100},3,{"$f":"IF(P5>0,INDEX(Poeng!$A$1:$B$100,P5,2),\"\")","v":60},80,100,45,100,100,60,100,100,100,80,380,6,38050505040,1]
[3,"Håkon Bøklep","Surnadal IL",300,"F",3,{"$f":"IF(F6>0,INDEX(Poeng!$A$1:$B$100,F6,2),\"\")","v":60},3,{"$f":"IF(H6>0,INDEX(Poeng!$A$1:$B$100,H6,2),\"\")","v":60},3,{"$f":"IF(J6>0,INDEX(Poeng!$A$1:$B$100,J6,2),\"\")","v":60},2,{"$f":"IF(L6>0,INDEX(Poeng!$A$1:$B$100,L6,2),\"\")","v":80},4,{"$f":"IF(N6>0,INDEX(Poeng!$A$1:$B$100,N6,2),\"\")","v":50},1,{"$f":"IF(P6>0,INDEX(Poeng!$A$1:$B$100,P6,2),\"\")","v":100},60,60,60,80,50,100,100,80,60,60,300,6,30050403030,3]
{"$rows_left_out":75}
{"sheet":"G15","index":6,"n_rows":76,"n_cols":31,"rows_kept":76,"cut":false,"hidden":false,"merged":[[0,2,0,16],[1,5,1,6],[1,7,1,8],[1,9,1,10],[1,11,1,12],[1,13,1,14],[1,15,1,16],[2,15,2,16],[2,5,2,6],[2,7,2,8],[2,9,2,10],[2,11,2,12],[2,13,2,14]]}
["Gutter 15",null,"  Sparebank1-CUP 2021"]
[null,null,null,null,null,"SP1- CUP 1 ",null,"SP1- CUP 2 ",null,"SP1- CUP 3",null,"SP1- CUP 4",null,"SP1- CUP 5",null,"SP1- CUP 6",null,"Poeng",null,null,null,null,null,"Fire beste",null,null,null,"Sum"]
["Nr","NAVN","KLUBB","POENG","Fullført","Nr.  Poeng ",null,"Nr.  Poeng ",null,"Nr.   Poeng ",null,"Nr.  Poeng ",null,"Nr.  Poeng ",null,"Nr. Poeng ",null,1,2,3,4,5,6,1,2,3,4]
[{"$f":"AE4","v":1},"Halvor Kvennås","Byåsen IL",{"$f":"IF(B4<>\"\",AB4,\"\")","v":360},{"$f":"IF(AC4<4,\" \",\"F\")","v":"F"},5,{"$f":"IF(F4>0,INDEX(Poeng!$A$1:$B$100,F4,2),\"\")","v":45},1,{"$f":"IF(H4>0,INDEX(Poeng!$A$1:$B$100,H4,2),\"\")","v":100},3,{"$f":"IF(J4>0,INDEX(Poeng!$A$1:$B$100,J4,2),\"\")","v":60},1,{"$f":"IF(L4>0,INDEX(Poeng!$A$1:$B$100,L4,2),\"\")","v":100},1,{"$f":"IF(N4>0,INDEX(Poeng!$A$1:$B$100,N4,2),\"\")","v":100},4,{"$f":"IF(P4>0,INDEX(Poeng!$A$1:$B$100,P4,2),\"\")","v":50},{"$f":"IF(F4>0,G4,0)","v":45},{"$f":"IF(H4>0,I4,0)","v":100},{"$f":"IF(J4>0,K4,0)","v":60},{"$f":"IF(L4>0,M4,0)","v":100},{"$f":"IF(N4>0,O4,0)","v":100},{"$f":"IF(P4>0,Q4,0)","v":50},{"$f":"LARGE(R4:W4,1)","v":100},{"$f":"LARGE(R4:W4,2)","v":100},{"$f":"LARGE(R4:W4,3)","v":100},{"$f":"LARGE(R4:W4,4)","v":60},{"$f":"SUM(X4:AA4)","v":360},{"$f":"COUNT(F4:Q4)/2","v":6},{"$f":"AB4*10^8+X4*10^6/2+Y4*10^4/2+Z4*10^2/2+AA4/2","v":36050505030},{"$f":"IF(B4<>\"\",RANK(AD4,AD$4:AD$51,0),\"\")","v":1}]
[2,"Olav Fugelsøy","Surnadal IL",340,"F",4,{"$f":"IF(F5>0,INDEX(Poeng!$A$1:$B$100,F5,2),\"\")","v":50},1,{"$f":"IF(H5>0,INDEX(Poeng!$A$1:$B$100,H5,2),\"\")","v":100},13,{"$f":"IF(J5>0,INDEX(Poeng!$A$1:$B$100,J5,2),\"\")","v":20},3,{"$f":"IF(L5>0,INDEX(Poeng!$A$1:$B$100,L5,2),\"\")","v":60},2,{"$f":"IF(N5>0,INDEX(Poeng!$A$1:$B$100,N5,2),\"\")","v":80},1,{"$f":"IF(P5>0,INDEX(Poeng!$A$1:$B$100,P5,2),\"\")","v":100},50,100,20,60,80,100,100,100,80,60,340,6,34050504030,2]
[3,"Benjamin Kulsetås","Strindheim IL ",245,"F",3,{"$f":"IF(F6>0,INDEX(Poeng!$A$1:$B$100,F6,2),\"\")","v":60},5,{"$f":"IF(H6>0,INDEX(Poeng!$A$1:$B$100,H6,2),\"\")","v":45},1,{"$f":"IF(J6>0,INDEX(Poeng!$A$1:$B$100,J6,2),\"\")","v":100},6,{"$f":"IF(L6>0,INDEX(Poeng!$A$1:$B$100,L6,2),\"\")","v":40},null,{"$f":"IF(N6>0,INDEX(Poeng!$A$1:$B$100,N6,2),\"\")","v":""},null,{"$f":"IF(P6>0,INDEX(Poeng!$A$1:$B$100,P6,2),\"\")","v":""},60,45,100,40,0,0,100,60,45,40,245,4,24550302270,3]
{"$rows_left_out":71}
{"sheet":"G16","index":7,"n_rows":87,"n_cols":32,"rows_kept":87,"cut":false,"hidden":false,"merged":[[0,2,0,16],[1,5,1,6],[1,7,1,8],[1,9,1,10],[1,11,1,12],[1,13,1,14],[1,15,1,16],[2,15,2,16],[2,5,2,6],[2,7,2,8],[2,9,2,10],[2,11,2,12],[2,13,2,14]]}
["Gutter 16",null,"  Sparebank1-CUP 2021"]
[null,null,null,null,null,"SP1- CUP 1 ",null,"SP1- CUP 2 ",null,"SP1- CUP 3",null,"SP1- CUP 4",null,"SP1- CUP 5",null,"SP1- CUP 6",null,"Poeng",null,null,null,null,null,null,"Fire beste",null,null,null,"Sum"]
["Nr","NAVN","KLUBB","POENG","Fullført","Nr.  Poeng ",null,"Nr.  Poeng ",null,"Nr.   Poeng ",null,"Nr.  Poeng ",null,"Nr.  Poeng ",null,"Nr. Poeng ",null,1,2,3,4,5,6,7,1,2,3,4]
[{"$f":"AF4","v":1},"Adrian Cornelius Kaasbøll","Byåsen IL",{"$f":"IF(B4<>\"\",AC4,\"\")","v":400},{"$f":"IF(AD4<4,\" \",\"F\")","v":"F"},1,{"$f":"IF(F4>0,INDEX(Poeng!$A$1:$B$100,F4,2),\"\")","v":100},1,{"$f":"IF(H4>0,INDEX(Poeng!$A$1:$B$100,H4,2),\"\")","v":100},1,{"$f":"IF(J4>0,INDEX(Poeng!$A$1:$B$100,J4,2),\"\")","v":100},1,{"$f":"IF(L4>0,INDEX(Poeng!$A$1:$B$100,L4,2),\"\")","v":100},1,{"$f":"IF(N4>0,INDEX(Poeng!$A$1:$B$100,N4,2),\"\")","v":100},1,{"$f":"IF(P4>0,INDEX(Poeng!$A$1:$B$100,P4,2),\"\")","v":100},{"$f":"IF(F4>0,G4,0)","v":100},{"$f":"IF(H4>0,I4,0)","v":100},{"$f":"IF(J4>0,K4,0)","v":100},{"$f":"IF(L4>0,M4,0)","v":100},{"$f":"IF(N4>0,O4,0)","v":100},{"$f":"IF(P4>0,Q4,0)","v":100},{"$f":"IF(#REF!>0,#REF!,0)","v":{"$error":"#REF!"}},{"$f":"LARGE(R4:W4,1)","v":100},{"$f":"LARGE(R4:W4,2)","v":100},{"$f":"LARGE(R4:W4,3)","v":100},{"$f":"LARGE(R4:W4,4)","v":100},{"$f":"SUM(Y4:AB4)","v":400},{"$f":"COUNT(F4:Q4)/2","v":6},{"$f":"AC4*10^8+Y4*10^6/2+Z4*10^4/2+AA4*10^2/2+AB4/2","v":40050505050},{"$f":"IF(B4<>\"\",RANK(AE4,AE$4:AE$62,0),\"\")","v":1}]
[2,"Niklas Almås","Byåsen IL",300,"F",2,{"$f":"IF(F5>0,INDEX(Poeng!$A$1:$B$100,F5,2),\"\")","v":80},2,{"$f":"IF(H5>0,INDEX(Poeng!$A$1:$B$100,H5,2),\"\")","v":80},4,{"$f":"IF(J5>0,INDEX(Poeng!$A$1:$B$100,J5,2),\"\")","v":50},3,{"$f":"IF(L5>0,INDEX(Poeng!$A$1:$B$100,L5,2),\"\")","v":60},2,{"$f":"IF(N5>0,INDEX(Poeng!$A$1:$B$100,N5,2),\"\")","v":80},3,{"$f":"IF(P5>0,INDEX(Poeng!$A$1:$B$100,P5,2),\"\")","v":60},80,80,50,60,80,60,{"$f":"IF(#REF!>0,#REF!,0)","v":{"$error":"#REF!"}},80,80,80,60,300,6,30040404030,2]
[2,"Nikolai Fossum","Byåsen IL",300,"F",6,{"$f":"IF(F6>0,INDEX(Poeng!$A$1:$B$100,F6,2),\"\")","v":40},3,{"$f":"IF(H6>0,INDEX(Poeng!$A$1:$B$100,H6,2),\"\")","v":60},2,{"$f":"IF(J6>0,INDEX(Poeng!$A$1:$B$100,J6,2),\"\")","v":80},2,{"$f":"IF(L6>0,INDEX(Poeng!$A$1:$B$100,L6,2),\"\")","v":80},6,{"$f":"IF(N6>0,INDEX(Poeng!$A$1:$B$100,N6,2),\"\")","v":40},2,{"$f":"IF(P6>0,INDEX(Poeng!$A$1:$B$100,P6,2),\"\")","v":80},40,60,80,80,40,80,{"$f":"IF(#REF!>0,#REF!,0)","v":{"$error":"#REF!"}},80,80,80,60,300,6,30040404030,2]
{"$rows_left_out":82}
{"sheet":"Poeng","index":8,"n_rows":100,"n_cols":2,"rows_kept":100,"cut":false,"hidden":false,"merged":[]}
[1,100]
[2,80]
[3,60]
[4,50]
[5,45]
[6,40]
{"$rows_left_out":94}