{"text_format":"1","workbook":"xlsx","n_sheets":9,"sheets":["J13","J14","J15","J16","G13","G14","G15","G16","Poeng"],"not_rendered":{"charts":0,"images":0,"macros":1,"external_links":0,"defined_names":15,"comments":1,"pivot_tables":0},"unopened":[],"bounds":{"document_bytes":16777216,"sheet_cells":100000,"rows_first":2000,"rows_last":500,"rows_between":2000,"halvings":0,"cell_chars":16384,"cell_head_chars":4096},"cells_cut":0,"cells_raw":0,"read":"whole","date_system":"1900"}

{"sheet":"J13","index":0,"n_rows":97,"n_cols":32,"rows_kept":97,"cut":false,"hidden":false,"merged":[[0,2,0,16],[1,5,1,6],[1,7,1,8],[1,9,1,10],[1,11,1,12],[1,13,1,14],[1,15,1,16],[2,15,2,16],[2,5,2,6],[2,7,2,8],[2,9,2,10],[2,11,2,12],[2,13,2,14]]}
["Jenter 13",null,"  Sparebank1-CUP 2021"]
[null,null,null,null,null,"SP1- CUP 1 ",null,"SP1- CUP 2 ",null,"SP1- CUP 3",null,"SP1- CUP 4",null,"SP1- CUP 5",null,"SP1- CUP 6",null,"Poeng",null,null,null,null,null,null,"Fire beste",null,null,null,"Sum"]
["Nr","NAVN","KLUBB","POENG","Fullført","Nr.  Poeng ",null,"Nr.  Poeng ",null,"Nr.   Poeng ",null,"Nr.  Poeng ",null,"Nr.  Poeng ",null,"Nr. Poeng ",null,1,2,3,4,5,6,7,1,2,3,4]
[{"$f":"AF4","v":1},"Hanna Fløttum Bones","Rognes IL",{"$f":"IF(B4<>\"\",AC4,\"\")","v":380},{"$f":"IF(AD4<4,\" \",\"F\")","v":"F"},1,{"$f":"IF(F4>0,INDEX(Poeng!$A$1:$B$100,F4,2),\"\")","v":100},3,{"$f":"IF(H4>0,INDEX(Poeng!$A$1:$B$100,H4,2),\"\")","v":60},1,{"$f":"IF(J4>0,INDEX(Poeng!$A$1:$B$100,J4,2),\"\")","v":100},1,{"$f":"IF(L4>0,INDEX(Poeng!$A$1:$B$100,L4,2),\"\")","v":100},3,{"$f":"IF(N4>0,INDEX(Poeng!$A$1:$B$100,N4,2),\"\")","v":60},2,{"$f":"IF(P4>0,INDEX(Poeng!$A$1:$B$100,P4,2),\"\")","v":80},{"$f":"IF(F4>0,G4,0)","v":100},{"$f":"IF(H4>0,I4,0)","v":60},{"$f":"IF(J4>0,K4,0)","v":100},{"$f":"IF(L4>0,M4,0)","v":100},{"$f":"IF(N4>0,O4,0)","v":60},{"$f":"IF(P4>0,Q4,0)","v":80},{"$f":"IF(#REF!>0,#REF!,0)","v":{"$error":"#REF!"}},{"$f":"LARGE(R4:W4,1)","v":100},{"$f":"LARGE(R4:W4,2)","v":100},{"$f":"LARGE(R4:W4,3)","v":100},{"$f":"LARGE(R4:W4,4)","v":80},{"$f":"SUM(Y4:AB4)","v":380},{"$f":"COUNT(F4:Q4)/2","v":6},{"$f":"AC4*10^8+Y4*10^6/2+Z4*10^4/2+AA4*10^2/2+AB4/2","v":38050505040},{"$f":"IF(B4<>\"\",RANK(AE4,AE$4:AE$72,0),\"\")","v":1}]
[2,"Marie Furuhaug","Byåsen IL",360,"F",2,{"$f":"IF(F5>0,INDEX(Poeng!$A$1:$B$100,F5,2),\"\")","v":80},1,{"$f":"IF(H5>0,INDEX(Poeng!$A$1:$B$100,H5,2),\"\")","v":100},2,{"$f":"IF(J5>0,INDEX(Poeng!$A$1:$B$100,J5,2),\"\")","v":80},2,{"$f":"IF(L5>0,INDEX(Poeng!$A$1:$B$100,L5,2),\"\")","v":80},2,{"$f":"IF(N5>0,INDEX(Poeng!$A$1:$B$100,N5,2),\"\")","v":80},1,{"$f":"IF(P5>0,INDEX(Poeng!$A$1:$B$100,P5,2),\"\")","v":100},80,100,80,80,80,100,{"$f":"IF(#REF!>0,#REF!,0)","v":{"$error":"#REF!"}},100,100,80,80,360,6,36050504040,2]
[3,"Karianne Sundset","Klæbu IL",260,"F",4,{"$f":"IF(F6>0,INDEX(Poeng!$A$1:$B$100,F6,2),\"\")","v":50},4,{"$f":"IF(H6>0,INDEX(Poeng!$A$1:$B$100,H6,2),\"\")","v":50},3,{"$f":"IF(J6>0,INDEX(Poeng!$A$1:$B$100,J6,2),\"\")","v":60},4,{"$f":"IF(L6>0,INDEX(Poeng!$A$1:$B$100,L6,2),\"\")","v":50},1,{"$f":"IF(N6>0,INDEX(Poeng!$A$1:$B$100,N6,2),\"\")","v":100},4,{"$f":"IF(P6>0,INDEX(Poeng!$A$1:$B$100,P6,2),\"\")","v":50},50,50,60,50,100,50,{"$f":"IF(#REF!>0,#REF!,0)","v":{"$error":"#REF!"}},100,60,50,50,260,6,26050302525,3]
[4,"Vilde Nordgård Leiren","Byåsen IL",235,"F",5,{"$f":"IF(F7>0,INDEX(Poeng!$A$1:$B$100,F7,2),\"\")","v":45},2,{"$f":"IF(H7>0,INDEX(Poeng!$A$1:$B$100,H7,2),\"\")","v":80},6,{"$f":"IF(J7>0,INDEX(Poeng!$A$1:$B$100,J7,2),\"\")","v":40},3,{"$f":"IF(L7>0,INDEX(Poeng!$A$1:$B$100,L7,2),\"\")","v":60},4,{"$f":"IF(N7>0,INDEX(Poeng!$A$1:$B$100,N7,2),\"\")","v":50},5,{"$f":"IF(P7>0,INDEX(Poeng!$A$1:$B$100,P7,2),\"\")","v":45},45,80,40,60,50,45,{"$f":"IF(#REF!>0,#REF!,0)","v":{"$error":"#REF!"}},80,60,50,45,235,6,23540302522.5,4]
[5,"Erle Heksem Kjellås","Buvik IL",215,"F",3,{"$f":"IF(F8>0,INDEX(Poeng!$A$1:$B$100,F8,2),\"\")","v":60},6,{"$f":"IF(H8>0,INDEX(Poeng!$A$1:$B$100,H8,2),\"\")","v":40},4,{"$f":"IF(J8>0,INDEX(Poeng!$A$1:$B$100,J8,2),\"\")","v":50},6,{"$f":"IF(L8>0,INDEX(Poeng!$A$1:$B$100,L8,2),\"\")","v":40},5,{"$f":"IF(N8>0,INDEX(Poeng!$A$1:$B$100,N8,2),\"\")","v":45},3,{"$f":"IF(P8>0,INDEX(Poeng!$A$1:$B$100,P8,2),\"\")","v":60},60,40,50,40,45,60,{"$f":"IF(#REF!>0,#REF!,0)","v":{"$error":"#REF!"}},60,60,50,45,215,6,21530302522.5,5]
[6,"Malin Lorvik Krogh","Byåsen IL",165,"F",6,{"$f":"IF(F9>0,INDEX(Poeng!$A$1:$B$100,F9,2),\"\")","v":40},5,{"$f":"IF(H9>0,INDEX(Poeng!$A$1:$B$100,H9,2),\"\")","v":45},7,{"$f":"IF(J9>0,INDEX(Poeng!$A$1:$B$100,J9,2),\"\")","v":36},8,{"$f":"IF(L9>0,INDEX(Poeng!$A$1:$B$100,L9,2),\"\")","v":32},6,{"$f":"IF(N9>0,INDEX(Poeng!$A$1:$B$100,N9,2),\"\")","v":40},6,{"$f":"IF(P9>0,INDEX(Poeng!$A$1:$B$100,P9,2),\"\")","v":40},40,45,36,32,40,40,{"$f":"IF(#REF!>0,#REF!,0)","v":{"$error":"#REF!"}},45,40,40,40,165,6,16522702020,6]
[7,"Celine Storø","Hommelvik IL",143,"F",7,{"$f":"IF(F10>0,INDEX(Poeng!$A$1:$B$100,F10,2),\"\")","v":36},null,{"$f":"IF(H10>0,INDEX(Poeng!$A$1:$B$100,H10,2),\"\")","v":""},5,{"$f":"IF(J10>0,INDEX(Poeng!$A$1:$B$100,J10,2),\"\")","v":45},null,{"$f":"IF(L10>0,INDEX(Poeng!$A$1:$B$100,L10,2),\"\")","v":""},7,{"$f":"IF(N10>0,INDEX(Poeng!$A$1:$B$100,N10,2),\"\")","v":36},10,{"$f":"IF(P10>0,INDEX(Poeng!$A$1:$B$100,P10,2),\"\")","v":26},36,0,45,0,36,26,{"$f":"IF(#REF!>0,#REF!,0)","v":{"$error":"#REF!"}},45,36,36,26,143,4,14322681813,7]
[8,"Johanne Jensås","Ranheim SK",132,"F",8,{"$f":"IF(F11>0,INDEX(Poeng!$A$1:$B$100,F11,2),\"\")","v":32},null,{"$f":"IF(H11>0,INDEX(Poeng!$A$1:$B$100,H11,2),\"\")","v":""},8,{"$f":"IF(J11>0,INDEX(Poeng!$A$1:$B$100,J11,2),\"\")","v":32},null,{"$f":"IF(L11>0,INDEX(Poeng!$A$1:$B$100,L11,2),\"\")","v":""},8,{"$f":"IF(N11>0,INDEX(Poeng!$A$1:$B$100,N11,2),\"\")","v":32},7,{"$f":"IF(P11>0,INDEX(Poeng!$A$1:$B$100,P11,2),\"\")","v":36},32,0,32,0,32,36,{"$f":"IF(#REF!>0,#REF!,0)","v":{"$error":"#REF!"}},36,32,32,32,132,4,13218161616,8]
[9,"Mina Helene Nordgård ","Hommelvik IL",126,"F",12,{"$f":"IF(F12>0,INDEX(Poeng!$A$1:$B$100,F12,2),\"\")","v":22},7,{"$f":"IF(H12>0,INDEX(Poeng!$A$1:$B$100,H12,2),\"\")","v":36},11,{"$f":"IF(J12>0,INDEX(Poeng!$A$1:$B$100,J12,2),\"\")","v":24},9,{"$f":"IF(L12>0,INDEX(Poeng!$A$1:$B$100,L12,2),\"\")","v":29},9,{"$f":"IF(N12>0,INDEX(Poeng!$A$1:$B$100,N12,2),\"\")","v":29},8,{"$f":"IF(P12>0,INDEX(Poeng!$A$1:$B$100,P12,2),\"\")","v":32},22,36,24,29,29,32,{"$f":"IF(#REF!>0,#REF!,0)","v":{"$error":"#REF!"}},36,32,29,29,126,6,12618161464.5,9]
[10,"Tuva Skimmeli Halvorsen","Buvik IL",107,"F",10,{"$f":"IF(F13>0,INDEX(Poeng!$A$1:$B$100,F13,2),\"\")","v":26},9,{"$f":"IF(H13>0,INDEX(Poeng!$A$1:$B$100,H13,2),\"\")","v":29},10,{"$f":"IF(J13>0,INDEX(Poeng!$A$1:$B$100,J13,2),\"\")","v":26},null,{"$f":"IF(L13>0,INDEX(Poeng!$A$1:$B$100,L13,2),\"\")","v":""},10,{"$f":"IF(N13>0,INDEX(Poeng!$A$1:$B$100,N13,2),\"\")","v":26},13,{"$f":"IF(P13>0,INDEX(Poeng!$A$1:$B$100,P13,2),\"\")","v":20},26,29,26,0,26,20,{"$f":"IF(#REF!>0,#REF!,0)","v":{"$error":"#REF!"}},29,26,26,26,107,5,10714631313,10]
[11,"Selma Lorvik Krogh","Byåsen IL",106,"F",11,{"$f":"IF(F14>0,INDEX(Poeng!$A$1:$B$100,F14,2),\"\")","v":24},8,{"$f":"IF(H14>0,INDEX(Poeng!$A$1:$B$100,H14,2),\"\")","v":32},12,{"$f":"IF(J14>0,INDEX(Poeng!$A$1:$B$100,J14,2),\"\")","v":22},10,{"$f":"IF(L14>0,INDEX(Poeng!$A$1:$B$100,L14,2),\"\")","v":26},11,{"$f":"IF(N14>0,INDEX(Poeng!$A$1:$B$100,N14,2),\"\")","v":24},11,{"$f":"IF(P14>0,INDEX(Poeng!$A$1:$B$100,P14,2),\"\")","v":24},24,32,22,26,24,24,{"$f":"IF(#REF!>0,#REF!,0)","v":{"$error":"#REF!"}},32,26,24,24,106,6,10616131212,11]
[12,"Thea Moen","Hommelvik IL",58," ",null,{"$f":"IF(F15>0,INDEX(Poeng!$A$1:$B$100,F15,2),\"\")","v":""},null,{"$f":"IF(H15>0,INDEX(Poeng!$A$1:$B$100,H15,2),\"\")","v":""},9,{"$f":"IF(J15>0,INDEX(Poeng!$A$1:$B$100,J15,2),\"\")","v":29},null,{"$f":"IF(L15>0,INDEX(Poeng!$A$1:$B$100,L15,2),\"\")","v":""},null,{"$f":"IF(N15>0,INDEX(Poeng!$A$1:$B$100,N15,2),\"\")","v":""},9,{"$f":"IF(P15>0,INDEX(Poeng!$A$1:$B$100,P15,2),\"\")","v":29},0,0,29,0,0,29,{"$f":"IF(#REF!>0,#REF!,0)","v":{"$error":"#REF!"}},29,29,0,0,58,2,5814645000,12]
[13,"Frida Wangberg Lund","Lånke IL",45," ",null,{"$f":"IF(F16>0,INDEX(Poeng!$A$1:$B$100,F16,2),\"\")","v":""},null,null,null,{"$f":"IF(J16>0,INDEX(Poeng!$A$1:$B$100,J16,2),\"\")","v":""},5,{"$f":"IF(L16>0,INDEX(Poeng!$A$1:$B$100,L16,2),\"\")","v":45},null,{"$f":"IF(N16>0,INDEX(Poeng!$A$1:$B$100,N16,2),\"\")","v":""},null,{"$f":"IF(P16>0,INDEX(Poeng!$A$1:$B$100,P16,2),\"\")","v":""},0,0,0,45,0,0,{"$f":"IF(#REF!>0,#REF!,0)","v":{"$error":"#REF!"}},45,0,0,0,45,1,4522500000,13]
[14,"Hennie Margrete Haram","Strindheim IL ",42," ",13,{"$f":"IF(F17>0,INDEX(Poeng!$A$1:$B$100,F17,2),\"\")","v":20},null,{"$f":"IF(H17>0,INDEX(Poeng!$A$1:$B$100,H17,2),\"\")","v":""},null,{"$f":"IF(J17>0,INDEX(Poeng!$A$1:$B$100,J17,2),\"\")","v":""},null,{"$f":"IF(L17>0,INDEX(Poeng!$A$1:$B$100,L17,2),\"\")","v":""},null,{"$f":"IF(N17>0,INDEX(Poeng!$A$1:$B$100,N17,2),\"\")","v":""},12,{"$f":"IF(P17>0,INDEX(Poeng!$A$1:$B$100,P17,2),\"\")","v":22},20,0,0,0,0,22,{"$f":"IF(#REF!>0,#REF!,0)","v":{"$error":"#REF!"}},22,20,0,0,42,2,4211100000,14]
[15,"Thea Marie Vesterfjell","Byaasen skiklub",36," ",null,{"$f":"IF(F18>0,INDEX(Poeng!$A$1:$B$100,F18,2),\"\")","v":""},null,{"$f":"IF(H18>0,INDEX(Poeng!$A$1:$B$100,H18,2),\"\")","v":""},null,{"$f":"IF(J18>0,INDEX(Poeng!$A$1:$B$100,J18,2),\"\")","v":""},7,{"$f":"IF(L18>0,INDEX(Poeng!$A$1:$B$100,L18,2),\"\")","v":36},null,{"$f":"IF(N18>0,INDEX(Poeng!$A$1:$B$100,N18,2),\"\")","v":""},null,{"$f":"IF(P18>0,INDEX(Poeng!$A$1:$B$100,P18,2),\"\")","v":""},0,0,0,36,0,0,{"$f":"IF(#REF!>0,#REF!,0)","v":{"$error":"#REF!"}},36,0,0,0,36,1,3618000000,15]
[16,"Asta Wekre","Heimdal Ski",29," ",9,{"$f":"IF(F19>0,INDEX(Poeng!$A$1:$B$100,F19,2),\"\")","v":29},null,{"$f":"IF(H19>0,INDEX(Poeng!$A$1:$B$100,H19,2),\"\")","v":""},null,{"$f":"IF(J19>0,INDEX(Poeng!$A$1:$B$100,J19,2),\"\")","v":""},null,{"$f":"IF(L19>0,INDEX(Poeng!$A$1:$B$100,L19,2),\"\")","v":""},null,{"$f":"IF(N19>0,INDEX(Poeng!$A$1:$B$100,N19,2),\"\")","v":""},null,{"$f":"IF(P19>0,INDEX(Poeng!$A$1:$B$100,P19,2),\"\")","v":""},29,0,0,0,0,0,{"$f":"IF(#REF!>0,#REF!,0)","v":{"$error":"#REF!"}},29,0,0,0,29,1,2914500000,16]
[{"$f":"AF20","v":""},null,null,{"$f":"IF(B20<>\"\",AC20,\"\")","v":""},{"$f":"IF(AD20<4,\" \",\"F\")","v":" "},null,{"$f":"IF(F20>0,INDEX(Poeng!$A$1:$B$100,F20,2),\"\")","v":""},null,{"$f":"IF(H20>0,INDEX(Poeng!$A$1:$B$100,H20,2),\"\")","v":""},null,{"$f":"IF(J20>0,INDEX(Poeng!$A$1:$B$100,J20,2),\"\")","v":""},null,{"$f":"IF(L20>0,INDEX(Poeng!$A$1:$B$100,L20,2),\"\")","v":""},null,{"$f":"IF(N20>0,INDEX(Poeng!$A$1:$B$100,N20,2),\"\")","v":""},null,{"$f":"IF(P20>0,INDEX(Poeng!$A$1:$B$100,P20,2),\"\")","v":""},0,0,0,0,0,0,{"$f":"IF(#REF!>0,#REF!,0)","v":{"$error":"#REF!"}},0,0,0,0,0,0,0,""]
["",null,null,""," ",null,{"$f":"IF(F21>0,INDEX(Poeng!$A$1:$B$100,F21,2),\"\")","v":""},null,{"$f":"IF(H21>0,INDEX(Poeng!$A$1:$B$100,H21,2),\"\")","v":""},null,{"$f":"IF(J21>0,INDEX(Poeng!$A$1:$B$100,J21,2),\"\")","v":""},null,{"$f":"IF(L21>0,INDEX(Poeng!$A$1:$B$100,L21,2),\"\")","v":""},null,{"$f":"IF(N21>0,INDEX(Poeng!$A$1:$B$100,N21,2),\"\")","v":""},null,{"$f":"IF(P21>0,INDEX(Poeng!$A$1:$B$100,P21,2),\"\")","v":""},0,0,0,0,0,0,{"$f":"IF(#REF!>0,#REF!,0)","v":{"$error":"#REF!"}},0,0,0,0,0,0,0,""]
["",null,null,""," ",null,{"$f":"IF(F22>0,INDEX(Poeng!$A$1:$B$100,F22,2),\"\")","v":""},null,{"$f":"IF(H22>0,INDEX(Poeng!$A$1:$B$100,H22,2),\"\")","v":""},null,{"$f":"IF(J22>0,INDEX(Poeng!$A$1:$B$100,J22,2),\"\")","v":""},null,{"$f":"IF(L22>0,INDEX(Poeng!$A$1:$B$100,L22,2),\"\")","v":""},null,{"$f":"IF(N22>0,INDEX(Poeng!$A$1:$B$100,N22,2),\"\")","v":""},null,{"$f":"IF(P22>0,INDEX(Poeng!$A$1:$B$100,P22,2),\"\")","v":""},0,0,0,0,0,0,{"$f":"IF(#REF!>0,#REF!,0)","v":{"$error":"#REF!"}},0,0,0,0,0,0,0,""]
[{"$f":"AF23","v":""},null,null,{"$f":"IF(B23<>\"\",AC23,\"\")","v":""},{"$f":"IF(AD23<4,\" \",\"F\")","v":" "},null,{"$f":"IF(F23>0,INDEX(Poeng!$A$1:$B$100,F23,2),\"\")","v":""},null,{"$f":"IF(H23>0,INDEX(Poeng!$A$1:$B$100,H23,2),\"\")","v":""},null,{"$f":"IF(J23>0,INDEX(Poeng!$A$1:$B$100,J23,2),\"\")","v":""},null,{"$f":"IF(L23>0,INDEX(Poeng!$A$1:$B$100,L23,2),\"\")","v":""},null,{"$f":"IF(N23>0,INDEX(Poeng!$A$1:$B$100,N23,2),\"\")","v":""},null,{"$f":"IF(P23>0,INDEX(Poeng!$A$1:$B$100,P23,2),\"\")","v":""},0,0,0,0,0,0,{"$f":"IF(#REF!>0,#REF!,0)","v":{"$error":"#REF!"}},0,0,0,0,0,0,0,""]
["",null,null,""," ",null,{"$f":"IF(F24>0,INDEX(Poeng!$A$1:$B$100,F24,2),\"\")","v":""},null,{"$f":"IF(H24>0,INDEX(Poeng!$A$1:$B$100,H24,2),\"\")","v":""},null,{"$f":"IF(J24>0,INDEX(Poeng!$A$1:$B$100,J24,2),\"\")","v":""},null,{"$f":"IF(L24>0,INDEX(Poeng!$A$1:$B$100,L24,2),\"\")","v":""},null,{"$f":"IF(N24>0,INDEX(Poeng!$A$1:$B$100,N24,2),\"\")","v":""},null,{"$f":"IF(P24>0,INDEX(Poeng!$A$1:$B$100,P24,2),\"\")","v":""},0,0,0,0,0,0,{"$f":"IF(#REF!>0,#REF!,0)","v":{"$error":"#REF!"}},0,0,0,0,0,0,0,""]
["",null,null,""," ",null,{"$f":"IF(F25>0,INDEX(Poeng!$A$1:$B$100,F25,2),\"\")","v":""},null,{"$f":"IF(H25>0,INDEX(Poeng!$A$1:$B$100,H25,2),\"\")","v":""},null,{"$f":"IF(J25>0,INDEX(Poeng!$A$1:$B$100,J25,2),\"\")","v":""},null,{"$f":"IF(L25>0,INDEX(Poeng!$A$1:$B$100,L25,2),\"\")","v":""},null,{"$f":"IF(N25>0,INDEX(Poeng!$A$1:$B$100,N25,2),\"\")","v":""},null,{"$f":"IF(P25>0,INDEX(Poeng!$A$1:$B$100,P25,2),\"\")","v":""},0,0,0,0,0,0,{"$f":"IF(#REF!>0,#REF!,0)","v":{"$error":"#REF!"}},0,0,0,0,0,0,0,""]
["",null,null,""," ",null,{"$f":"IF(F26>0,INDEX(Poeng!$A$1:$B$100,F26,2),\"\")","v":""},null,{"$f":"IF(H26>0,INDEX(Poeng!$A$1:$B$100,H26,2),\"\")","v":""},null,{"$f":"IF(J26>0,INDEX(Poeng!$A$1:$B$100,J26,2),\"\")","v":""},null,{"$f":"IF(L26>0,INDEX(Poeng!$A$1:$B$100,L26,2),\"\")","v":""},null,{"$f":"IF(N26>0,INDEX(Poeng!$A$1:$B$100,N26,2),\"\")","v":""},null,{"$f":"IF(P26>0,INDEX(Poeng!$A$1:$B$100,P26,2),\"\")","v":""},0,0,0,0,0,0,{"$f":"IF(#REF!>0,#REF!,0)","v":{"$error":"#REF!"}},0,0,0,0,0,0,0,""]
["",null,null,""," ",null,{"$f":"IF(F27>0,INDEX(Poeng!$A$1:$B$100,F27,2),\"\")","v":""},null,{"$f":"IF(H27>0,INDEX(Poeng!$A$1:$B$100,H27,2),\"\")","v":""},null,{"$f":"IF(J27>0,INDEX(Poeng!$A$1:$B$100,J27,2),\"\")","v":""},null,{"$f":"IF(L27>0,INDEX(Poeng!$A$1:$B$100,L27,2),\"\")","v":""},null,{"$f":"IF(N27>0,INDEX(Poeng!$A$1:$B$100,N27,2),\"\")","v":""},null,{"$f":"IF(P27>0,INDEX(Poeng!$A$1:$B$100,P27,2),\"\")","v":""},0,0,0,0,0,0,{"$f":"IF(#REF!>0,#REF!,0)","v":{"$error":"#REF!"}},0,0,0,0,0,0,0,""]
["",null,null,""," ",null,{"$f":"IF(F28>0,INDEX(Poeng!$A$1:$B$100,F28,2),\"\")","v":""},null,{"$f":"IF(H28>0,INDEX(Poeng!$A$1:$B$100,H28,2),\"\")","v":""},null,{"$f":"IF(J28>0,INDEX(Poeng!$A$1:$B$100,J28,2),\"\")","v":""},null,{"$f":"IF(L28>0,INDEX(Poeng!$A$1:$B$100,L28,2),\"\")","v":""},null,{"$f":"IF(N28>0,INDEX(Poeng!$A$1:$B$100,N28,2),\"\")","v":""},null,{"$f":"IF(P28>0,INDEX(Poeng!$A$1:$B$100,P28,2),\"\")","v":""},0,0,0,0,0,0,{"$f":"IF(#REF!>0,#REF!,0)","v":{"$error":"#REF!"}},0,0,0,0,0,0,0,""]
["",null,null,""," ",null,{"$f":"IF(F29>0,INDEX(Poeng!$A$1:$B$100,F29,2),\"\")","v":""},null,{"$f":"IF(H29>0,INDEX(Poeng!$A$1:$B$100,H29,2),\"\")","v":""},null,{"$f":"IF(J29>0,INDEX(Poeng!$A$1:$B$100,J29,2),\"\")","v":""},null,{"$f":"IF(L29>0,INDEX(Poeng!$A$1:$B$100,L29,2),\"\")","v":""},null,{"$f":"IF(N29>0,INDEX(Poeng!$A$1:$B$100,N29,2),\"\")","v":""},null,{"$f":"IF(P29>0,INDEX(Poeng!$A$1:$B$100,P29,2),\"\")","v":""},0,0,0,0,0,0,{"$f":"IF(#REF!>0,#REF!,0)","v":{"$error":"#REF!"}},0,0,0,0,0,0,0,""]
["",null,null,""," ",null,{"$f":"IF(F30>0,INDEX(Poeng!$A$1:$B$100,F30,2),\"\")","v":""},null,{"$f":"IF(H30>0,INDEX(Poeng!$A$1:$B$100,H30,2),\"\")","v":""},null,{"$f":"IF(J30>0,INDEX(Poeng!$A$1:$B$100,J30,2),\"\")","v":""},null,{"$f":"IF(L30>0,INDEX(Poeng!$A$1:$B$100,L30,2),\"\")","v":""},null,{"$f":"IF(N30>0,INDEX(Poeng!$A$1:$B$100,N30,2),\"\")","v":""},null,{"$f":"IF(P30>0,INDEX(Poeng!$A$1:$B$100,P30,2),\"\")","v":""},0,0,0,0,0,0,{"$f":"IF(#REF!>0,#REF!,0)","v":{"$error":"#REF!"}},0,0,0,0,0,0,0,""]
["",null,null,""," ",null,{"$f":"IF(F31>0,INDEX(Poeng!$A$1:$B$100,F31,2),\"\")","v":""},null,{"$f":"IF(H31>0,INDEX(Poeng!$A$1:$B$100,H31,2),\"\")","v":""},null,{"$f":"IF(J31>0,INDEX(Poeng!$A$1:$B$100,J31,2),\"\")","v":""},null,{"$f":"IF(L31>0,INDEX(Poeng!$A$1:$B$100,L31,2),\"\")","v":""},null,{"$f":"IF(N31>0,INDEX(Poeng!$A$1:$B$100,N31,2),\"\")","v":""},null,{"$f":"IF(P31>0,INDEX(Poeng!$A$1:$B$100,P31,2),\"\")","v":""},0,0,0,0,0,0,{"$f":"IF(#REF!>0,#REF!,0)","v":{"$error":"#REF!"}},0,0,0,0,0,0,0,""]
["",null,null,""," ",null,{"$f":"IF(F32>0,INDEX(Poeng!$A$1:$B$100,F32,2),\"\")","v":""},null,{"$f":"IF(H32>0,INDEX(Poeng!$A$1:$B$100,H32,2),\"\")","v":""},null,{"$f":"IF(J32>0,INDEX(Poeng!$A$1:$B$100,J32,2),\"\")","v":""},null,{"$f":"IF(L32>0,INDEX(Poeng!$A$1:$B$100,L32,2),\"\")","v":""},null,{"$f":"IF(N32>0,INDEX(Poeng!$A$1:$B$100,N32,2),\"\")","v":""},null,{"$f":"IF(P32>0,INDEX(Poeng!$A$1:$B$100,P32,2),\"\")","v":""},0,0,0,0,0,0,{"$f":"IF(#REF!>0,#REF!,0)","v":{"$error":"#REF!"}},0,0,0,0,0,0,0,""]
["",null,null,""," ",null,{"$f":"IF(F33>0,INDEX(Poeng!$A$1:$B$100,F33,2),\"\")","v":""},null,{"$f":"IF(H33>0,INDEX(Poeng!$A$1:$B$100,H33,2),\"\")","v":""},null,{"$f":"IF(J33>0,INDEX(Poeng!$A$1:$B$100,J33,2),\"\")","v":""},null,{"$f":"IF(L33>0,INDEX(Poeng!$A$1:$B$100,L33,2),\"\")","v":""},null,{"$f":"IF(N33>0,INDEX(Poeng!$A$1:$B$100,N33,2),\"\")","v":""},null,null,0,0,0,0,0,0,{"$f":"IF(#REF!>0,#REF!,0)","v":{"$error":"#REF!"}},0,0,0,0,0,0,0,""]
["",null,null,"",{"$f":"IF(AD34<4,\" \",\"F\")","v":" "},null,{"$f":"IF(F34>0,INDEX(Poeng!$A$1:$B$100,F34,2),\"\")","v":""},null,{"$f":"IF(H34>0,INDEX(Poeng!$A$1:$B$100,H34,2),\"\")","v":""},null,{"$f":"IF(J34>0,INDEX(Poeng!$A$1:$B$100,J34,2),\"\")","v":""},null,{"$f":"IF(L34>0,INDEX(Poeng!$A$1:$B$100,L34,2),\"\")","v":""},null,{"$f":"IF(N34>0,INDEX(Poeng!$A$1:$B$100,N34,2),\"\")","v":""},null,{"$f":"IF(P34>0,INDEX(Poeng!$A$1:$B$100,P34,2),\"\")","v":""},0,0,0,0,0,0,{"$f":"IF(#REF!>0,#REF!,0)","v":{"$error":"#REF!"}},{"$f":"LARGE(R34:W34,1)","v":0},{"$f":"LARGE(R34:W34,2)","v":0},{"$f":"LARGE(R34:W34,3)","v":0},{"$f":"LARGE(R34:W34,4)","v":0},{"$f":"SUM(Y34:AB34)","v":0},0,{"$f":"AC34*10^8+Y34*10^6/2+Z34*10^4/2+AA34*10^2/2+AB34/2","v":0},""]
[{"$f":"AF35","v":""},null,null,{"$f":"IF(B35<>\"\",AC35,\"\")","v":""}," ",null,{"$f":"IF(F35>0,INDEX(Poeng!$A$1:$B$100,F35,2),\"\")","v":""},null,{"$f":"IF(H35>0,INDEX(Poeng!$A$1:$B$100,H35,2),\"\")","v":""},null,{"$f":"IF(J35>0,INDEX(Poeng!$A$1:$B$100,J35,2),\"\")","v":""},null,{"$f":"IF(L35>0,INDEX(Poeng!$A$1:$B$100,L35,2),\"\")","v":""},null,{"$f":"IF(N35>0,INDEX(Poeng!$A$1:$B$100,N35,2),\"\")","v":""},null,{"$f":"IF(P35>0,INDEX(Poeng!$A$1:$B$100,P35,2),\"\")","v":""},{"$f":"IF(F35>0,G35,0)","v":0},{"$f":"IF(H35>0,I35,0)","v":0},{"$f":"IF(J35>0,K35,0)","v":0},{"$f":"IF(L35>0,M35,0)","v":0},{"$f":"IF(N35>0,O35,0)","v":0},{"$f":"IF(P35>0,Q35,0)","v":0},{"$f":"IF(#REF!>0,#REF!,0)","v":{"$error":"#REF!"}},0,0,0,0,0,{"$f":"COUNT(F35:Q35)/2","v":0},0,""]
["",null,null,""," ",null,{"$f":"IF(F36>0,INDEX(Poeng!$A$1:$B$100,F36,2),\"\")","v":""},null,{"$f":"IF(H36>0,INDEX(Poeng!$A$1:$B$100,H36,2),\"\")","v":""},null,{"$f":"IF(J36>0,INDEX(Poeng!$A$1:$B$100,J36,2),\"\")","v":""},null,{"$f":"IF(L36>0,INDEX(Poeng!$A$1:$B$100,L36,2),\"\")","v":""},null,{"$f":"IF(N36>0,INDEX(Poeng!$A$1:$B$100,N36,2),\"\")","v":""},null,{"$f":"IF(P36>0,INDEX(Poeng!$A$1:$B$100,P36,2),\"\")","v":""},0,0,0,0,0,0,{"$f":"IF(#REF!>0,#REF!,0)","v":{"$error":"#REF!"}},0,0,0,0,0,0,0,{"$f":"IF(B36<>\"\",RANK(AE36,AE$4:AE$72,0),\"\")","v":""}]
["",null,null,""," ",null,{"$f":"IF(F37>0,INDEX(Poeng!$A$1:$B$100,F37,2),\"\")","v":""},null,{"$f":"IF(H37>0,INDEX(Poeng!$A$1:$B$100,H37,2),\"\")","v":""},null,{"$f":"IF(J37>0,INDEX(Poeng!$A$1:$B$100,J37,2),\"\")","v":""},null,{"$f":"IF(L37>0,INDEX(Poeng!$A$1:$B$100,L37,2),\"\")","v":""},null,{"$f":"IF(N37>0,INDEX(Poeng!$A$1:$B$100,N37,2),\"\")","v":""},null,{"$f":"IF(P37>0,INDEX(Poeng!$A$1:$B$100,P37,2),\"\")","v":""},0,0,0,0,0,0,{"$f":"IF(#REF!>0,#REF!,0)","v":{"$error":"#REF!"}},0,0,0,0,0,0,0,""]
["",null,null,""," ",null,{"$f":"IF(F38>0,INDEX(Poeng!$A$1:$B$100,F38,2),\"\")","v":""},null,{"$f":"IF(H38>0,INDEX(Poeng!$A$1:$B$100,H38,2),\"\")","v":""},null,{"$f":"IF(J38>0,INDEX(Poeng!$A$1:$B$100,J38,2),\"\")","v":""},null,{"$f":"IF(L38>0,INDEX(Poeng!$A$1:$B$100,L38,2),\"\")","v":""},null,{"$f":"IF(N38>0,INDEX(Poeng!$A$1:$B$100,N38,2),\"\")","v":""},null,{"$f":"IF(P38>0,INDEX(Poeng!$A$1:$B$100,P38,2),\"\")","v":""},0,0,0,0,0,0,{"$f":"IF(#REF!>0,#REF!,0)","v":{"$error":"#REF!"}},0,0,0,0,0,0,0,""]
["",null,null,""," ",null,{"$f":"IF(F39>0,INDEX(Poeng!$A$1:$B$100,F39,2),\"\")","v":""},null,{"$f":"IF(H39>0,INDEX(Poeng!$A$1:$B$100,H39,2),\"\")","v":""},null,{"$f":"IF(J39>0,INDEX(Poeng!$A$1:$B$100,J39,2),\"\")","v":""},null,{"$f":"IF(L39>0,INDEX(Poeng!$A$1:$B$100,L39,2),\"\")","v":""},null,{"$f":"IF(N39>0,INDEX(Poeng!$A$1:$B$100,N39,2),\"\")","v":""},null,{"$f":"IF(P39>0,INDEX(Poeng!$A$1:$B$100,P39,2),\"\")","v":""},0,0,0,0,0,0,{"$f":"IF(#REF!>0,#REF!,0)","v":{"$error":"#REF!"}},0,0,0,0,0,0,0,""]
["",null,null,""," ",null,{"$f":"IF(F40>0,INDEX(Poeng!$A$1:$B$100,F40,2),\"\")","v":""},null,{"$f":"IF(H40>0,INDEX(Poeng!$A$1:$B$100,H40,2),\"\")","v":""},null,{"$f":"IF(J40>0,INDEX(Poeng!$A$1:$B$100,J40,2),\"\")","v":""},null,{"$f":"IF(L40>0,INDEX(Poeng!$A$1:$B$100,L40,2),\"\")","v":""},null,{"$f":"IF(N40>0,INDEX(Poeng!$A$1:$B$100,N40,2),\"\")","v":""},null,{"$f":"IF(P40>0,INDEX(Poeng!$A$1:$B$100,P40,2),\"\")","v":""},0,0,0,0,0,0,{"$f":"IF(#REF!>0,#REF!,0)","v":{"$error":"#REF!"}},0,0,0,0,0,0,0,""]
["",null,null,""," ",null,{"$f":"IF(F41>0,INDEX(Poeng!$A$1:$B$100,F41,2),\"\")","v":""},null,{"$f":"IF(H41>0,INDEX(Poeng!$A$1:$B$100,H41,2),\"\")","v":""},null,{"$f":"IF(J41>0,INDEX(Poeng!$A$1:$B$100,J41,2),\"\")","v":""},null,{"$f":"IF(L41>0,INDEX(Poeng!$A$1:$B$100,L41,2),\"\")","v":""},null,{"$f":"IF(N41>0,INDEX(Poeng!$A$1:$B$100,N41,2),\"\")","v":""},null,{"$f":"IF(P41>0,INDEX(Poeng!$A$1:$B$100,P41,2),\"\")","v":""},0,0,0,0,0,0,{"$f":"IF(#REF!>0,#REF!,0)","v":{"$error":"#REF!"}},0,0,0,0,0,0,0,""]
["",null,null,""," ",null,{"$f":"IF(F42>0,INDEX(Poeng!$A$1:$B$100,F42,2),\"\")","v":""},null,{"$f":"IF(H42>0,INDEX(Poeng!$A$1:$B$100,H42,2),\"\")","v":""},null,{"$f":"IF(J42>0,INDEX(Poeng!$A$1:$B$100,J42,2),\"\")","v":""},null,{"$f":"IF(L42>0,INDEX(Poeng!$A$1:$B$100,L42,2),\"\")","v":""},null,{"$f":"IF(N42>0,INDEX(Poeng!$A$1:$B$100,N42,2),\"\")","v":""},null,{"$f":"IF(P42>0,INDEX(Poeng!$A$1:$B$100,P42,2),\"\")","v":""},0,0,0,0,0,0,{"$f":"IF(#REF!>0,#REF!,0)","v":{"$error":"#REF!"}},0,0,0,0,0,0,0,""]
["",null,null,""," ",null,{"$f":"IF(F43>0,INDEX(Poeng!$A$1:$B$100,F43,2),\"\")","v":""},null,{"$f":"IF(H43>0,INDEX(Poeng!$A$1:$B$100,H43,2),\"\")","v":""},null,{"$f":"IF(J43>0,INDEX(Poeng!$A$1:$B$100,J43,2),\"\")","v":""},null,{"$f":"IF(L43>0,INDEX(Poeng!$A$1:$B$100,L43,2),\"\")","v":""},null,{"$f":"IF(N43>0,INDEX(Poeng!$A$1:$B$100,N43,2),\"\")","v":""},null,{"$f":"IF(P43>0,INDEX(Poeng!$A$1:$B$100,P43,2),\"\")","v":""},0,0,0,0,0,0,{"$f":"IF(#REF!>0,#REF!,0)","v":{"$error":"#REF!"}},0,0,0,0,0,0,0,""]
["",null,null,""," ",null,{"$f":"IF(F44>0,INDEX(Poeng!$A$1:$B$100,F44,2),\"\")","v":""},null,{"$f":"IF(H44>0,INDEX(Poeng!$A$1:$B$100,H44,2),\"\")","v":""},null,{"$f":"IF(J44>0,INDEX(Poeng!$A$1:$B$100,J44,2),\"\")","v":""},null,{"$f":"IF(L44>0,INDEX(Poeng!$A$1:$B$100,L44,2),\"\")","v":""},null,{"$f":"IF(N44>0,INDEX(Poeng!$A$1:$B$100,N44,2),\"\")","v":""},null,{"$f":"IF(P44>0,INDEX(Poeng!$A$1:$B$100,P44,2),\"\")","v":""},0,0,0,0,0,0,{"$f":"IF(#REF!>0,#REF!,0)","v":{"$error":"#REF!"}},0,0,0,0,0,0,0,""]
["",null,null,""," ",null,{"$f":"IF(F45>0,INDEX(Poeng!$A$1:$B$100,F45,2),\"\")","v":""},null,{"$f":"IF(H45>0,INDEX(Poeng!$A$1:$B$100,H45,2),\"\")","v":""},null,{"$f":"IF(J45>0,INDEX(Poeng!$A$1:$B$100,J45,2),\"\")","v":""},null,{"$f":"IF(L45>0,INDEX(Poeng!$A$1:$B$100,L45,2),\"\")","v":""},null,{"$f":"IF(N45>0,INDEX(Poeng!$A$1:$B$100,N45,2),\"\")","v":""},null,{"$f":"IF(P45>0,INDEX(Poeng!$A$1:$B$100,P45,2),\"\")","v":""},0,0,0,0,0,0,{"$f":"IF(#REF!>0,#REF!,0)","v":{"$error":"#REF!"}},0,0,0,0,0,0,0,""]
["",null,null,""," ",null,{"$f":"IF(F46>0,INDEX(Poeng!$A$1:$B$100,F46,2),\"\")","v":""},null,{"$f":"IF(H46>0,INDEX(Poeng!$A$1:$B$100,H46,2),\"\")","v":""},null,{"$f":"IF(J46>0,INDEX(Poeng!$A$1:$B$100,J46,2),\"\")","v":""},null,{"$f":"IF(L46>0,INDEX(Poeng!$A$1:$B$100,L46,2),\"\")","v":""},null,{"$f":"IF(N46>0,INDEX(Poeng!$A$1:$B$100,N46,2),\"\")","v":""},null,{"$f":"IF(P46>0,INDEX(Poeng!$A$1:$B$100,P46,2),\"\")","v":""},0,0,0,0,0,0,{"$f":"IF(#REF!>0,#REF!,0)","v":{"$error":"#REF!"}},0,0,0,0,0,0,0,""]
["",null,null,""," ",null,{"$f":"IF(F47>0,INDEX(Poeng!$A$1:$B$100,F47,2),\"\")","v":""},null,{"$f":"IF(H47>0,INDEX(Poeng!$A$1:$B$100,H47,2),\"\")","v":""},null,{"$f":"IF(J47>0,INDEX(Poeng!$A$1:$B$100,J47,2),\"\")","v":""},null,{"$f":"IF(L47>0,INDEX(Poeng!$A$1:$B$100,L47,2),\"\")","v":""},null,{"$f":"IF(N47>0,INDEX(Poeng!$A$1:$B$100,N47,2),\"\")","v":""},null,{"$f":"IF(P47>0,INDEX(Poeng!$A$1:$B$100,P47,2),\"\")","v":""},0,0,0,0,0,0,{"$f":"IF(#REF!>0,#REF!,0)","v":{"$error":"#REF!"}},0,0,0,0,0,0,0,""]
["",null,null,""," ",null,null,null,{"$f":"IF(H48>0,INDEX(Poeng!$A$1:$B$100,H48,2),\"\")","v":""},null,{"$f":"IF(J48>0,INDEX(Poeng!$A$1:$B$100,J48,2),\"\")","v":""},null,{"$f":"IF(L48>0,INDEX(Poeng!$A$1:$B$100,L48,2),\"\")","v":""},null,{"$f":"IF(N48>0,INDEX(Poeng!$A$1:$B$100,N48,2),\"\")","v":""},null,{"$f":"IF(P48>0,INDEX(Poeng!$A$1:$B$100,P48,2),\"\")","v":""},0,0,0,0,0,0,{"$f":"IF(#REF!>0,#REF!,0)","v":{"$error":"#REF!"}},0,0,0,0,0,0,0,""]
["",null,null,""," ",null,null,null,{"$f":"IF(H49>0,INDEX(Poeng!$A$1:$B$100,H49,2),\"\")","v":""},null,{"$f":"IF(J49>0,INDEX(Poeng!$A$1:$B$100,J49,2),\"\")","v":""},null,{"$f":"IF(L49>0,INDEX(Poeng!$A$1:$B$100,L49,2),\"\")","v":""},null,{"$f":"IF(N49>0,INDEX(Poeng!$A$1:$B$100,N49,2),\"\")","v":""},null,{"$f":"IF(P49>0,INDEX(Poeng!$A$1:$B$100,P49,2),\"\")","v":""},0,0,0,0,0,0,{"$f":"IF(#REF!>0,#REF!,0)","v":{"$error":"#REF!"}},0,0,0,0,0,0,0,""]
["",null,null,""," ",null,null,null,{"$f":"IF(H50>0,INDEX(Poeng!$A$1:$B$100,H50,2),\"\")","v":""},null,{"$f":"IF(J50>0,INDEX(Poeng!$A$1:$B$100,J50,2),\"\")","v":""},null,{"$f":"IF(L50>0,INDEX(Poeng!$A$1:$B$100,L50,2),\"\")","v":""},null,{"$f":"IF(N50>0,INDEX(Poeng!$A$1:$B$100,N50,2),\"\")","v":""},null,{"$f":"IF(P50>0,INDEX(Poeng!$A$1:$B$100,P50,2),\"\")","v":""},0,0,0,0,0,0,{"$f":"IF(#REF!>0,#REF!,0)","v":{"$error":"#REF!"}},0,0,0,0,0,0,0,""]
["",null,null,""," ",null,null,null,{"$f":"IF(H51>0,INDEX(Poeng!$A$1:$B$100,H51,2),\"\")","v":""},null,{"$f":"IF(J51>0,INDEX(Poeng!$A$1:$B$100,J51,2),\"\")","v":""},null,{"$f":"IF(L51>0,INDEX(Poeng!$A$1:$B$100,L51,2),\"\")","v":""},null,{"$f":"IF(N51>0,INDEX(Poeng!$A$1:$B$100,N51,2),\"\")","v":""},null,{"$f":"IF(P51>0,INDEX(Poeng!$A$1:$B$100,P51,2),\"\")","v":""},0,0,0,0,0,0,{"$f":"IF(#REF!>0,#REF!,0)","v":{"$error":"#REF!"}},0,0,0,0,0,0,0,""]
["",null,null,""," ",null,null,null,{"$f":"IF(H52>0,INDEX(Poeng!$A$1:$B$100,H52,2),\"\")","v":""},null,{"$f":"IF(J52>0,INDEX(Poeng!$A$1:$B$100,J52,2),\"\")","v":""},null,{"$f":"IF(L52>0,INDEX(Poeng!$A$1:$B$100,L52,2),\"\")","v":""},null,{"$f":"IF(N52>0,INDEX(Poeng!$A$1:$B$100,N52,2),\"\")","v":""},null,{"$f":"IF(P52>0,INDEX(Poeng!$A$1:$B$100,P52,2),\"\")","v":""},0,0,0,0,0,0,{"$f":"IF(#REF!>0,#REF!,0)","v":{"$error":"#REF!"}},0,0,0,0,0,0,0,""]
["",null,null,""," ",null,null,null,{"$f":"IF(H53>0,INDEX(Poeng!$A$1:$B$100,H53,2),\"\")","v":""},null,{"$f":"IF(J53>0,INDEX(Poeng!$A$1:$B$100,J53,2),\"\")","v":""},null,{"$f":"IF(L53>0,INDEX(Poeng!$A$1:$B$100,L53,2),\"\")","v":""},null,{"$f":"IF(N53>0,INDEX(Poeng!$A$1:$B$100,N53,2),\"\")","v":""},null,{"$f":"IF(P53>0,INDEX(Poeng!$A$1:$B$100,P53,2),\"\")","v":""},0,0,0,0,0,0,{"$f":"IF(#REF!>0,#REF!,0)","v":{"$error":"#REF!"}},0,0,0,0,0,0,0,""]
["",null,null,""," ",null,null,null,{"$f":"IF(H54>0,INDEX(Poeng!$A$1:$B$100,H54,2),\"\")","v":""},null,{"$f":"IF(J54>0,INDEX(Poeng!$A$1:$B$100,J54,2),\"\")","v":""},null,{"$f":"IF(L54>0,INDEX(Poeng!$A$1:$B$100,L54,2),\"\")","v":""},null,{"$f":"IF(N54>0,INDEX(Poeng!$A$1:$B$100,N54,2),\"\")","v":""},null,{"$f":"IF(P54>0,INDEX(Poeng!$A$1:$B$100,P54,2),\"\")","v":""},0,0,0,0,0,0,{"$f":"IF(#REF!>0,#REF!,0)","v":{"$error":"#REF!"}},0,0,0,0,0,0,0,""]
["",null,null,""," ",null,null,null,{"$f":"IF(H55>0,INDEX(Poeng!$A$1:$B$100,H55,2),\"\")","v":""},null,{"$f":"IF(J55>0,INDEX(Poeng!$A$1:$B$100,J55,2),\"\")","v":""},null,{"$f":"IF(L55>0,INDEX(Poeng!$A$1:$B$100,L55,2),\"\")","v":""},null,{"$f":"IF(N55>0,INDEX(Poeng!$A$1:$B$100,N55,2),\"\")","v":""},null,{"$f":"IF(P55>0,INDEX(Poeng!$A$1:$B$100,P55,2),\"\")","v":""},0,0,0,0,0,0,{"$f":"IF(#REF!>0,#REF!,0)","v":{"$error":"#REF!"}},0,0,0,0,0,0,0,""]
["",null,null,""," ",null,null,null,{"$f":"IF(H56>0,INDEX(Poeng!$A$1:$B$100,H56,2),\"\")","v":""},null,{"$f":"IF(J56>0,INDEX(Poeng!$A$1:$B$100,J56,2),\"\")","v":""},null,{"$f":"IF(L56>0,INDEX(Poeng!$A$1:$B$100,L56,2),\"\")","v":""},null,{"$f":"IF(N56>0,INDEX(Poeng!$A$1:$B$100,N56,2),\"\")","v":""},null,{"$f":"IF(P56>0,INDEX(Poeng!$A$1:$B$100,P56,2),\"\")","v":""},0,0,0,0,0,0,{"$f":"IF(#REF!>0,#REF!,0)","v":{"$error":"#REF!"}},0,0,0,0,0,0,0,""]
["",null,null,""," ",null,null,null,{"$f":"IF(H57>0,INDEX(Poeng!$A$1:$B$100,H57,2),\"\")","v":""},null,{"$f":"IF(J57>0,INDEX(Poeng!$A$1:$B$100,J57,2),\"\")","v":""},null,{"$f":"IF(L57>0,INDEX(Poeng!$A$1:$B$100,L57,2),\"\")","v":""},null,{"$f":"IF(N57>0,INDEX(Poeng!$A$1:$B$100,N57,2),\"\")","v":""},null,{"$f":"IF(P57>0,INDEX(Poeng!$A$1:$B$100,P57,2),\"\")","v":""},0,0,0,0,0,0,{"$f":"IF(#REF!>0,#REF!,0)","v":{"$error":"#REF!"}},0,0,0,0,0,0,0,""]
["",null,null,""," ",null,null,null,{"$f":"IF(H58>0,INDEX(Poeng!$A$1:$B$100,H58,2),\"\")","v":""},null,{"$f":"IF(J58>0,INDEX(Poeng!$A$1:$B$100,J58,2),\"\")","v":""},null,{"$f":"IF(L58>0,INDEX(Poeng!$A$1:$B$100,L58,2),\"\")","v":""},null,{"$f":"IF(N58>0,INDEX(Poeng!$A$1:$B$100,N58,2),\"\")","v":""},null,{"$f":"IF(P58>0,INDEX(Poeng!$A$1:$B$100,P58,2),\"\")","v":""},0,0,0,0,0,0,{"$f":"IF(#REF!>0,#REF!,0)","v":{"$error":"#REF!"}},0,0,0,0,0,0,0,""]
["",null,null,""," ",null,null,null,{"$f":"IF(H59>0,INDEX(Poeng!$A$1:$B$100,H59,2),\"\")","v":""},null,{"$f":"IF(J59>0,INDEX(Poeng!$A$1:$B$100,J59,2),\"\")","v":""},null,{"$f":"IF(L59>0,INDEX(Poeng!$A$1:$B$100,L59,2),\"\")","v":""},null,{"$f":"IF(N59>0,INDEX(Poeng!$A$1:$B$100,N59,2),\"\")","v":""},null,{"$f":"IF(P59>0,INDEX(Poeng!$A$1:$B$100,P59,2),\"\")","v":""},0,0,0,0,0,0,{"$f":"IF(#REF!>0,#REF!,0)","v":{"$error":"#REF!"}},0,0,0,0,0,0,0,""]
["",null,null,""," ",null,null,null,{"$f":"IF(H60>0,INDEX(Poeng!$A$1:$B$100,H60,2),\"\")","v":""},null,{"$f":"IF(J60>0,INDEX(Poeng!$A$1:$B$100,J60,2),\"\")","v":""},null,{"$f":"IF(L60>0,INDEX(Poeng!$A$1:$B$100,L60,2),\"\")","v":""},null,{"$f":"IF(N60>0,INDEX(Poeng!$A$1:$B$100,N60,2),\"\")","v":""},null,{"$f":"IF(P60>0,INDEX(Poeng!$A$1:$B$100,P60,2),\"\")","v":""},0,0,0,0,0,0,{"$f":"IF(#REF!>0,#REF!,0)","v":{"$error":"#REF!"}},0,0,0,0,0,0,0,""]
["",null,null,"",{"$f":"IF(AD61<4,\" \",\"F\")","v":" "},null,null,null,{"$f":"IF(H61>0,INDEX(Poeng!$A$1:$B$100,H61,2),\"\")","v":""},null,{"$f":"IF(J61>0,INDEX(Poeng!$A$1:$B$100,J61,2),\"\")","v":""},null,{"$f":"IF(L61>0,INDEX(Poeng!$A$1:$B$100,L61,2),\"\")","v":""},null,{"$f":"IF(N61>0,INDEX(Poeng!$A$1:$B$100,N61,2),\"\")","v":""},null,{"$f":"IF(P61>0,INDEX(Poeng!$A$1:$B$100,P61,2),\"\")","v":""},0,0,0,0,0,0,{"$f":"IF(#REF!>0,#REF!,0)","v":{"$error":"#REF!"}},0,0,0,0,0,0,0,""]
["",null,null,""," ",null,null,null,{"$f":"IF(H62>0,INDEX(Poeng!$A$1:$B$100,H62,2),\"\")","v":""},null,{"$f":"IF(J62>0,INDEX(Poeng!$A$1:$B$100,J62,2),\"\")","v":""},null,{"$f":"IF(L62>0,INDEX(Poeng!$A$1:$B$100,L62,2),\"\")","v":""},null,{"$f":"IF(N62>0,INDEX(Poeng!$A$1:$B$100,N62,2),\"\")","v":""},null,{"$f":"IF(P62>0,INDEX(Poeng!$A$1:$B$100,P62,2),\"\")","v":""},0,0,0,0,0,0,{"$f":"IF(#REF!>0,#REF!,0)","v":{"$error":"#REF!"}},0,0,0,0,0,0,0,""]
["",null,null,""," ",null,null,null,{"$f":"IF(H63>0,INDEX(Poeng!$A$1:$B$100,H63,2),\"\")","v":""},null,{"$f":"IF(J63>0,INDEX(Poeng!$A$1:$B$100,J63,2),\"\")","v":""},null,{"$f":"IF(L63>0,INDEX(Poeng!$A$1:$B$100,L63,2),\"\")","v":""},null,{"$f":"IF(N63>0,INDEX(Poeng!$A$1:$B$100,N63,2),\"\")","v":""},null,{"$f":"IF(P63>0,INDEX(Poeng!$A$1:$B$100,P63,2),\"\")","v":""},0,0,0,0,0,0,{"$f":"IF(#REF!>0,#REF!,0)","v":{"$error":"#REF!"}},0,0,0,0,0,0,0,""]
["",null,null,""," ",null,null,null,{"$f":"IF(H64>0,INDEX(Poeng!$A$1:$B$100,H64,2),\"\")","v":""},null,{"$f":"IF(J64>0,INDEX(Poeng!$A$1:$B$100,J64,2),\"\")","v":""},null,{"$f":"IF(L64>0,INDEX(Poeng!$A$1:$B$100,L64,2),\"\")","v":""},null,{"$f":"IF(N64>0,INDEX(Poeng!$A$1:$B$100,N64,2),\"\")","v":""},null,{"$f":"IF(P64>0,INDEX(Poeng!$A$1:$B$100,P64,2),\"\")","v":""},0,0,0,0,0,0,{"$f":"IF(#REF!>0,#REF!,0)","v":{"$error":"#REF!"}},0,0,0,0,0,0,0,""]
["",null,null,""," ",null,null,null,{"$f":"IF(H65>0,INDEX(Poeng!$A$1:$B$100,H65,2),\"\")","v":""},null,{"$f":"IF(J65>0,INDEX(Poeng!$A$1:$B$100,J65,2),\"\")","v":""},null,{"$f":"IF(L65>0,INDEX(Poeng!$A$1:$B$100,L65,2),\"\")","v":""},null,{"$f":"IF(N65>0,INDEX(Poeng!$A$1:$B$100,N65,2),\"\")","v":""},null,{"$f":"IF(P65>0,INDEX(Poeng!$A$1:$B$100,P65,2),\"\")","v":""},0,0,0,0,0,0,{"$f":"IF(#REF!>0,#REF!,0)","v":{"$error":"#REF!"}},0,0,0,0,0,0,0,""]
["",null,null,""," ",null,null,null,{"$f":"IF(H66>0,INDEX(Poeng!$A$1:$B$100,H66,2),\"\")","v":""},null,{"$f":"IF(J66>0,INDEX(Poeng!$A$1:$B$100,J66,2),\"\")","v":""},null,{"$f":"IF(L66>0,INDEX(Poeng!$A$1:$B$100,L66,2),\"\")","v":""},null,{"$f":"IF(N66>0,INDEX(Poeng!$A$1:$B$100,N66,2),\"\")","v":""},null,{"$f":"IF(P66>0,INDEX(Poeng!$A$1:$B$100,P66,2),\"\")","v":""},0,0,0,0,0,0,{"$f":"IF(#REF!>0,#REF!,0)","v":{"$error":"#REF!"}},{"$f":"LARGE(R66:W66,1)","v":0},{"$f":"LARGE(R66:W66,2)","v":0},{"$f":"LARGE(R66:W66,3)","v":0},{"$f":"LARGE(R66:W66,4)","v":0},{"$f":"SUM(Y66:AB66)","v":0},0,{"$f":"AC66*10^8+Y66*10^6/2+Z66*10^4/2+AA66*10^2/2+AB66/2","v":0},""]
[{"$f":"AF67","v":""},null,null,{"$f":"IF(B67<>\"\",AC67,\"\")","v":""}," ",null,null,null,{"$f":"IF(H67>0,INDEX(Poeng!$A$1:$B$100,H67,2),\"\")","v":""},null,{"$f":"IF(J67>0,INDEX(Poeng!$A$1:$B$100,J67,2),\"\")","v":""},null,{"$f":"IF(L67>0,INDEX(Poeng!$A$1:$B$100,L67,2),\"\")","v":""},null,{"$f":"IF(N67>0,INDEX(Poeng!$A$1:$B$100,N67,2),\"\")","v":""},null,{"$f":"IF(P67>0,INDEX(Poeng!$A$1:$B$100,P67,2),\"\")","v":""},{"$f":"IF(F67>0,G67,0)","v":0},{"$f":"IF(H67>0,I67,0)","v":0},{"$f":"IF(J67>0,K67,0)","v":0},{"$f":"IF(L67>0,M67,0)","v":0},{"$f":"IF(N67>0,O67,0)","v":0},{"$f":"IF(P67>0,Q67,0)","v":0},{"$f":"IF(#REF!>0,#REF!,0)","v":{"$error":"#REF!"}},0,0,0,0,0,{"$f":"COUNT(F67:Q67)/2","v":0},0,""]
["",null,null,""," ",null,null,null,{"$f":"IF(H68>0,INDEX(Poeng!$A$1:$B$100,H68,2),\"\")","v":""},null,{"$f":"IF(J68>0,INDEX(Poeng!$A$1:$B$100,J68,2),\"\")","v":""},null,{"$f":"IF(L68>0,INDEX(Poeng!$A$1:$B$100,L68,2),\"\")","v":""},null,{"$f":"IF(N68>0,INDEX(Poeng!$A$1:$B$100,N68,2),\"\")","v":""},null,{"$f":"IF(P68>0,INDEX(Poeng!$A$1:$B$100,P68,2),\"\")","v":""},0,0,0,0,0,0,{"$f":"IF(#REF!>0,#REF!,0)","v":{"$error":"#REF!"}},0,0,0,0,0,0,0,{"$f":"IF(B68<>\"\",RANK(AE68,AE$4:AE$72,0),\"\")","v":""}]
["",null,null,""," ",null,null,null,{"$f":"IF(H69>0,INDEX(Poeng!$A$1:$B$100,H69,2),\"\")","v":""},null,{"$f":"IF(J69>0,INDEX(Poeng!$A$1:$B$100,J69,2),\"\")","v":""},null,{"$f":"IF(L69>0,INDEX(Poeng!$A$1:$B$100,L69,2),\"\")","v":""},null,{"$f":"IF(N69>0,INDEX(Poeng!$A$1:$B$100,N69,2),\"\")","v":""},null,{"$f":"IF(P69>0,INDEX(Poeng!$A$1:$B$100,P69,2),\"\")","v":""},0,0,0,0,0,0,{"$f":"IF(#REF!>0,#REF!,0)","v":{"$error":"#REF!"}},0,0,0,0,0,0,0,""]
["",null,null,""," ",null,null,null,{"$f":"IF(H70>0,INDEX(Poeng!$A$1:$B$100,H70,2),\"\")","v":""},null,{"$f":"IF(J70>0,INDEX(Poeng!$A$1:$B$100,J70,2),\"\")","v":""},null,{"$f":"IF(L70>0,INDEX(Poeng!$A$1:$B$100,L70,2),\"\")","v":""},null,{"$f":"IF(N70>0,INDEX(Poeng!$A$1:$B$100,N70,2),\"\")","v":""},null,{"$f":"IF(P70>0,INDEX(Poeng!$A$1:$B$100,P70,2),\"\")","v":""},0,0,0,0,0,0,{"$f":"IF(#REF!>0,#REF!,0)","v":{"$error":"#REF!"}},0,0,0,0,0,0,0,""]
["",null,null,""," ",null,null,null,{"$f":"IF(H71>0,INDEX(Poeng!$A$1:$B$100,H71,2),\"\")","v":""},null,{"$f":"IF(J71>0,INDEX(Poeng!$A$1:$B$100,J71,2),\"\")","v":""},null,{"$f":"IF(L71>0,INDEX(Poeng!$A$1:$B$100,L71,2),\"\")","v":""},null,{"$f":"IF(N71>0,INDEX(Poeng!$A$1:$B$100,N71,2),\"\")","v":""},null,{"$f":"IF(P71>0,INDEX(Poeng!$A$1:$B$100,P71,2),\"\")","v":""},0,0,0,0,0,0,{"$f":"IF(#REF!>0,#REF!,0)","v":{"$error":"#REF!"}},0,0,0,0,0,0,0,""]
["",null,null,""," ",null,null,null,{"$f":"IF(H72>0,INDEX(Poeng!$A$1:$B$100,H72,2),\"\")","v":""},null,{"$f":"IF(J72>0,INDEX(Poeng!$A$1:$B$100,J72,2),\"\")","v":""},null,{"$f":"IF(L72>0,INDEX(Poeng!$A$1:$B$100,L72,2),\"\")","v":""},null,{"$f":"IF(N72>0,INDEX(Poeng!$A$1:$B$100,N72,2),\"\")","v":""},null,{"$f":"IF(P72>0,INDEX(Poeng!$A$1:$B$100,P72,2),\"\")","v":""},0,0,0,0,0,0,{"$f":"IF(#REF!>0,#REF!,0)","v":{"$error":"#REF!"}},0,0,0,0,0,0,0,""]
["",null,null,""," ",null,null,null,{"$f":"IF(H73>0,INDEX(Poeng!$A$1:$B$100,H73,2),\"\")","v":""},null,{"$f":"IF(J73>0,INDEX(Poeng!$A$1:$B$100,J73,2),\"\")","v":""},null,{"$f":"IF(L73>0,INDEX(Poeng!$A$1:$B$100,L73,2),\"\")","v":""},null,{"$f":"IF(N73>0,INDEX(Poeng!$A$1:$B$100,N73,2),\"\")","v":""},null,{"$f":"IF(P73>0,INDEX(Poeng!$A$1:$B$100,P73,2),\"\")","v":""},0,0,0,0,0,0,{"$f":"IF(#REF!>0,#REF!,0)","v":{"$error":"#REF!"}},0,0,0,0,0,0,0,""]
["",null,null,""," ",null,null,null,{"$f":"IF(H74>0,INDEX(Poeng!$A$1:$B$100,H74,2),\"\")","v":""},null,{"$f":"IF(J74>0,INDEX(Poeng!$A$1:$B$100,J74,2),\"\")","v":""},null,{"$f":"IF(L74>0,INDEX(Poeng!$A$1:$B$100,L74,2),\"\")","v":""},null,{"$f":"IF(N74>0,INDEX(Poeng!$A$1:$B$100,N74,2),\"\")","v":""},null,{"$f":"IF(P74>0,INDEX(Poeng!$A$1:$B$100,P74,2),\"\")","v":""},0,0,0,0,0,0,{"$f":"IF(#REF!>0,#REF!,0)","v":{"$error":"#REF!"}},0,0,0,0,0,0,0,""]
["",null,null,""," ",null,null,null,{"$f":"IF(H75>0,INDEX(Poeng!$A$1:$B$100,H75,2),\"\")","v":""},null,{"$f":"IF(J75>0,INDEX(Poeng!$A$1:$B$100,J75,2),\"\")","v":""},null,{"$f":"IF(L75>0,INDEX(Poeng!$A$1:$B$100,L75,2),\"\")","v":""},null,{"$f":"IF(N75>0,INDEX(Poeng!$A$1:$B$100,N75,2),\"\")","v":""},null,{"$f":"IF(P75>0,INDEX(Poeng!$A$1:$B$100,P75,2),\"\")","v":""},0,0,0,0,0,0,{"$f":"IF(#REF!>0,#REF!,0)","v":{"$error":"#REF!"}},0,0,0,0,0,0,0,""]
["",null,null,""," ",null,null,null,{"$f":"IF(H76>0,INDEX(Poeng!$A$1:$B$100,H76,2),\"\")","v":""},null,{"$f":"IF(J76>0,INDEX(Poeng!$A$1:$B$100,J76,2),\"\")","v":""},null,{"$f":"IF(L76>0,INDEX(Poeng!$A$1:$B$100,L76,2),\"\")","v":""},null,{"$f":"IF(N76>0,INDEX(Poeng!$A$1:$B$100,N76,2),\"\")","v":""},null,{"$f":"IF(P76>0,INDEX(Poeng!$A$1:$B$100,P76,2),\"\")","v":""},0,0,0,0,0,0,{"$f":"IF(#REF!>0,#REF!,0)","v":{"$error":"#REF!"}},0,0,0,0,0,0,0,""]
["",null,null,""," ",null,null,null,{"$f":"IF(H77>0,INDEX(Poeng!$A$1:$B$100,H77,2),\"\")","v":""},null,{"$f":"IF(J77>0,INDEX(Poeng!$A$1:$B$100,J77,2),\"\")","v":""},null,{"$f":"IF(L77>0,INDEX(Poeng!$A$1:$B$100,L77,2),\"\")","v":""},null,{"$f":"IF(N77>0,INDEX(Poeng!$A$1:$B$100,N77,2),\"\")","v":""},null,{"$f":"IF(P77>0,INDEX(Poeng!$A$1:$B$100,P77,2),\"\")","v":""},0,0,0,0,0,0,{"$f":"IF(#REF!>0,#REF!,0)","v":{"$error":"#REF!"}},0,0,0,0,0,0,0,""]
["",null,null,""," ",null,null,null,{"$f":"IF(H78>0,INDEX(Poeng!$A$1:$B$100,H78,2),\"\")","v":""},null,{"$f":"IF(J78>0,INDEX(Poeng!$A$1:$B$100,J78,2),\"\")","v":""},null,{"$f":"IF(L78>0,INDEX(Poeng!$A$1:$B$100,L78,2),\"\")","v":""},null,{"$f":"IF(N78>0,INDEX(Poeng!$A$1:$B$100,N78,2),\"\")","v":""},null,{"$f":"IF(P78>0,INDEX(Poeng!$A$1:$B$100,P78,2),\"\")","v":""},0,0,0,0,0,0,{"$f":"IF(#REF!>0,#REF!,0)","v":{"$error":"#REF!"}},0,0,0,0,0,0,0,""]
["",null,null,""," ",null,null,null,{"$f":"IF(H79>0,INDEX(Poeng!$A$1:$B$100,H79,2),\"\")","v":""},null,{"$f":"IF(J79>0,INDEX(Poeng!$A$1:$B$100,J79,2),\"\")","v":""},null,{"$f":"IF(L79>0,INDEX(Poeng!$A$1:$B$100,L79,2),\"\")","v":""},null,{"$f":"IF(N79>0,INDEX(Poeng!$A$1:$B$100,N79,2),\"\")","v":""},null,{"$f":"IF(P79>0,INDEX(Poeng!$A$1:$B$100,P79,2),\"\")","v":""},0,0,0,0,0,0,{"$f":"IF(#REF!>0,#REF!,0)","v":{"$error":"#REF!"}},0,0,0,0,0,0,0,""]
["",null,null,""," ",null,null,null,{"$f":"IF(H80>0,INDEX(Poeng!$A$1:$B$100,H80,2),\"\")","v":""},null,{"$f":"IF(J80>0,INDEX(Poeng!$A$1:$B$100,J80,2),\"\")","v":""},null,{"$f":"IF(L80>0,INDEX(Poeng!$A$1:$B$100,L80,2),\"\")","v":""},null,{"$f":"IF(N80>0,INDEX(Poeng!$A$1:$B$100,N80,2),\"\")","v":""},null,{"$f":"IF(P80>0,INDEX(Poeng!$A$1:$B$100,P80,2),\"\")","v":""},0,0,0,0,0,0,{"$f":"IF(#REF!>0,#REF!,0)","v":{"$error":"#REF!"}},0,0,0,0,0,0,0,""]
["",null,null,""," ",null,null,null,{"$f":"IF(H81>0,INDEX(Poeng!$A$1:$B$100,H81,2),\"\")","v":""},null,{"$f":"IF(J81>0,INDEX(Poeng!$A$1:$B$100,J81,2),\"\")","v":""},null,{"$f":"IF(L81>0,INDEX(Poeng!$A$1:$B$100,L81,2),\"\")","v":""},null,{"$f":"IF(N81>0,INDEX(Poeng!$A$1:$B$100,N81,2),\"\")","v":""},null,{"$f":"IF(P81>0,INDEX(Poeng!$A$1:$B$100,P81,2),\"\")","v":""},0,0,0,0,0,0,{"$f":"IF(#REF!>0,#REF!,0)","v":{"$error":"#REF!"}},0,0,0,0,0,0,0,""]
["",null,null,""," ",null,null,null,{"$f":"IF(H82>0,INDEX(Poeng!$A$1:$B$100,H82,2),\"\")","v":""},null,{"$f":"IF(J82>0,INDEX(Poeng!$A$1:$B$100,J82,2),\"\")","v":""},null,{"$f":"IF(L82>0,INDEX(Poeng!$A$1:$B$100,L82,2),\"\")","v":""},null,{"$f":"IF(N82>0,INDEX(Poeng!$A$1:$B$100,N82,2),\"\")","v":""},null,{"$f":"IF(P82>0,INDEX(Poeng!$A$1:$B$100,P82,2),\"\")","v":""},0,0,0,0,0,0,{"$f":"IF(#REF!>0,#REF!,0)","v":{"$error":"#REF!"}},0,0,0,0,0,0,0,""]
["",null,null,""," ",null,null,null,{"$f":"IF(H83>0,INDEX(Poeng!$A$1:$B$100,H83,2),\"\")","v":""},null,{"$f":"IF(J83>0,INDEX(Poeng!$A$1:$B$100,J83,2),\"\")","v":""},null,{"$f":"IF(L83>0,INDEX(Poeng!$A$1:$B$100,L83,2),\"\")","v":""},null,{"$f":"IF(N83>0,INDEX(Poeng!$A$1:$B$100,N83,2),\"\")","v":""},null,{"$f":"IF(P83>0,INDEX(Poeng!$A$1:$B$100,P83,2),\"\")","v":""},0,0,0,0,0,0,{"$f":"IF(#REF!>0,#REF!,0)","v":{"$error":"#REF!"}},0,0,0,0,0,0,0,""]
["",null,null,""," ",null,null,null,{"$f":"IF(H84>0,INDEX(Poeng!$A$1:$B$100,H84,2),\"\")","v":""},null,{"$f":"IF(J84>0,INDEX(Poeng!$A$1:$B$100,J84,2),\"\")","v":""},null,{"$f":"IF(L84>0,INDEX(Poeng!$A$1:$B$100,L84,2),\"\")","v":""},null,{"$f":"IF(N84>0,INDEX(Poeng!$A$1:$B$100,N84,2),\"\")","v":""},null,{"$f":"IF(P84>0,INDEX(Poeng!$A$1:$B$100,P84,2),\"\")","v":""},0,0,0,0,0,0,{"$f":"IF(#REF!>0,#REF!,0)","v":{"$error":"#REF!"}},0,0,0,0,0,0,0,""]
["",null,null,""," ",null,null,null,{"$f":"IF(H85>0,INDEX(Poeng!$A$1:$B$100,H85,2),\"\")","v":""},null,{"$f":"IF(J85>0,INDEX(Poeng!$A$1:$B$100,J85,2),\"\")","v":""},null,{"$f":"IF(L85>0,INDEX(Poeng!$A$1:$B$100,L85,2),\"\")","v":""},null,{"$f":"IF(N85>0,INDEX(Poeng!$A$1:$B$100,N85,2),\"\")","v":""},null,{"$f":"IF(P85>0,INDEX(Poeng!$A$1:$B$100,P85,2),\"\")","v":""},0,0,0,0,0,0,{"$f":"IF(#REF!>0,#REF!,0)","v":{"$error":"#REF!"}},0,0,0,0,0,0,0,""]
["",null,null,""," ",null,null,null,{"$f":"IF(H86>0,INDEX(Poeng!$A$1:$B$100,H86,2),\"\")","v":""},null,{"$f":"IF(J86>0,INDEX(Poeng!$A$1:$B$100,J86,2),\"\")","v":""},null,{"$f":"IF(L86>0,INDEX(Poeng!$A$1:$B$100,L86,2),\"\")","v":""},null,{"$f":"IF(N86>0,INDEX(Poeng!$A$1:$B$100,N86,2),\"\")","v":""},null,{"$f":"IF(P86>0,INDEX(Poeng!$A$1:$B$100,P86,2),\"\")","v":""},0,0,0,0,0,0,{"$f":"IF(#REF!>0,#REF!,0)","v":{"$error":"#REF!"}},0,0,0,0,0,0,0,""]
["",null,null,""," ",null,null,null,{"$f":"IF(H87>0,INDEX(Poeng!$A$1:$B$100,H87,2),\"\")","v":""},null,{"$f":"IF(J87>0,INDEX(Poeng!$A$1:$B$100,J87,2),\"\")","v":""},null,{"$f":"IF(L87>0,INDEX(Poeng!$A$1:$B$100,L87,2),\"\")","v":""},null,{"$f":"IF(N87>0,INDEX(Poeng!$A$1:$B$100,N87,2),\"\")","v":""},null,{"$f":"IF(P87>0,INDEX(Poeng!$A$1:$B$100,P87,2),\"\")","v":""},0,0,0,0,0,0,{"$f":"IF(#REF!>0,#REF!,0)","v":{"$error":"#REF!"}},0,0,0,0,0,0,0,""]
["",null,null,""," ",null,null,null,{"$f":"IF(H88>0,INDEX(Poeng!$A$1:$B$100,H88,2),\"\")","v":""},null,{"$f":"IF(J88>0,INDEX(Poeng!$A$1:$B$100,J88,2),\"\")","v":""},null,{"$f":"IF(L88>0,INDEX(Poeng!$A$1:$B$100,L88,2),\"\")","v":""},null,{"$f":"IF(N88>0,INDEX(Poeng!$A$1:$B$100,N88,2),\"\")","v":""},null,{"$f":"IF(P88>0,INDEX(Poeng!$A$1:$B$100,P88,2),\"\")","v":""},0,0,0,0,0,0,{"$f":"IF(#REF!>0,#REF!,0)","v":{"$error":"#REF!"}},0,0,0,0,0,0,0,""]
["",null,null,""," ",null,null,null,{"$f":"IF(H89>0,INDEX(Poeng!$A$1:$B$100,H89,2),\"\")","v":""},null,{"$f":"IF(J89>0,INDEX(Poeng!$A$1:$B$100,J89,2),\"\")","v":""},null,{"$f":"IF(L89>0,INDEX(Poeng!$A$1:$B$100,L89,2),\"\")","v":""},null,{"$f":"IF(N89>0,INDEX(Poeng!$A$1:$B$100,N89,2),\"\")","v":""},null,{"$f":"IF(P89>0,INDEX(Poeng!$A$1:$B$100,P89,2),\"\")","v":""},0,0,0,0,0,0,{"$f":"IF(#REF!>0,#REF!,0)","v":{"$error":"#REF!"}},0,0,0,0,0,0,0,""]
["",null,null,""," ",null,null,null,{"$f":"IF(H90>0,INDEX(Poeng!$A$1:$B$100,H90,2),\"\")","v":""},null,{"$f":"IF(J90>0,INDEX(Poeng!$A$1:$B$100,J90,2),\"\")","v":""},null,{"$f":"IF(L90>0,INDEX(Poeng!$A$1:$B$100,L90,2),\"\")","v":""},null,{"$f":"IF(N90>0,INDEX(Poeng!$A$1:$B$100,N90,2),\"\")","v":""},null,{"$f":"IF(P90>0,INDEX(Poeng!$A$1:$B$100,P90,2),\"\")","v":""},0,0,0,0,0,0,{"$f":"IF(#REF!>0,#REF!,0)","v":{"$error":"#REF!"}},0,0,0,0,0,0,0,""]
["",null,null,""," ",null,null,null,{"$f":"IF(H91>0,INDEX(Poeng!$A$1:$B$100,H91,2),\"\")","v":""},null,{"$f":"IF(J91>0,INDEX(Poeng!$A$1:$B$100,J91,2),\"\")","v":""},null,{"$f":"IF(L91>0,INDEX(Poeng!$A$1:$B$100,L91,2),\"\")","v":""},null,{"$f":"IF(N91>0,INDEX(Poeng!$A$1:$B$100,N91,2),\"\")","v":""},null,{"$f":"IF(P91>0,INDEX(Poeng!$A$1:$B$100,P91,2),\"\")","v":""},0,0,0,0,0,0,{"$f":"IF(#REF!>0,#REF!,0)","v":{"$error":"#REF!"}},0,0,0,0,0,0,0,""]
["",null,null,""," ",null,null,null,{"$f":"IF(H92>0,INDEX(Poeng!$A$1:$B$100,H92,2),\"\")","v":""},null,{"$f":"IF(J92>0,INDEX(Poeng!$A$1:$B$100,J92,2),\"\")","v":""},null,{"$f":"IF(L92>0,INDEX(Poeng!$A$1:$B$100,L92,2),\"\")","v":""},null,{"$f":"IF(N92>0,INDEX(Poeng!$A$1:$B$100,N92,2),\"\")","v":""},null,{"$f":"IF(P92>0,INDEX(Poeng!$A$1:$B$100,P92,2),\"\")","v":""},0,0,0,0,0,0,{"$f":"IF(#REF!>0,#REF!,0)","v":{"$error":"#REF!"}},0,0,0,0,0,0,0,""]
["",null,null,""," ",null,null,null,{"$f":"IF(H93>0,INDEX(Poeng!$A$1:$B$100,H93,2),\"\")","v":""},null,{"$f":"IF(J93>0,INDEX(Poeng!$A$1:$B$100,J93,2),\"\")","v":""},null,{"$f":"IF(L93>0,INDEX(Poeng!$A$1:$B$100,L93,2),\"\")","v":""},null,{"$f":"IF(N93>0,INDEX(Poeng!$A$1:$B$100,N93,2),\"\")","v":""},null,{"$f":"IF(P93>0,INDEX(Poeng!$A$1:$B$100,P93,2),\"\")","v":""},0,0,0,0,0,0,{"$f":"IF(#REF!>0,#REF!,0)","v":{"$error":"#REF!"}},0,0,0,0,0,0,0,""]
["",null,null,""," ",null,null,null,{"$f":"IF(H94>0,INDEX(Poeng!$A$1:$B$100,H94,2),\"\")","v":""},null,{"$f":"IF(J94>0,INDEX(Poeng!$A$1:$B$100,J94,2),\"\")","v":""},null,{"$f":"IF(L94>0,INDEX(Poeng!$A$1:$B$100,L94,2),\"\")","v":""},null,{"$f":"IF(N94>0,INDEX(Poeng!$A$1:$B$100,N94,2),\"\")","v":""},null,{"$f":"IF(P94>0,INDEX(Poeng!$A$1:$B$100,P94,2),\"\")","v":""},0,0,0,0,0,0,{"$f":"IF(#REF!>0,#REF!,0)","v":{"$error":"#REF!"}},0,0,0,0,0,0,0,""]
["",null,null,""," ",null,null,null,{"$f":"IF(H95>0,INDEX(Poeng!$A$1:$B$100,H95,2),\"\")","v":""},null,{"$f":"IF(J95>0,INDEX(Poeng!$A$1:$B$100,J95,2),\"\")","v":""},null,{"$f":"IF(L95>0,INDEX(Poeng!$A$1:$B$100,L95,2),\"\")","v":""},null,{"$f":"IF(N95>0,INDEX(Poeng!$A$1:$B$100,N95,2),\"\")","v":""},null,{"$f":"IF(P95>0,INDEX(Poeng!$A$1:$B$100,P95,2),\"\")","v":""},0,0,0,0,0,0,{"$f":"IF(#REF!>0,#REF!,0)","v":{"$error":"#REF!"}},0,0,0,0,0,0,0,""]
["",null,null,""," ",null,null,null,{"$f":"IF(H96>0,INDEX(Poeng!$A$1:$B$100,H96,2),\"\")","v":""},null,{"$f":"IF(J96>0,INDEX(Poeng!$A$1:$B$100,J96,2),\"\")","v":""},null,{"$f":"IF(L96>0,INDEX(Poeng!$A$1:$B$100,L96,2),\"\")","v":""},null,{"$f":"IF(N96>0,INDEX(Poeng!$A$1:$B$100,N96,2),\"\")","v":""},null,{"$f":"IF(P96>0,INDEX(Poeng!$A$1:$B$100,P96,2),\"\")","v":""},0,0,0,0,0,0,{"$f":"IF(#REF!>0,#REF!,0)","v":{"$error":"#REF!"}},0,0,0,0,0,0,0,""]
["",null,null,""," ",null,null,null,{"$f":"IF(H97>0,INDEX(Poeng!$A$1:$B$100,H97,2),\"\")","v":""},null,{"$f":"IF(J97>0,INDEX(Poeng!$A$1:$B$100,J97,2),\"\")","v":""},null,{"$f":"IF(L97>0,INDEX(Poeng!$A$1:$B$100,L97,2),\"\")","v":""},null,{"$f":"IF(N97>0,INDEX(Poeng!$A$1:$B$100,N97,2),\"\")","v":""},null,{"$f":"IF(P97>0,INDEX(Poeng!$A$1:$B$100,P97,2),\"\")","v":""},0,0,0,0,0,0,{"$f":"IF(#REF!>0,#REF!,0)","v":{"$error":"#REF!"}},0,0,0,0,0,0,0,""]

{"sheet":"J14","index":1,"n_rows":98,"n_cols":32,"rows_kept":98,"cut":false,"hidden":false,"merged":[[0,2,0,16],[1,5,1,6],[1,7,1,8],[1,9,1,10],[1,11,1,12],[1,13,1,14],[1,15,1,16],[2,15,2,16],[2,5,2,6],[2,7,2,8],[2,9,2,10],[2,11,2,12],[2,13,2,14]]}
["Jenter 14",null,"  Sparebank1-CUP 2021"]
[null,null,null,null,null,"SP1- CUP 1 ",null,"SP1- CUP 2 ",null,"SP1- CUP 3",null,"SP1- CUP 4",null,"SP1- CUP 5",null,"SP1- CUP 6",null,"Poeng",null,null,null,null,null,null,"Fire beste",null,null,null,"Sum"]
["Nr","NAVN","KLUBB","POENG","Fullført","Nr.  Poeng ",null,"Nr.  Poeng ",null,"Nr.   Poeng ",null,"Nr.  Poeng ",null,"Nr.  Poeng ",null,"Nr. Poeng ",null,1,2,3,4,5,6,7,1,2,3,4]
[{"$f":"AF4","v":1},"Ingrid Wollan Benum","Byåsen IL",{"$f":"IF(B4<>\"\",AC4,\"\")","v":400},{"$f":"IF(AD4<4,\" \",\"F\")","v":"F"},2,{"$f":"IF(F4>0,INDEX(Poeng!$A$1:$B$100,F4,2),\"\")","v":80},1,{"$f":"IF(H4>0,INDEX(Poeng!$A$1:$B$100,H4,2),\"\")","v":100},1,{"$f":"IF(J4>0,INDEX(Poeng!$A$1:$B$100,J4,2),\"\")","v":100},1,{"$f":"IF(L4>0,INDEX(Poeng!$A$1:$B$100,L4,2),\"\")","v":100},1,{"$f":"IF(N4>0,INDEX(Poeng!$A$1:$B$100,N4,2),\"\")","v":100},1,{"$f":"IF(P4>0,INDEX(Poeng!$A$1:$B$100,P4,2),\"\")","v":100},{"$f":"IF(F4>0,G4,0)","v":80},{"$f":"IF(H4>0,I4,0)","v":100},{"$f":"IF(J4>0,K4,0)","v":100},{"$f":"IF(L4>0,M4,0)","v":100},{"$f":"IF(N4>0,O4,0)","v":100},{"$f":"IF(P4>0,Q4,0)","v":100},{"$f":"IF(#REF!>0,#REF!,0)","v":{"$error":"#REF!"}},{"$f":"LARGE(R4:W4,1)","v":100},{"$f":"LARGE(R4:W4,2)","v":100},{"$f":"LARGE(R4:W4,3)","v":100},{"$f":"LARGE(R4:W4,4)","v":100},{"$f":"SUM(Y4:AB4)","v":400},{"$f":"COUNT(F4:Q4)/2","v":6},{"$f":"AC4*10^8+Y4*10^6/2+Z4*10^4/2+AA4*10^2/2+AB4/2","v":40050505050},{"$f":"IF(B4<>\"\",RANK(AE4,AE$4:AE$73,0),\"\")","v":1}]
[2,"Ida Bjørgen","Lundamo IL",270,"F",7,{"$f":"IF(F5>0,INDEX(Poeng!$A$1:$B$100,F5,2),\"\")","v":36},2,{"$f":"IF(H5>0,INDEX(Poeng!$A$1:$B$100,H5,2),\"\")","v":80},2,{"$f":"IF(J5>0,INDEX(Poeng!$A$1:$B$100,J5,2),\"\")","v":80},4,{"$f":"IF(L5>0,INDEX(Poeng!$A$1:$B$100,L5,2),\"\")","v":50},3,{"$f":"IF(N5>0,INDEX(Poeng!$A$1:$B$100,N5,2),\"\")","v":60},6,{"$f":"IF(P5>0,INDEX(Poeng!$A$1:$B$100,P5,2),\"\")","v":40},36,80,80,50,60,40,{"$f":"IF(#REF!>0,#REF!,0)","v":{"$error":"#REF!"}},80,80,60,50,270,6,27040403025,2]
[3,"Wilma Skjetlein","Byåsen IL",250,"F",6,{"$f":"IF(F6>0,INDEX(Poeng!$A$1:$B$100,F6,2),\"\")","v":40},null,{"$f":"IF(H6>0,INDEX(Poeng!$A$1:$B$100,H6,2),\"\")","v":""},null,{"$f":"IF(J6>0,INDEX(Poeng!$A$1:$B$100,J6,2),\"\")","v":""},2,{"$f":"IF(L6>0,INDEX(Poeng!$A$1:$B$100,L6,2),\"\")","v":80},2,{"$f":"IF(N6>0,INDEX(Poeng!$A$1:$B$100,N6,2),\"\")","v":80},4,{"$f":"IF(P6>0,INDEX(Poeng!$A$1:$B$100,P6,2),\"\")","v":50},40,0,0,80,80,50,{"$f":"IF(#REF!>0,#REF!,0)","v":{"$error":"#REF!"}},80,80,50,40,250,4,25040402520,3]
[4,"Emilie Solheim Johnsen","Byåsen IL",240,"F",4,{"$f":"IF(F7>0,INDEX(Poeng!$A$1:$B$100,F7,2),\"\")","v":50},3,{"$f":"IF(H7>0,INDEX(Poeng!$A$1:$B$100,H7,2),\"\")","v":60},3,{"$f":"IF(J7>0,INDEX(Poeng!$A$1:$B$100,J7,2),\"\")","v":60},3,{"$f":"IF(L7>0,INDEX(Poeng!$A$1:$B$100,L7,2),\"\")","v":60},4,{"$f":"IF(N7>0,INDEX(Poeng!$A$1:$B$100,N7,2),\"\")","v":50},3,{"$f":"IF(P7>0,INDEX(Poeng!$A$1:$B$100,P7,2),\"\")","v":60},50,60,60,60,50,60,{"$f":"IF(#REF!>0,#REF!,0)","v":{"$error":"#REF!"}},60,60,60,60,240,6,24030303030,4]
[5,"Guro Hovin Storlimo","Lundamo IL",225,"F",5,{"$f":"IF(F8>0,INDEX(Poeng!$A$1:$B$100,F8,2),\"\")","v":45},4,{"$f":"IF(H8>0,INDEX(Poeng!$A$1:$B$100,H8,2),\"\")","v":50},4,{"$f":"IF(J8>0,INDEX(Poeng!$A$1:$B$100,J8,2),\"\")","v":50},6,{"$f":"IF(L8>0,INDEX(Poeng!$A$1:$B$100,L8,2),\"\")","v":40},5,{"$f":"IF(N8>0,INDEX(Poeng!$A$1:$B$100,N8,2),\"\")","v":45},2,{"$f":"IF(P8>0,INDEX(Poeng!$A$1:$B$100,P8,2),\"\")","v":80},45,50,50,40,45,80,{"$f":"IF(#REF!>0,#REF!,0)","v":{"$error":"#REF!"}},80,50,50,45,225,6,22540252522.5,5]
[6,"Marit Kvåle Gissinger","Malvik IL",149,"F",null,{"$f":"IF(F9>0,INDEX(Poeng!$A$1:$B$100,F9,2),\"\")","v":""},7,{"$f":"IF(H9>0,INDEX(Poeng!$A$1:$B$100,H9,2),\"\")","v":36},7,{"$f":"IF(J9>0,INDEX(Poeng!$A$1:$B$100,J9,2),\"\")","v":36},8,{"$f":"IF(L9>0,INDEX(Poeng!$A$1:$B$100,L9,2),\"\")","v":32},null,{"$f":"IF(N9>0,INDEX(Poeng!$A$1:$B$100,N9,2),\"\")","v":""},5,{"$f":"IF(P9>0,INDEX(Poeng!$A$1:$B$100,P9,2),\"\")","v":45},0,36,36,32,0,45,{"$f":"IF(#REF!>0,#REF!,0)","v":{"$error":"#REF!"}},45,36,36,32,149,4,14922681816,6]
[7,"Ragnhild Arnsteindatter Hansen","Malvik IL",133,"F",null,{"$f":"IF(F10>0,INDEX(Poeng!$A$1:$B$100,F10,2),\"\")","v":""},6,{"$f":"IF(H10>0,INDEX(Poeng!$A$1:$B$100,H10,2),\"\")","v":40},9,{"$f":"IF(J10>0,INDEX(Poeng!$A$1:$B$100,J10,2),\"\")","v":29},null,{"$f":"IF(L10>0,INDEX(Poeng!$A$1:$B$100,L10,2),\"\")","v":""},8,{"$f":"IF(N10>0,INDEX(Poeng!$A$1:$B$100,N10,2),\"\")","v":32},8,{"$f":"IF(P10>0,INDEX(Poeng!$A$1:$B$100,P10,2),\"\")","v":32},0,40,29,0,32,32,{"$f":"IF(#REF!>0,#REF!,0)","v":{"$error":"#REF!"}},40,32,32,29,133,4,13320161614.5,7]
[8,"Elin Græsli","Tydal IL",112," ",8,{"$f":"IF(F11>0,INDEX(Poeng!$A$1:$B$100,F11,2),\"\")","v":32},null,{"$f":"IF(H11>0,INDEX(Poeng!$A$1:$B$100,H11,2),\"\")","v":""},6,{"$f":"IF(J11>0,INDEX(Poeng!$A$1:$B$100,J11,2),\"\")","v":40},null,{"$f":"IF(L11>0,INDEX(Poeng!$A$1:$B$100,L11,2),\"\")","v":""},6,{"$f":"IF(N11>0,INDEX(Poeng!$A$1:$B$100,N11,2),\"\")","v":40},null,{"$f":"IF(P11>0,INDEX(Poeng!$A$1:$B$100,P11,2),\"\")","v":""},32,0,40,0,40,0,{"$f":"IF(#REF!>0,#REF!,0)","v":{"$error":"#REF!"}},40,40,32,0,112,3,11220201600,8]
[9,"Hedda Gyllan Romulslie","Malvik IL",104," ",null,{"$f":"IF(F12>0,INDEX(Poeng!$A$1:$B$100,F12,2),\"\")","v":""},null,{"$f":"IF(H12>0,INDEX(Poeng!$A$1:$B$100,H12,2),\"\")","v":""},8,{"$f":"IF(J12>0,INDEX(Poeng!$A$1:$B$100,J12,2),\"\")","v":32},null,{"$f":"IF(L12>0,INDEX(Poeng!$A$1:$B$100,L12,2),\"\")","v":""},7,{"$f":"IF(N12>0,INDEX(Poeng!$A$1:$B$100,N12,2),\"\")","v":36},7,{"$f":"IF(P12>0,INDEX(Poeng!$A$1:$B$100,P12,2),\"\")","v":36},0,0,32,0,36,36,{"$f":"IF(#REF!>0,#REF!,0)","v":{"$error":"#REF!"}},36,36,32,0,104,3,10418181600,9]
[10,"Stine Hårstad","Rennebu IL",100," ",1,{"$f":"IF(F13>0,INDEX(Poeng!$A$1:$B$100,F13,2),\"\")","v":100},null,{"$f":"IF(H13>0,INDEX(Poeng!$A$1:$B$100,H13,2),\"\")","v":""},null,{"$f":"IF(J13>0,INDEX(Poeng!$A$1:$B$100,J13,2),\"\")","v":""},null,{"$f":"IF(L13>0,INDEX(Poeng!$A$1:$B$100,L13,2),\"\")","v":""},null,{"$f":"IF(N13>0,INDEX(Poeng!$A$1:$B$100,N13,2),\"\")","v":""},null,{"$f":"IF(P13>0,INDEX(Poeng!$A$1:$B$100,P13,2),\"\")","v":""},100,0,0,0,0,0,{"$f":"IF(#REF!>0,#REF!,0)","v":{"$error":"#REF!"}},100,0,0,0,100,1,10050000000,10]
[11,"Thilde Melting Kvam","Buvik IL",100," ",9,{"$f":"IF(F14>0,INDEX(Poeng!$A$1:$B$100,F14,2),\"\")","v":29},5,{"$f":"IF(H14>0,INDEX(Poeng!$A$1:$B$100,H14,2),\"\")","v":45},null,{"$f":"IF(J14>0,INDEX(Poeng!$A$1:$B$100,J14,2),\"\")","v":""},null,{"$f":"IF(L14>0,INDEX(Poeng!$A$1:$B$100,L14,2),\"\")","v":""},null,{"$f":"IF(N14>0,INDEX(Poeng!$A$1:$B$100,N14,2),\"\")","v":""},10,{"$f":"IF(P14>0,INDEX(Poeng!$A$1:$B$100,P14,2),\"\")","v":26},29,45,0,0,0,26,{"$f":"IF(#REF!>0,#REF!,0)","v":{"$error":"#REF!"}},45,29,26,0,100,3,10022646300,11]
[12,"Vilmas Rathe Hauge","Byaasen Skiklub",90," ",null,{"$f":"IF(F15>0,INDEX(Poeng!$A$1:$B$100,F15,2),\"\")","v":""},null,{"$f":"IF(H15>0,INDEX(Poeng!$A$1:$B$100,H15,2),\"\")","v":""},5,{"$f":"IF(J15>0,INDEX(Poeng!$A$1:$B$100,J15,2),\"\")","v":45},5,{"$f":"IF(L15>0,INDEX(Poeng!$A$1:$B$100,L15,2),\"\")","v":45},null,{"$f":"IF(N15>0,INDEX(Poeng!$A$1:$B$100,N15,2),\"\")","v":""},null,{"$f":"IF(P15>0,INDEX(Poeng!$A$1:$B$100,P15,2),\"\")","v":""},0,0,45,45,0,0,{"$f":"IF(#REF!>0,#REF!,0)","v":{"$error":"#REF!"}},45,45,0,0,90,2,9022725000,12]
[13,"Malin Skogstad","Leik, IL",60," ",3,{"$f":"IF(F16>0,INDEX(Poeng!$A$1:$B$100,F16,2),\"\")","v":60},null,{"$f":"IF(H16>0,INDEX(Poeng!$A$1:$B$100,H16,2),\"\")","v":""},null,{"$f":"IF(J16>0,INDEX(Poeng!$A$1:$B$100,J16,2),\"\")","v":""},null,{"$f":"IF(L16>0,INDEX(Poeng!$A$1:$B$100,L16,2),\"\")","v":""},null,{"$f":"IF(N16>0,INDEX(Poeng!$A$1:$B$100,N16,2),\"\")","v":""},null,{"$f":"IF(P16>0,INDEX(Poeng!$A$1:$B$100,P16,2),\"\")","v":""},60,0,0,0,0,0,{"$f":"IF(#REF!>0,#REF!,0)","v":{"$error":"#REF!"}},60,0,0,0,60,1,6030000000,13]
[14,"Tuva Husby Grandetrø","Skaun IL",36," ",null,{"$f":"IF(F17>0,INDEX(Poeng!$A$1:$B$100,F17,2),\"\")","v":""},null,{"$f":"IF(H17>0,INDEX(Poeng!$A$1:$B$100,H17,2),\"\")","v":""},null,{"$f":"IF(J17>0,INDEX(Poeng!$A$1:$B$100,J17,2),\"\")","v":""},7,{"$f":"IF(L17>0,INDEX(Poeng!$A$1:$B$100,L17,2),\"\")","v":36},null,{"$f":"IF(N17>0,INDEX(Poeng!$A$1:$B$100,N17,2),\"\")","v":""},null,{"$f":"IF(P17>0,INDEX(Poeng!$A$1:$B$100,P17,2),\"\")","v":""},0,0,0,36,0,0,{"$f":"IF(#REF!>0,#REF!,0)","v":{"$error":"#REF!"}},36,0,0,0,36,1,3618000000,14]
[15,"Vilma Elshaug-Tørstad","Strindheim IL ",29," ",null,{"$f":"IF(F18>0,INDEX(Poeng!$A$1:$B$100,F18,2),\"\")","v":""},null,{"$f":"IF(H18>0,INDEX(Poeng!$A$1:$B$100,H18,2),\"\")","v":""},null,{"$f":"IF(J18>0,INDEX(Poeng!$A$1:$B$100,J18,2),\"\")","v":""},null,{"$f":"IF(L18>0,INDEX(Poeng!$A$1:$B$100,L18,2),\"\")","v":""},null,{"$f":"IF(N18>0,INDEX(Poeng!$A$1:$B$100,N18,2),\"\")","v":""},9,{"$f":"IF(P18>0,INDEX(Poeng!$A$1:$B$100,P18,2),\"\")","v":29},{"$f":"IF(F18>0,G18,0)","v":0},{"$f":"IF(H18>0,I18,0)","v":0},{"$f":"IF(J18>0,K18,0)","v":0},{"$f":"IF(L18>0,M18,0)","v":0},{"$f":"IF(N18>0,O18,0)","v":0},{"$f":"IF(P18>0,Q18,0)","v":29},{"$f":"IF(#REF!>0,#REF!,0)","v":{"$error":"#REF!"}},{"$f":"LARGE(R18:W18,1)","v":29},{"$f":"LARGE(R18:W18,2)","v":0},{"$f":"LARGE(R18:W18,3)","v":0},{"$f":"LARGE(R18:W18,4)","v":0},{"$f":"SUM(Y18:AB18)","v":29},{"$f":"COUNT(F18:Q18)/2","v":1},{"$f":"AC18*10^8+Y18*10^6/2+Z18*10^4/2+AA18*10^2/2+AB18/2","v":2914500000},15]
[16,"Elvira Kvarme","Strindheim IL ",26," ",10,{"$f":"IF(F19>0,INDEX(Poeng!$A$1:$B$100,F19,2),\"\")","v":26},null,{"$f":"IF(H19>0,INDEX(Poeng!$A$1:$B$100,H19,2),\"\")","v":""},null,{"$f":"IF(J19>0,INDEX(Poeng!$A$1:$B$100,J19,2),\"\")","v":""},null,{"$f":"IF(L19>0,INDEX(Poeng!$A$1:$B$100,L19,2),\"\")","v":""},null,{"$f":"IF(N19>0,INDEX(Poeng!$A$1:$B$100,N19,2),\"\")","v":""},null,{"$f":"IF(P19>0,INDEX(Poeng!$A$1:$B$100,P19,2),\"\")","v":""},26,0,0,0,0,0,{"$f":"IF(#REF!>0,#REF!,0)","v":{"$error":"#REF!"}},26,0,0,0,26,1,2613000000,16]
[16,"Kjersti Græsli","Tydal IL",26," ",null,{"$f":"IF(F20>0,INDEX(Poeng!$A$1:$B$100,F20,2),\"\")","v":""},null,{"$f":"IF(H20>0,INDEX(Poeng!$A$1:$B$100,H20,2),\"\")","v":""},10,{"$f":"IF(J20>0,INDEX(Poeng!$A$1:$B$100,J20,2),\"\")","v":26},null,{"$f":"IF(L20>0,INDEX(Poeng!$A$1:$B$100,L20,2),\"\")","v":""},null,{"$f":"IF(N20>0,INDEX(Poeng!$A$1:$B$100,N20,2),\"\")","v":""},null,{"$f":"IF(P20>0,INDEX(Poeng!$A$1:$B$100,P20,2),\"\")","v":""},0,0,26,0,0,0,{"$f":"IF(#REF!>0,#REF!,0)","v":{"$error":"#REF!"}},26,0,0,0,26,1,2613000000,16]
[{"$f":"AF21","v":""},null,null,{"$f":"IF(B21<>\"\",AC21,\"\")","v":""},{"$f":"IF(AD21<4,\" \",\"F\")","v":" "},null,{"$f":"IF(F21>0,INDEX(Poeng!$A$1:$B$100,F21,2),\"\")","v":""},null,{"$f":"IF(H21>0,INDEX(Poeng!$A$1:$B$100,H21,2),\"\")","v":""},null,{"$f":"IF(J21>0,INDEX(Poeng!$A$1:$B$100,J21,2),\"\")","v":""},null,{"$f":"IF(L21>0,INDEX(Poeng!$A$1:$B$100,L21,2),\"\")","v":""},null,{"$f":"IF(N21>0,INDEX(Poeng!$A$1:$B$100,N21,2),\"\")","v":""},null,{"$f":"IF(P21>0,INDEX(Poeng!$A$1:$B$100,P21,2),\"\")","v":""},0,0,0,0,0,0,{"$f":"IF(#REF!>0,#REF!,0)","v":{"$error":"#REF!"}},0,0,0,0,0,0,0,""]
["",null,null,""," ",null,{"$f":"IF(F22>0,INDEX(Poeng!$A$1:$B$100,F22,2),\"\")","v":""},null,{"$f":"IF(H22>0,INDEX(Poeng!$A$1:$B$100,H22,2),\"\")","v":""},null,{"$f":"IF(J22>0,INDEX(Poeng!$A$1:$B$100,J22,2),\"\")","v":""},null,{"$f":"IF(L22>0,INDEX(Poeng!$A$1:$B$100,L22,2),\"\")","v":""},null,{"$f":"IF(N22>0,INDEX(Poeng!$A$1:$B$100,N22,2),\"\")","v":""},null,{"$f":"IF(P22>0,INDEX(Poeng!$A$1:$B$100,P22,2),\"\")","v":""},0,0,0,0,0,0,{"$f":"IF(#REF!>0,#REF!,0)","v":{"$error":"#REF!"}},0,0,0,0,0,0,0,""]
["",null,null,""," ",null,{"$f":"IF(F23>0,INDEX(Poeng!$A$1:$B$100,F23,2),\"\")","v":""},null,{"$f":"IF(H23>0,INDEX(Poeng!$A$1:$B$100,H23,2),\"\")","v":""},null,{"$f":"IF(J23>0,INDEX(Poeng!$A$1:$B$100,J23,2),\"\")","v":""},null,{"$f":"IF(L23>0,INDEX(Poeng!$A$1:$B$100,L23,2),\"\")","v":""},null,{"$f":"IF(N23>0,INDEX(Poeng!$A$1:$B$100,N23,2),\"\")","v":""},null,{"$f":"IF(P23>0,INDEX(Poeng!$A$1:$B$100,P23,2),\"\")","v":""},0,0,0,0,0,0,{"$f":"IF(#REF!>0,#REF!,0)","v":{"$error":"#REF!"}},0,0,0,0,0,0,0,""]
["",null,null,""," ",null,{"$f":"IF(F24>0,INDEX(Poeng!$A$1:$B$100,F24,2),\"\")","v":""},null,{"$f":"IF(H24>0,INDEX(Poeng!$A$1:$B$100,H24,2),\"\")","v":""},null,{"$f":"IF(J24>0,INDEX(Poeng!$A$1:$B$100,J24,2),\"\")","v":""},null,{"$f":"IF(L24>0,INDEX(Poeng!$A$1:$B$100,L24,2),\"\")","v":""},null,{"$f":"IF(N24>0,INDEX(Poeng!$A$1:$B$100,N24,2),\"\")","v":""},null,{"$f":"IF(P24>0,INDEX(Poeng!$A$1:$B$100,P24,2),\"\")","v":""},0,0,0,0,0,0,{"$f":"IF(#REF!>0,#REF!,0)","v":{"$error":"#REF!"}},0,0,0,0,0,0,0,""]
[null,null,null,null,null,null,{"$f":"IF(F25>0,INDEX(Poeng!$A$1:$B$100,F25,2),\"\")","v":""},null,{"$f":"IF(H25>0,INDEX(Poeng!$A$1:$B$100,H25,2),\"\")","v":""},null,{"$f":"IF(J25>0,INDEX(Poeng!$A$1:$B$100,J25,2),\"\")","v":""},null,{"$f":"IF(L25>0,INDEX(Poeng!$A$1:$B$100,L25,2),\"\")","v":""},null,{"$f":"IF(N25>0,INDEX(Poeng!$A$1:$B$100,N25,2),\"\")","v":""},null,{"$f":"IF(P25>0,INDEX(Poeng!$A$1:$B$100,P25,2),\"\")","v":""},0,0,0,0,0,0,{"$f":"IF(#REF!>0,#REF!,0)","v":{"$error":"#REF!"}},0,0,0,0,0,0,0,""]
[null,null,null,null,{"$f":"IF(AD26<4,\" \",\"F\")","v":" "},null,{"$f":"IF(F26>0,INDEX(Poeng!$A$1:$B$100,F26,2),\"\")","v":""},null,{"$f":"IF(H26>0,INDEX(Poeng!$A$1:$B$100,H26,2),\"\")","v":""},null,{"$f":"IF(J26>0,INDEX(Poeng!$A$1:$B$100,J26,2),\"\")","v":""},null,{"$f":"IF(L26>0,INDEX(Poeng!$A$1:$B$100,L26,2),\"\")","v":""},null,{"$f":"IF(N26>0,INDEX(Poeng!$A$1:$B$100,N26,2),\"\")","v":""},null,{"$f":"IF(P26>0,INDEX(Poeng!$A$1:$B$100,P26,2),\"\")","v":""},0,0,0,0,0,0,{"$f":"IF(#REF!>0,#REF!,0)","v":{"$error":"#REF!"}},0,0,0,0,0,0,0,""]
[null,null,null,null," ",null,{"$f":"IF(F27>0,INDEX(Poeng!$A$1:$B$100,F27,2),\"\")","v":""},null,{"$f":"IF(H27>0,INDEX(Poeng!$A$1:$B$100,H27,2),\"\")","v":""},null,{"$f":"IF(J27>0,INDEX(Poeng!$A$1:$B$100,J27,2),\"\")","v":""},null,{"$f":"IF(L27>0,INDEX(Poeng!$A$1:$B$100,L27,2),\"\")","v":""},null,{"$f":"IF(N27>0,INDEX(Poeng!$A$1:$B$100,N27,2),\"\")","v":""},null,{"$f":"IF(P27>0,INDEX(Poeng!$A$1:$B$100,P27,2),\"\")","v":""},0,0,0,0,0,0,{"$f":"IF(#REF!>0,#REF!,0)","v":{"$error":"#REF!"}},0,0,0,0,0,0,0,""]
[null,null,null,null," ",null,{"$f":"IF(F28>0,INDEX(Poeng!$A$1:$B$100,F28,2),\"\")","v":""},null,{"$f":"IF(H28>0,INDEX(Poeng!$A$1:$B$100,H28,2),\"\")","v":""},null,{"$f":"IF(J28>0,INDEX(Poeng!$A$1:$B$100,J28,2),\"\")","v":""},null,{"$f":"IF(L28>0,INDEX(Poeng!$A$1:$B$100,L28,2),\"\")","v":""},null,{"$f":"IF(N28>0,INDEX(Poeng!$A$1:$B$100,N28,2),\"\")","v":""},null,{"$f":"IF(P28>0,INDEX(Poeng!$A$1:$B$100,P28,2),\"\")","v":""},0,0,0,0,0,0,{"$f":"IF(#REF!>0,#REF!,0)","v":{"$error":"#REF!"}},0,0,0,0,0,0,0,""]
[null,null,null,null," ",null,{"$f":"IF(F29>0,INDEX(Poeng!$A$1:$B$100,F29,2),\"\")","v":""},null,{"$f":"IF(H29>0,INDEX(Poeng!$A$1:$B$100,H29,2),\"\")","v":""},null,{"$f":"IF(J29>0,INDEX(Poeng!$A$1:$B$100,J29,2),\"\")","v":""},null,{"$f":"IF(L29>0,INDEX(Poeng!$A$1:$B$100,L29,2),\"\")","v":""},null,{"$f":"IF(N29>0,INDEX(Poeng!$A$1:$B$100,N29,2),\"\")","v":""},null,{"$f":"IF(P29>0,INDEX(Poeng!$A$1:$B$100,P29,2),\"\")","v":""},0,0,0,0,0,0,{"$f":"IF(#REF!>0,#REF!,0)","v":{"$error":"#REF!"}},0,0,0,0,0,0,0,""]
[null,null,null,null," ",null,{"$f":"IF(F30>0,INDEX(Poeng!$A$1:$B$100,F30,2),\"\")","v":""},null,{"$f":"IF(H30>0,INDEX(Poeng!$A$1:$B$100,H30,2),\"\")","v":""},null,{"$f":"IF(J30>0,INDEX(Poeng!$A$1:$B$100,J30,2),\"\")","v":""},null,{"$f":"IF(L30>0,INDEX(Poeng!$A$1:$B$100,L30,2),\"\")","v":""},null,{"$f":"IF(N30>0,INDEX(Poeng!$A$1:$B$100,N30,2),\"\")","v":""},null,null,0,0,0,0,0,0,{"$f":"IF(#REF!>0,#REF!,0)","v":{"$error":"#REF!"}},0,0,0,0,0,0,0,""]
[null,null,null,null," ",null,{"$f":"IF(F31>0,INDEX(Poeng!$A$1:$B$100,F31,2),\"\")","v":""},null,{"$f":"IF(H31>0,INDEX(Poeng!$A$1:$B$100,H31,2),\"\")","v":""},null,{"$f":"IF(J31>0,INDEX(Poeng!$A$1:$B$100,J31,2),\"\")","v":""},null,{"$f":"IF(L31>0,INDEX(Poeng!$A$1:$B$100,L31,2),\"\")","v":""},null,{"$f":"IF(N31>0,INDEX(Poeng!$A$1:$B$100,N31,2),\"\")","v":""},null,{"$f":"IF(P31>0,INDEX(Poeng!$A$1:$B$100,P31,2),\"\")","v":""},0,0,0,0,0,0,{"$f":"IF(#REF!>0,#REF!,0)","v":{"$error":"#REF!"}},0,0,0,0,0,0,0,""]
[null,null,null,null," ",null,{"$f":"IF(F32>0,INDEX(Poeng!$A$1:$B$100,F32,2),\"\")","v":""},null,{"$f":"IF(H32>0,INDEX(Poeng!$A$1:$B$100,H32,2),\"\")","v":""},null,{"$f":"IF(J32>0,INDEX(Poeng!$A$1:$B$100,J32,2),\"\")","v":""},null,{"$f":"IF(L32>0,INDEX(Poeng!$A$1:$B$100,L32,2),\"\")","v":""},null,{"$f":"IF(N32>0,INDEX(Poeng!$A$1:$B$100,N32,2),\"\")","v":""},null,{"$f":"IF(P32>0,INDEX(Poeng!$A$1:$B$100,P32,2),\"\")","v":""},0,0,0,0,0,0,{"$f":"IF(#REF!>0,#REF!,0)","v":{"$error":"#REF!"}},0,0,0,0,0,0,0,""]
[null,null,null,null," ",null,{"$f":"IF(F33>0,INDEX(Poeng!$A$1:$B$100,F33,2),\"\")","v":""},null,{"$f":"IF(H33>0,INDEX(Poeng!$A$1:$B$100,H33,2),\"\")","v":""},null,{"$f":"IF(J33>0,INDEX(Poeng!$A$1:$B$100,J33,2),\"\")","v":""},null,{"$f":"IF(L33>0,INDEX(Poeng!$A$1:$B$100,L33,2),\"\")","v":""},null,{"$f":"IF(N33>0,INDEX(Poeng!$A$1:$B$100,N33,2),\"\")","v":""},null,{"$f":"IF(P33>0,INDEX(Poeng!$A$1:$B$100,P33,2),\"\")","v":""},0,0,0,0,0,0,{"$f":"IF(#REF!>0,#REF!,0)","v":{"$error":"#REF!"}},0,0,0,0,0,0,0,""]
[null,null,null,null," ",null,{"$f":"IF(F34>0,INDEX(Poeng!$A$1:$B$100,F34,2),\"\")","v":""},null,{"$f":"IF(H34>0,INDEX(Poeng!$A$1:$B$100,H34,2),\"\")","v":""},null,{"$f":"IF(J34>0,INDEX(Poeng!$A$1:$B$100,J34,2),\"\")","v":""},null,{"$f":"IF(L34>0,INDEX(Poeng!$A$1:$B$100,L34,2),\"\")","v":""},null,{"$f":"IF(N34>0,INDEX(Poeng!$A$1:$B$100,N34,2),\"\")","v":""},null,{"$f":"IF(P34>0,INDEX(Poeng!$A$1:$B$100,P34,2),\"\")","v":""},0,0,0,0,0,0,{"$f":"IF(#REF!>0,#REF!,0)","v":{"$error":"#REF!"}},0,0,0,0,0,0,0,""]
[{"$f":"AF35","v":""},null,null,{"$f":"IF(B35<>\"\",AC35,\"\")","v":""},{"$f":"IF(AD35<4,\" \",\"F\")","v":" "},null,{"$f":"IF(F35>0,INDEX(Poeng!$A$1:$B$100,F35,2),\"\")","v":""},null,{"$f":"IF(H35>0,INDEX(Poeng!$A$1:$B$100,H35,2),\"\")","v":""},null,{"$f":"IF(J35>0,INDEX(Poeng!$A$1:$B$100,J35,2),\"\")","v":""},null,{"$f":"IF(L35>0,INDEX(Poeng!$A$1:$B$100,L35,2),\"\")","v":""},null,{"$f":"IF(N35>0,INDEX(Poeng!$A$1:$B$100,N35,2),\"\")","v":""},null,{"$f":"IF(P35>0,INDEX(Poeng!$A$1:$B$100,P35,2),\"\")","v":""},0,0,0,0,0,0,{"$f":"IF(#REF!>0,#REF!,0)","v":{"$error":"#REF!"}},0,0,0,0,0,0,0,""]
[{"$f":"AF36","v":""},null,null,{"$f":"IF(B36<>\"\",AC36,\"\")","v":""}," ",null,{"$f":"IF(F36>0,INDEX(Poeng!$A$1:$B$100,F36,2),\"\")","v":""},null,{"$f":"IF(H36>0,INDEX(Poeng!$A$1:$B$100,H36,2),\"\")","v":""},null,{"$f":"IF(J36>0,INDEX(Poeng!$A$1:$B$100,J36,2),\"\")","v":""},null,{"$f":"IF(L36>0,INDEX(Poeng!$A$1:$B$100,L36,2),\"\")","v":""},null,{"$f":"IF(N36>0,INDEX(Poeng!$A$1:$B$100,N36,2),\"\")","v":""},null,{"$f":"IF(P36>0,INDEX(Poeng!$A$1:$B$100,P36,2),\"\")","v":""},{"$f":"IF(F36>0,G36,0)","v":0},{"$f":"IF(H36>0,I36,0)","v":0},{"$f":"IF(J36>0,K36,0)","v":0},{"$f":"IF(L36>0,M36,0)","v":0},{"$f":"IF(N36>0,O36,0)","v":0},{"$f":"IF(P36>0,Q36,0)","v":0},{"$f":"IF(#REF!>0,#REF!,0)","v":{"$error":"#REF!"}},{"$f":"LARGE(R36:W36,1)","v":0},{"$f":"LARGE(R36:W36,2)","v":0},{"$f":"LARGE(R36:W36,3)","v":0},{"$f":"LARGE(R36:W36,4)","v":0},{"$f":"SUM(Y36:AB36)","v":0},{"$f":"COUNT(F36:Q36)/2","v":0},{"$f":"AC36*10^8+Y36*10^6/2+Z36*10^4/2+AA36*10^2/2+AB36/2","v":0},{"$f":"IF(B36<>\"\",RANK(AE36,AE$4:AE$73,0),\"\")","v":""}]
["",null,null,""," ",null,{"$f":"IF(F37>0,INDEX(Poeng!$A$1:$B$100,F37,2),\"\")","v":""},null,{"$f":"IF(H37>0,INDEX(Poeng!$A$1:$B$100,H37,2),\"\")","v":""},null,{"$f":"IF(J37>0,INDEX(Poeng!$A$1:$B$100,J37,2),\"\")","v":""},null,{"$f":"IF(L37>0,INDEX(Poeng!$A$1:$B$100,L37,2),\"\")","v":""},null,{"$f":"IF(N37>0,INDEX(Poeng!$A$1:$B$100,N37,2),\"\")","v":""},null,{"$f":"IF(P37>0,INDEX(Poeng!$A$1:$B$100,P37,2),\"\")","v":""},0,0,0,0,0,0,{"$f":"IF(#REF!>0,#REF!,0)","v":{"$error":"#REF!"}},0,0,0,0,0,0,0,""]
["",null,null,""," ",null,{"$f":"IF(F38>0,INDEX(Poeng!$A$1:$B$100,F38,2),\"\")","v":""},null,{"$f":"IF(H38>0,INDEX(Poeng!$A$1:$B$100,H38,2),\"\")","v":""},null,{"$f":"IF(J38>0,INDEX(Poeng!$A$1:$B$100,J38,2),\"\")","v":""},null,{"$f":"IF(L38>0,INDEX(Poeng!$A$1:$B$100,L38,2),\"\")","v":""},null,{"$f":"IF(N38>0,INDEX(Poeng!$A$1:$B$100,N38,2),\"\")","v":""},null,{"$f":"IF(P38>0,INDEX(Poeng!$A$1:$B$100,P38,2),\"\")","v":""},0,0,0,0,0,0,{"$f":"IF(#REF!>0,#REF!,0)","v":{"$error":"#REF!"}},0,0,0,0,0,0,0,""]
["",null,null,""," ",null,{"$f":"IF(F39>0,INDEX(Poeng!$A$1:$B$100,F39,2),\"\")","v":""},null,{"$f":"IF(H39>0,INDEX(Poeng!$A$1:$B$100,H39,2),\"\")","v":""},null,{"$f":"IF(J39>0,INDEX(Poeng!$A$1:$B$100,J39,2),\"\")","v":""},null,{"$f":"IF(L39>0,INDEX(Poeng!$A$1:$B$100,L39,2),\"\")","v":""},null,{"$f":"IF(N39>0,INDEX(Poeng!$A$1:$B$100,N39,2),\"\")","v":""},null,{"$f":"IF(P39>0,INDEX(Poeng!$A$1:$B$100,P39,2),\"\")","v":""},0,0,0,0,0,0,{"$f":"IF(#REF!>0,#REF!,0)","v":{"$error":"#REF!"}},0,0,0,0,0,0,0,""]
["",null,null,""," ",null,{"$f":"IF(F40>0,INDEX(Poeng!$A$1:$B$100,F40,2),\"\")","v":""},null,{"$f":"IF(H40>0,INDEX(Poeng!$A$1:$B$100,H40,2),\"\")","v":""},null,{"$f":"IF(J40>0,INDEX(Poeng!$A$1:$B$100,J40,2),\"\")","v":""},null,{"$f":"IF(L40>0,INDEX(Poeng!$A$1:$B$100,L40,2),\"\")","v":""},null,{"$f":"IF(N40>0,INDEX(Poeng!$A$1:$B$100,N40,2),\"\")","v":""},null,{"$f":"IF(P40>0,INDEX(Poeng!$A$1:$B$100,P40,2),\"\")","v":""},0,0,0,0,0,0,{"$f":"IF(#REF!>0,#REF!,0)","v":{"$error":"#REF!"}},0,0,0,0,0,0,0,""]
["",null,null,""," ",null,{"$f":"IF(F41>0,INDEX(Poeng!$A$1:$B$100,F41,2),\"\")","v":""},null,{"$f":"IF(H41>0,INDEX(Poeng!$A$1:$B$100,H41,2),\"\")","v":""},null,{"$f":"IF(J41>0,INDEX(Poeng!$A$1:$B$100,J41,2),\"\")","v":""},null,{"$f":"IF(L41>0,INDEX(Poeng!$A$1:$B$100,L41,2),\"\")","v":""},null,{"$f":"IF(N41>0,INDEX(Poeng!$A$1:$B$100,N41,2),\"\")","v":""},null,{"$f":"IF(P41>0,INDEX(Poeng!$A$1:$B$100,P41,2),\"\")","v":""},0,0,0,0,0,0,{"$f":"IF(#REF!>0,#REF!,0)","v":{"$error":"#REF!"}},0,0,0,0,0,0,0,""]
["",null,null,""," ",null,{"$f":"IF(F42>0,INDEX(Poeng!$A$1:$B$100,F42,2),\"\")","v":""},null,{"$f":"IF(H42>0,INDEX(Poeng!$A$1:$B$100,H42,2),\"\")","v":""},null,{"$f":"IF(J42>0,INDEX(Poeng!$A$1:$B$100,J42,2),\"\")","v":""},null,{"$f":"IF(L42>0,INDEX(Poeng!$A$1:$B$100,L42,2),\"\")","v":""},null,{"$f":"IF(N42>0,INDEX(Poeng!$A$1:$B$100,N42,2),\"\")","v":""},null,{"$f":"IF(P42>0,INDEX(Poeng!$A$1:$B$100,P42,2),\"\")","v":""},0,0,0,0,0,0,{"$f":"IF(#REF!>0,#REF!,0)","v":{"$error":"#REF!"}},0,0,0,0,0,0,0,""]
["",null,null,""," ",null,{"$f":"IF(F43>0,INDEX(Poeng!$A$1:$B$100,F43,2),\"\")","v":""},null,{"$f":"IF(H43>0,INDEX(Poeng!$A$1:$B$100,H43,2),\"\")","v":""},null,{"$f":"IF(J43>0,INDEX(Poeng!$A$1:$B$100,J43,2),\"\")","v":""},null,{"$f":"IF(L43>0,INDEX(Poeng!$A$1:$B$100,L43,2),\"\")","v":""},null,{"$f":"IF(N43>0,INDEX(Poeng!$A$1:$B$100,N43,2),\"\")","v":""},null,{"$f":"IF(P43>0,INDEX(Poeng!$A$1:$B$100,P43,2),\"\")","v":""},0,0,0,0,0,0,{"$f":"IF(#REF!>0,#REF!,0)","v":{"$error":"#REF!"}},0,0,0,0,0,0,0,""]
["",null,null,""," ",null,{"$f":"IF(F44>0,INDEX(Poeng!$A$1:$B$100,F44,2),\"\")","v":""},null,{"$f":"IF(H44>0,INDEX(Poeng!$A$1:$B$100,H44,2),\"\")","v":""},null,{"$f":"IF(J44>0,INDEX(Poeng!$A$1:$B$100,J44,2),\"\")","v":""},null,{"$f":"IF(L44>0,INDEX(Poeng!$A$1:$B$100,L44,2),\"\")","v":""},null,{"$f":"IF(N44>0,INDEX(Poeng!$A$1:$B$100,N44,2),\"\")","v":""},null,{"$f":"IF(P44>0,INDEX(Poeng!$A$1:$B$100,P44,2),\"\")","v":""},0,0,0,0,0,0,{"$f":"IF(#REF!>0,#REF!,0)","v":{"$error":"#REF!"}},0,0,0,0,0,0,0,""]
["",null,null,""," ",null,{"$f":"IF(F45>0,INDEX(Poeng!$A$1:$B$100,F45,2),\"\")","v":""},null,{"$f":"IF(H45>0,INDEX(Poeng!$A$1:$B$100,H45,2),\"\")","v":""},null,{"$f":"IF(J45>0,INDEX(Poeng!$A$1:$B$100,J45,2),\"\")","v":""},null,{"$f":"IF(L45>0,INDEX(Poeng!$A$1:$B$100,L45,2),\"\")","v":""},null,{"$f":"IF(N45>0,INDEX(Poeng!$A$1:$B$100,N45,2),\"\")","v":""},null,{"$f":"IF(P45>0,INDEX(Poeng!$A$1:$B$100,P45,2),\"\")","v":""},0,0,0,0,0,0,{"$f":"IF(#REF!>0,#REF!,0)","v":{"$error":"#REF!"}},0,0,0,0,0,0,0,""]
["",null,null,""," ",null,{"$f":"IF(F46>0,INDEX(Poeng!$A$1:$B$100,F46,2),\"\")","v":""},null,{"$f":"IF(H46>0,INDEX(Poeng!$A$1:$B$100,H46,2),\"\")","v":""},null,{"$f":"IF(J46>0,INDEX(Poeng!$A$1:$B$100,J46,2),\"\")","v":""},null,{"$f":"IF(L46>0,INDEX(Poeng!$A$1:$B$100,L46,2),\"\")","v":""},null,{"$f":"IF(N46>0,INDEX(Poeng!$A$1:$B$100,N46,2),\"\")","v":""},null,{"$f":"IF(P46>0,INDEX(Poeng!$A$1:$B$100,P46,2),\"\")","v":""},0,0,0,0,0,0,{"$f":"IF(#REF!>0,#REF!,0)","v":{"$error":"#REF!"}},0,0,0,0,0,0,0,""]
["",null,null,""," ",null,{"$f":"IF(F47>0,INDEX(Poeng!$A$1:$B$100,F47,2),\"\")","v":""},null,{"$f":"IF(H47>0,INDEX(Poeng!$A$1:$B$100,H47,2),\"\")","v":""},null,{"$f":"IF(J47>0,INDEX(Poeng!$A$1:$B$100,J47,2),\"\")","v":""},null,{"$f":"IF(L47>0,INDEX(Poeng!$A$1:$B$100,L47,2),\"\")","v":""},null,{"$f":"IF(N47>0,INDEX(Poeng!$A$1:$B$100,N47,2),\"\")","v":""},null,{"$f":"IF(P47>0,INDEX(Poeng!$A$1:$B$100,P47,2),\"\")","v":""},0,0,0,0,0,0,{"$f":"IF(#REF!>0,#REF!,0)","v":{"$error":"#REF!"}},0,0,0,0,0,0,0,""]
["",null,null,""," ",null,{"$f":"IF(F48>0,INDEX(Poeng!$A$1:$B$100,F48,2),\"\")","v":""},null,{"$f":"IF(H48>0,INDEX(Poeng!$A$1:$B$100,H48,2),\"\")","v":""},null,{"$f":"IF(J48>0,INDEX(Poeng!$A$1:$B$100,J48,2),\"\")","v":""},null,{"$f":"IF(L48>0,INDEX(Poeng!$A$1:$B$100,L48,2),\"\")","v":""},null,{"$f":"IF(N48>0,INDEX(Poeng!$A$1:$B$100,N48,2),\"\")","v":""},null,{"$f":"IF(P48>0,INDEX(Poeng!$A$1:$B$100,P48,2),\"\")","v":""},0,0,0,0,0,0,{"$f":"IF(#REF!>0,#REF!,0)","v":{"$error":"#REF!"}},0,0,0,0,0,0,0,""]
["",null,null,""," ",null,null,null,{"$f":"IF(H49>0,INDEX(Poeng!$A$1:$B$100,H49,2),\"\")","v":""},null,{"$f":"IF(J49>0,INDEX(Poeng!$A$1:$B$100,J49,2),\"\")","v":""},null,{"$f":"IF(L49>0,INDEX(Poeng!$A$1:$B$100,L49,2),\"\")","v":""},null,{"$f":"IF(N49>0,INDEX(Poeng!$A$1:$B$100,N49,2),\"\")","v":""},null,{"$f":"IF(P49>0,INDEX(Poeng!$A$1:$B$100,P49,2),\"\")","v":""},0,0,0,0,0,0,{"$f":"IF(#REF!>0,#REF!,0)","v":{"$error":"#REF!"}},0,0,0,0,0,0,0,""]
["",null,null,""," ",null,null,null,{"$f":"IF(H50>0,INDEX(Poeng!$A$1:$B$100,H50,2),\"\")","v":""},null,{"$f":"IF(J50>0,INDEX(Poeng!$A$1:$B$100,J50,2),\"\")","v":""},null,{"$f":"IF(L50>0,INDEX(Poeng!$A$1:$B$100,L50,2),\"\")","v":""},null,{"$f":"IF(N50>0,INDEX(Poeng!$A$1:$B$100,N50,2),\"\")","v":""},null,{"$f":"IF(P50>0,INDEX(Poeng!$A$1:$B$100,P50,2),\"\")","v":""},0,0,0,0,0,0,{"$f":"IF(#REF!>0,#REF!,0)","v":{"$error":"#REF!"}},0,0,0,0,0,0,0,""]
["",null,null,""," ",null,null,null,{"$f":"IF(H51>0,INDEX(Poeng!$A$1:$B$100,H51,2),\"\")","v":""},null,{"$f":"IF(J51>0,INDEX(Poeng!$A$1:$B$100,J51,2),\"\")","v":""},null,{"$f":"IF(L51>0,INDEX(Poeng!$A$1:$B$100,L51,2),\"\")","v":""},null,{"$f":"IF(N51>0,INDEX(Poeng!$A$1:$B$100,N51,2),\"\")","v":""},null,{"$f":"IF(P51>0,INDEX(Poeng!$A$1:$B$100,P51,2),\"\")","v":""},0,0,0,0,0,0,{"$f":"IF(#REF!>0,#REF!,0)","v":{"$error":"#REF!"}},0,0,0,0,0,0,0,""]
["",null,null,""," ",null,null,null,{"$f":"IF(H52>0,INDEX(Poeng!$A$1:$B$100,H52,2),\"\")","v":""},null,{"$f":"IF(J52>0,INDEX(Poeng!$A$1:$B$100,J52,2),\"\")","v":""},null,{"$f":"IF(L52>0,INDEX(Poeng!$A$1:$B$100,L52,2),\"\")","v":""},null,{"$f":"IF(N52>0,INDEX(Poeng!$A$1:$B$100,N52,2),\"\")","v":""},null,{"$f":"IF(P52>0,INDEX(Poeng!$A$1:$B$100,P52,2),\"\")","v":""},0,0,0,0,0,0,{"$f":"IF(#REF!>0,#REF!,0)","v":{"$error":"#REF!"}},0,0,0,0,0,0,0,""]
["",null,null,""," ",null,null,null,{"$f":"IF(H53>0,INDEX(Poeng!$A$1:$B$100,H53,2),\"\")","v":""},null,{"$f":"IF(J53>0,INDEX(Poeng!$A$1:$B$100,J53,2),\"\")","v":""},null,{"$f":"IF(L53>0,INDEX(Poeng!$A$1:$B$100,L53,2),\"\")","v":""},null,{"$f":"IF(N53>0,INDEX(Poeng!$A$1:$B$100,N53,2),\"\")","v":""},null,{"$f":"IF(P53>0,INDEX(Poeng!$A$1:$B$100,P53,2),\"\")","v":""},0,0,0,0,0,0,{"$f":"IF(#REF!>0,#REF!,0)","v":{"$error":"#REF!"}},0,0,0,0,0,0,0,""]
["",null,null,""," ",null,null,null,{"$f":"IF(H54>0,INDEX(Poeng!$A$1:$B$100,H54,2),\"\")","v":""},null,{"$f":"IF(J54>0,INDEX(Poeng!$A$1:$B$100,J54,2),\"\")","v":""},null,{"$f":"IF(L54>0,INDEX(Poeng!$A$1:$B$100,L54,2),\"\")","v":""},null,{"$f":"IF(N54>0,INDEX(Poeng!$A$1:$B$100,N54,2),\"\")","v":""},null,{"$f":"IF(P54>0,INDEX(Poeng!$A$1:$B$100,P54,2),\"\")","v":""},0,0,0,0,0,0,{"$f":"IF(#REF!>0,#REF!,0)","v":{"$error":"#REF!"}},0,0,0,0,0,0,0,""]
["",null,null,""," ",null,null,null,{"$f":"IF(H55>0,INDEX(Poeng!$A$1:$B$100,H55,2),\"\")","v":""},null,{"$f":"IF(J55>0,INDEX(Poeng!$A$1:$B$100,J55,2),\"\")","v":""},null,{"$f":"IF(L55>0,INDEX(Poeng!$A$1:$B$100,L55,2),\"\")","v":""},null,{"$f":"IF(N55>0,INDEX(Poeng!$A$1:$B$100,N55,2),\"\")","v":""},null,{"$f":"IF(P55>0,INDEX(Poeng!$A$1:$B$100,P55,2),\"\")","v":""},0,0,0,0,0,0,{"$f":"IF(#REF!>0,#REF!,0)","v":{"$error":"#REF!"}},0,0,0,0,0,0,0,""]
["",null,null,""," ",null,null,null,{"$f":"IF(H56>0,INDEX(Poeng!$A$1:$B$100,H56,2),\"\")","v":""},null,{"$f":"IF(J56>0,INDEX(Poeng!$A$1:$B$100,J56,2),\"\")","v":""},null,{"$f":"IF(L56>0,INDEX(Poeng!$A$1:$B$100,L56,2),\"\")","v":""},null,{"$f":"IF(N56>0,INDEX(Poeng!$A$1:$B$100,N56,2),\"\")","v":""},null,{"$f":"IF(P56>0,INDEX(Poeng!$A$1:$B$100,P56,2),\"\")","v":""},0,0,0,0,0,0,{"$f":"IF(#REF!>0,#REF!,0)","v":{"$error":"#REF!"}},0,0,0,0,0,0,0,""]
["",null,null,""," ",null,null,null,{"$f":"IF(H57>0,INDEX(Poeng!$A$1:$B$100,H57,2),\"\")","v":""},null,{"$f":"IF(J57>0,INDEX(Poeng!$A$1:$B$100,J57,2),\"\")","v":""},null,{"$f":"IF(L57>0,INDEX(Poeng!$A$1:$B$100,L57,2),\"\")","v":""},null,{"$f":"IF(N57>0,INDEX(Poeng!$A$1:$B$100,N57,2),\"\")","v":""},null,{"$f":"IF(P57>0,INDEX(Poeng!$A$1:$B$100,P57,2),\"\")","v":""},0,0,0,0,0,0,{"$f":"IF(#REF!>0,#REF!,0)","v":{"$error":"#REF!"}},0,0,0,0,0,0,0,""]
["",null,null,""," ",null,null,null,{"$f":"IF(H58>0,INDEX(Poeng!$A$1:$B$100,H58,2),\"\")","v":""},null,{"$f":"IF(J58>0,INDEX(Poeng!$A$1:$B$100,J58,2),\"\")","v":""},null,{"$f":"IF(L58>0,INDEX(Poeng!$A$1:$B$100,L58,2),\"\")","v":""},null,{"$f":"IF(N58>0,INDEX(Poeng!$A$1:$B$100,N58,2),\"\")","v":""},null,{"$f":"IF(P58>0,INDEX(Poeng!$A$1:$B$100,P58,2),\"\")","v":""},0,0,0,0,0,0,{"$f":"IF(#REF!>0,#REF!,0)","v":{"$error":"#REF!"}},0,0,0,0,0,0,0,""]
["",null,null,""," ",null,null,null,{"$f":"IF(H59>0,INDEX(Poeng!$A$1:$B$100,H59,2),\"\")","v":""},null,{"$f":"IF(J59>0,INDEX(Poeng!$A$1:$B$100,J59,2),\"\")","v":""},null,{"$f":"IF(L59>0,INDEX(Poeng!$A$1:$B$100,L59,2),\"\")","v":""},null,{"$f":"IF(N59>0,INDEX(Poeng!$A$1:$B$100,N59,2),\"\")","v":""},null,{"$f":"IF(P59>0,INDEX(Poeng!$A$1:$B$100,P59,2),\"\")","v":""},0,0,0,0,0,0,{"$f":"IF(#REF!>0,#REF!,0)","v":{"$error":"#REF!"}},0,0,0,0,0,0,0,""]
["",null,null,"",{"$f":"IF(AD60<4,\" \",\"F\")","v":" "},null,null,null,{"$f":"IF(H60>0,INDEX(Poeng!$A$1:$B$100,H60,2),\"\")","v":""},null,{"$f":"IF(J60>0,INDEX(Poeng!$A$1:$B$100,J60,2),\"\")","v":""},null,{"$f":"IF(L60>0,INDEX(Poeng!$A$1:$B$100,L60,2),\"\")","v":""},null,{"$f":"IF(N60>0,INDEX(Poeng!$A$1:$B$100,N60,2),\"\")","v":""},null,{"$f":"IF(P60>0,INDEX(Poeng!$A$1:$B$100,P60,2),\"\")","v":""},0,0,0,0,0,0,{"$f":"IF(#REF!>0,#REF!,0)","v":{"$error":"#REF!"}},0,0,0,0,0,0,0,""]
["",null,null,""," ",null,null,null,{"$f":"IF(H61>0,INDEX(Poeng!$A$1:$B$100,H61,2),\"\")","v":""},null,{"$f":"IF(J61>0,INDEX(Poeng!$A$1:$B$100,J61,2),\"\")","v":""},null,{"$f":"IF(L61>0,INDEX(Poeng!$A$1:$B$100,L61,2),\"\")","v":""},null,{"$f":"IF(N61>0,INDEX(Poeng!$A$1:$B$100,N61,2),\"\")","v":""},null,{"$f":"IF(P61>0,INDEX(Poeng!$A$1:$B$100,P61,2),\"\")","v":""},0,0,0,0,0,0,{"$f":"IF(#REF!>0,#REF!,0)","v":{"$error":"#REF!"}},0,0,0,0,0,0,0,""]
["",null,null,""," ",null,null,null,{"$f":"IF(H62>0,INDEX(Poeng!$A$1:$B$100,H62,2),\"\")","v":""},null,{"$f":"IF(J62>0,INDEX(Poeng!$A$1:$B$100,J62,2),\"\")","v":""},null,{"$f":"IF(L62>0,INDEX(Poeng!$A$1:$B$100,L62,2),\"\")","v":""},null,{"$f":"IF(N62>0,INDEX(Poeng!$A$1:$B$100,N62,2),\"\")","v":""},null,{"$f":"IF(P62>0,INDEX(Poeng!$A$1:$B$100,P62,2),\"\")","v":""},0,0,0,0,0,0,{"$f":"IF(#REF!>0,#REF!,0)","v":{"$error":"#REF!"}},0,0,0,0,0,0,0,""]
["",null,null,""," ",null,null,null,{"$f":"IF(H63>0,INDEX(Poeng!$A$1:$B$100,H63,2),\"\")","v":""},null,{"$f":"IF(J63>0,INDEX(Poeng!$A$1:$B$100,J63,2),\"\")","v":""},null,{"$f":"IF(L63>0,INDEX(Poeng!$A$1:$B$100,L63,2),\"\")","v":""},null,{"$f":"IF(N63>0,INDEX(Poeng!$A$1:$B$100,N63,2),\"\")","v":""},null,{"$f":"IF(P63>0,INDEX(Poeng!$A$1:$B$100,P63,2),\"\")","v":""},0,0,0,0,0,0,{"$f":"IF(#REF!>0,#REF!,0)","v":{"$error":"#REF!"}},0,0,0,0,0,0,0,""]
["",null,null,""," ",null,null,null,{"$f":"IF(H64>0,INDEX(Poeng!$A$1:$B$100,H64,2),\"\")","v":""},null,{"$f":"IF(J64>0,INDEX(Poeng!$A$1:$B$100,J64,2),\"\")","v":""},null,{"$f":"IF(L64>0,INDEX(Poeng!$A$1:$B$100,L64,2),\"\")","v":""},null,{"$f":"IF(N64>0,INDEX(Poeng!$A$1:$B$100,N64,2),\"\")","v":""},null,{"$f":"IF(P64>0,INDEX(Poeng!$A$1:$B$100,P64,2),\"\")","v":""},0,0,0,0,0,0,{"$f":"IF(#REF!>0,#REF!,0)","v":{"$error":"#REF!"}},0,0,0,0,0,0,0,""]
["",null,null,""," ",null,null,null,{"$f":"IF(H65>0,INDEX(Poeng!$A$1:$B$100,H65,2),\"\")","v":""},null,{"$f":"IF(J65>0,INDEX(Poeng!$A$1:$B$100,J65,2),\"\")","v":""},null,{"$f":"IF(L65>0,INDEX(Poeng!$A$1:$B$100,L65,2),\"\")","v":""},null,{"$f":"IF(N65>0,INDEX(Poeng!$A$1:$B$100,N65,2),\"\")","v":""},null,{"$f":"IF(P65>0,INDEX(Poeng!$A$1:$B$100,P65,2),\"\")","v":""},0,0,0,0,0,0,{"$f":"IF(#REF!>0,#REF!,0)","v":{"$error":"#REF!"}},0,0,0,0,0,0,0,""]
["",null,null,""," ",null,null,null,{"$f":"IF(H66>0,INDEX(Poeng!$A$1:$B$100,H66,2),\"\")","v":""},null,{"$f":"IF(J66>0,INDEX(Poeng!$A$1:$B$100,J66,2),\"\")","v":""},null,{"$f":"IF(L66>0,INDEX(Poeng!$A$1:$B$100,L66,2),\"\")","v":""},null,{"$f":"IF(N66>0,INDEX(Poeng!$A$1:$B$100,N66,2),\"\")","v":""},null,{"$f":"IF(P66>0,INDEX(Poeng!$A$1:$B$100,P66,2),\"\")","v":""},0,0,0,0,0,0,{"$f":"IF(#REF!>0,#REF!,0)","v":{"$error":"#REF!"}},0,0,0,0,0,0,0,""]
["",null,null,""," ",null,null,null,{"$f":"IF(H67>0,INDEX(Poeng!$A$1:$B$100,H67,2),\"\")","v":""},null,{"$f":"IF(J67>0,INDEX(Poeng!$A$1:$B$100,J67,2),\"\")","v":""},null,{"$f":"IF(L67>0,INDEX(Poeng!$A$1:$B$100,L67,2),\"\")","v":""},null,{"$f":"IF(N67>0,INDEX(Poeng!$A$1:$B$100,N67,2),\"\")","v":""},null,{"$f":"IF(P67>0,INDEX(Poeng!$A$1:$B$100,P67,2),\"\")","v":""},0,0,0,0,0,0,{"$f":"IF(#REF!>0,#REF!,0)","v":{"$error":"#REF!"}},{"$f":"LARGE(R67:W67,1)","v":0},{"$f":"LARGE(R67:W67,2)","v":0},{"$f":"LARGE(R67:W67,3)","v":0},{"$f":"LARGE(R67:W67,4)","v":0},{"$f":"SUM(Y67:AB67)","v":0},0,{"$f":"AC67*10^8+Y67*10^6/2+Z67*10^4/2+AA67*10^2/2+AB67/2","v":0},""]
[{"$f":"AF68","v":""},null,null,{"$f":"IF(B68<>\"\",AC68,\"\")","v":""}," ",null,null,null,{"$f":"IF(H68>0,INDEX(Poeng!$A$1:$B$100,H68,2),\"\")","v":""},null,{"$f":"IF(J68>0,INDEX(Poeng!$A$1:$B$100,J68,2),\"\")","v":""},null,{"$f":"IF(L68>0,INDEX(Poeng!$A$1:$B$100,L68,2),\"\")","v":""},null,{"$f":"IF(N68>0,INDEX(Poeng!$A$1:$B$100,N68,2),\"\")","v":""},null,{"$f":"IF(P68>0,INDEX(Poeng!$A$1:$B$100,P68,2),\"\")","v":""},{"$f":"IF(F68>0,G68,0)","v":0},{"$f":"IF(H68>0,I68,0)","v":0},{"$f":"IF(J68>0,K68,0)","v":0},{"$f":"IF(L68>0,M68,0)","v":0},{"$f":"IF(N68>0,O68,0)","v":0},{"$f":"IF(P68>0,Q68,0)","v":0},{"$f":"IF(#REF!>0,#REF!,0)","v":{"$error":"#REF!"}},0,0,0,0,0,{"$f":"COUNT(F68:Q68)/2","v":0},0,{"$f":"IF(B68<>\"\",RANK(AE68,AE$4:AE$73,0),\"\")","v":""}]
["",null,null,""," ",null,null,null,{"$f":"IF(H69>0,INDEX(Poeng!$A$1:$B$100,H69,2),\"\")","v":""},null,{"$f":"IF(J69>0,INDEX(Poeng!$A$1:$B$100,J69,2),\"\")","v":""},null,{"$f":"IF(L69>0,INDEX(Poeng!$A$1:$B$100,L69,2),\"\")","v":""},null,{"$f":"IF(N69>0,INDEX(Poeng!$A$1:$B$100,N69,2),\"\")","v":""},null,{"$f":"IF(P69>0,INDEX(Poeng!$A$1:$B$100,P69,2),\"\")","v":""},0,0,0,0,0,0,{"$f":"IF(#REF!>0,#REF!,0)","v":{"$error":"#REF!"}},0,0,0,0,0,0,0,""]
["",null,null,""," ",null,null,null,{"$f":"IF(H70>0,INDEX(Poeng!$A$1:$B$100,H70,2),\"\")","v":""},null,{"$f":"IF(J70>0,INDEX(Poeng!$A$1:$B$100,J70,2),\"\")","v":""},null,{"$f":"IF(L70>0,INDEX(Poeng!$A$1:$B$100,L70,2),\"\")","v":""},null,{"$f":"IF(N70>0,INDEX(Poeng!$A$1:$B$100,N70,2),\"\")","v":""},null,{"$f":"IF(P70>0,INDEX(Poeng!$A$1:$B$100,P70,2),\"\")","v":""},0,0,0,0,0,0,{"$f":"IF(#REF!>0,#REF!,0)","v":{"$error":"#REF!"}},0,0,0,0,0,0,0,""]
["",null,null,""," ",null,null,null,{"$f":"IF(H71>0,INDEX(Poeng!$A$1:$B$100,H71,2),\"\")","v":""},null,{"$f":"IF(J71>0,INDEX(Poeng!$A$1:$B$100,J71,2),\"\")","v":""},null,{"$f":"IF(L71>0,INDEX(Poeng!$A$1:$B$100,L71,2),\"\")","v":""},null,{"$f":"IF(N71>0,INDEX(Poeng!$A$1:$B$100,N71,2),\"\")","v":""},null,{"$f":"IF(P71>0,INDEX(Poeng!$A$1:$B$100,P71,2),\"\")","v":""},0,0,0,0,0,0,{"$f":"IF(#REF!>0,#REF!,0)","v":{"$error":"#REF!"}},0,0,0,0,0,0,0,""]
["",null,null,""," ",null,null,null,{"$f":"IF(H72>0,INDEX(Poeng!$A$1:$B$100,H72,2),\"\")","v":""},null,{"$f":"IF(J72>0,INDEX(Poeng!$A$1:$B$100,J72,2),\"\")","v":""},null,{"$f":"IF(L72>0,INDEX(Poeng!$A$1:$B$100,L72,2),\"\")","v":""},null,{"$f":"IF(N72>0,INDEX(Poeng!$A$1:$B$100,N72,2),\"\")","v":""},null,{"$f":"IF(P72>0,INDEX(Poeng!$A$1:$B$100,P72,2),\"\")","v":""},0,0,0,0,0,0,{"$f":"IF(#REF!>0,#REF!,0)","v":{"$error":"#REF!"}},0,0,0,0,0,0,0,""]
["",null,null,""," ",null,null,null,{"$f":"IF(H73>0,INDEX(Poeng!$A$1:$B$100,H73,2),\"\")","v":""},null,{"$f":"IF(J73>0,INDEX(Poeng!$A$1:$B$100,J73,2),\"\")","v":""},null,{"$f":"IF(L73>0,INDEX(Poeng!$A$1:$B$100,L73,2),\"\")","v":""},null,{"$f":"IF(N73>0,INDEX(Poeng!$A$1:$B$100,N73,2),\"\")","v":""},null,{"$f":"IF(P73>0,INDEX(Poeng!$A$1:$B$100,P73,2),\"\")","v":""},0,0,0,0,0,0,{"$f":"IF(#REF!>0,#REF!,0)","v":{"$error":"#REF!"}},0,0,0,0,0,0,0,""]
["",null,null,""," ",null,null,null,{"$f":"IF(H74>0,INDEX(Poeng!$A$1:$B$100,H74,2),\"\")","v":""},null,{"$f":"IF(J74>0,INDEX(Poeng!$A$1:$B$100,J74,2),\"\")","v":""},null,{"$f":"IF(L74>0,INDEX(Poeng!$A$1:$B$100,L74,2),\"\")","v":""},null,{"$f":"IF(N74>0,INDEX(Poeng!$A$1:$B$100,N74,2),\"\")","v":""},null,{"$f":"IF(P74>0,INDEX(Poeng!$A$1:$B$100,P74,2),\"\")","v":""},0,0,0,0,0,0,{"$f":"IF(#REF!>0,#REF!,0)","v":{"$error":"#REF!"}},0,0,0,0,0,0,0,""]
["",null,null,""," ",null,null,null,{"$f":"IF(H75>0,INDEX(Poeng!$A$1:$B$100,H75,2),\"\")","v":""},null,{"$f":"IF(J75>0,INDEX(Poeng!$A$1:$B$100,J75,2),\"\")","v":""},null,{"$f":"IF(L75>0,INDEX(Poeng!$A$1:$B$100,L75,2),\"\")","v":""},null,{"$f":"IF(N75>0,INDEX(Poeng!$A$1:$B$100,N75,2),\"\")","v":""},null,{"$f":"IF(P75>0,INDEX(Poeng!$A$1:$B$100,P75,2),\"\")","v":""},0,0,0,0,0,0,{"$f":"IF(#REF!>0,#REF!,0)","v":{"$error":"#REF!"}},0,0,0,0,0,0,0,""]
["",null,null,""," ",null,null,null,{"$f":"IF(H76>0,INDEX(Poeng!$A$1:$B$100,H76,2),\"\")","v":""},null,{"$f":"IF(J76>0,INDEX(Poeng!$A$1:$B$100,J76,2),\"\")","v":""},null,{"$f":"IF(L76>0,INDEX(Poeng!$A$1:$B$100,L76,2),\"\")","v":""},null,{"$f":"IF(N76>0,INDEX(Poeng!$A$1:$B$100,N76,2),\"\")","v":""},null,{"$f":"IF(P76>0,INDEX(Poeng!$A$1:$B$100,P76,2),\"\")","v":""},0,0,0,0,0,0,{"$f":"IF(#REF!>0,#REF!,0)","v":{"$error":"#REF!"}},0,0,0,0,0,0,0,""]
["",null,null,""," ",null,null,null,{"$f":"IF(H77>0,INDEX(Poeng!$A$1:$B$100,H77,2),\"\")","v":""},null,{"$f":"IF(J77>0,INDEX(Poeng!$A$1:$B$100,J77,2),\"\")","v":""},null,{"$f":"IF(L77>0,INDEX(Poeng!$A$1:$B$100,L77,2),\"\")","v":""},null,{"$f":"IF(N77>0,INDEX(Poeng!$A$1:$B$100,N77,2),\"\")","v":""},null,{"$f":"IF(P77>0,INDEX(Poeng!$A$1:$B$100,P77,2),\"\")","v":""},0,0,0,0,0,0,{"$f":"IF(#REF!>0,#REF!,0)","v":{"$error":"#REF!"}},0,0,0,0,0,0,0,""]
["",null,null,""," ",null,null,null,{"$f":"IF(H78>0,INDEX(Poeng!$A$1:$B$100,H78,2),\"\")","v":""},null,{"$f":"IF(J78>0,INDEX(Poeng!$A$1:$B$100,J78,2),\"\")","v":""},null,{"$f":"IF(L78>0,INDEX(Poeng!$A$1:$B$100,L78,2),\"\")","v":""},null,{"$f":"IF(N78>0,INDEX(Poeng!$A$1:$B$100,N78,2),\"\")","v":""},null,{"$f":"IF(P78>0,INDEX(Poeng!$A$1:$B$100,P78,2),\"\")","v":""},0,0,0,0,0,0,{"$f":"IF(#REF!>0,#REF!,0)","v":{"$error":"#REF!"}},0,0,0,0,0,0,0,""]
["",null,null,""," ",null,null,null,{"$f":"IF(H79>0,INDEX(Poeng!$A$1:$B$100,H79,2),\"\")","v":""},null,{"$f":"IF(J79>0,INDEX(Poeng!$A$1:$B$100,J79,2),\"\")","v":""},null,{"$f":"IF(L79>0,INDEX(Poeng!$A$1:$B$100,L79,2),\"\")","v":""},null,{"$f":"IF(N79>0,INDEX(Poeng!$A$1:$B$100,N79,2),\"\")","v":""},null,{"$f":"IF(P79>0,INDEX(Poeng!$A$1:$B$100,P79,2),\"\")","v":""},0,0,0,0,0,0,{"$f":"IF(#REF!>0,#REF!,0)","v":{"$error":"#REF!"}},0,0,0,0,0,0,0,""]
["",null,null,""," ",null,null,null,{"$f":"IF(H80>0,INDEX(Poeng!$A$1:$B$100,H80,2),\"\")","v":""},null,{"$f":"IF(J80>0,INDEX(Poeng!$A$1:$B$100,J80,2),\"\")","v":""},null,{"$f":"IF(L80>0,INDEX(Poeng!$A$1:$B$100,L80,2),\"\")","v":""},null,{"$f":"IF(N80>0,INDEX(Poeng!$A$1:$B$100,N80,2),\"\")","v":""},null,{"$f":"IF(P80>0,INDEX(Poeng!$A$1:$B$100,P80,2),\"\")","v":""},0,0,0,0,0,0,{"$f":"IF(#REF!>0,#REF!,0)","v":{"$error":"#REF!"}},0,0,0,0,0,0,0,""]
["",null,null,""," ",null,null,null,{"$f":"IF(H81>0,INDEX(Poeng!$A$1:$B$100,H81,2),\"\")","v":""},null,{"$f":"IF(J81>0,INDEX(Poeng!$A$1:$B$100,J81,2),\"\")","v":""},null,{"$f":"IF(L81>0,INDEX(Poeng!$A$1:$B$100,L81,2),\"\")","v":""},null,{"$f":"IF(N81>0,INDEX(Poeng!$A$1:$B$100,N81,2),\"\")","v":""},null,{"$f":"IF(P81>0,INDEX(Poeng!$A$1:$B$100,P81,2),\"\")","v":""},0,0,0,0,0,0,{"$f":"IF(#REF!>0,#REF!,0)","v":{"$error":"#REF!"}},0,0,0,0,0,0,0,""]
["",null,null,""," ",null,null,null,{"$f":"IF(H82>0,INDEX(Poeng!$A$1:$B$100,H82,2),\"\")","v":""},null,{"$f":"IF(J82>0,INDEX(Poeng!$A$1:$B$100,J82,2),\"\")","v":""},null,{"$f":"IF(L82>0,INDEX(Poeng!$A$1:$B$100,L82,2),\"\")","v":""},null,{"$f":"IF(N82>0,INDEX(Poeng!$A$1:$B$100,N82,2),\"\")","v":""},null,{"$f":"IF(P82>0,INDEX(Poeng!$A$1:$B$100,P82,2),\"\")","v":""},0,0,0,0,0,0,{"$f":"IF(#REF!>0,#REF!,0)","v":{"$error":"#REF!"}},0,0,0,0,0,0,0,""]
["",null,null,""," ",null,null,null,{"$f":"IF(H83>0,INDEX(Poeng!$A$1:$B$100,H83,2),\"\")","v":""},null,{"$f":"IF(J83>0,INDEX(Poeng!$A$1:$B$100,J83,2),\"\")","v":""},null,{"$f":"IF(L83>0,INDEX(Poeng!$A$1:$B$100,L83,2),\"\")","v":""},null,{"$f":"IF(N83>0,INDEX(Poeng!$A$1:$B$100,N83,2),\"\")","v":""},null,{"$f":"IF(P83>0,INDEX(Poeng!$A$1:$B$100,P83,2),\"\")","v":""},0,0,0,0,0,0,{"$f":"IF(#REF!>0,#REF!,0)","v":{"$error":"#REF!"}},0,0,0,0,0,0,0,""]
["",null,null,""," ",null,null,null,{"$f":"IF(H84>0,INDEX(Poeng!$A$1:$B$100,H84,2),\"\")","v":""},null,{"$f":"IF(J84>0,INDEX(Poeng!$A$1:$B$100,J84,2),\"\")","v":""},null,{"$f":"IF(L84>0,INDEX(Poeng!$A$1:$B$100,L84,2),\"\")","v":""},null,{"$f":"IF(N84>0,INDEX(Poeng!$A$1:$B$100,N84,2),\"\")","v":""},null,{"$f":"IF(P84>0,INDEX(Poeng!$A$1:$B$100,P84,2),\"\")","v":""},0,0,0,0,0,0,{"$f":"IF(#REF!>0,#REF!,0)","v":{"$error":"#REF!"}},0,0,0,0,0,0,0,""]
["",null,null,""," ",null,null,null,{"$f":"IF(H85>0,INDEX(Poeng!$A$1:$B$100,H85,2),\"\")","v":""},null,{"$f":"IF(J85>0,INDEX(Poeng!$A$1:$B$100,J85,2),\"\")","v":""},null,{"$f":"IF(L85>0,INDEX(Poeng!$A$1:$B$100,L85,2),\"\")","v":""},null,{"$f":"IF(N85>0,INDEX(Poeng!$A$1:$B$100,N85,2),\"\")","v":""},null,{"$f":"IF(P85>0,INDEX(Poeng!$A$1:$B$100,P85,2),\"\")","v":""},0,0,0,0,0,0,{"$f":"IF(#REF!>0,#REF!,0)","v":{"$error":"#REF!"}},0,0,0,0,0,0,0,""]
["",null,null,""," ",null,null,null,{"$f":"IF(H86>0,INDEX(Poeng!$A$1:$B$100,H86,2),\"\")","v":""},null,{"$f":"IF(J86>0,INDEX(Poeng!$A$1:$B$100,J86,2),\"\")","v":""},null,{"$f":"IF(L86>0,INDEX(Poeng!$A$1:$B$100,L86,2),\"\")","v":""},null,{"$f":"IF(N86>0,INDEX(Poeng!$A$1:$B$100,N86,2),\"\")","v":""},null,{"$f":"IF(P86>0,INDEX(Poeng!$A$1:$B$100,P86,2),\"\")","v":""},0,0,0,0,0,0,{"$f":"IF(#REF!>0,#REF!,0)","v":{"$error":"#REF!"}},0,0,0,0,0,0,0,""]
["",null,null,""," ",null,null,null,{"$f":"IF(H87>0,INDEX(Poeng!$A$1:$B$100,H87,2),\"\")","v":""},null,{"$f":"IF(J87>0,INDEX(Poeng!$A$1:$B$100,J87,2),\"\")","v":""},null,{"$f":"IF(L87>0,INDEX(Poeng!$A$1:$B$100,L87,2),\"\")","v":""},null,{"$f":"IF(N87>0,INDEX(Poeng!$A$1:$B$100,N87,2),\"\")","v":""},null,{"$f":"IF(P87>0,INDEX(Poeng!$A$1:$B$100,P87,2),\"\")","v":""},0,0,0,0,0,0,{"$f":"IF(#REF!>0,#REF!,0)","v":{"$error":"#REF!"}},0,0,0,0,0,0,0,""]
["",null,null,""," ",null,null,null,{"$f":"IF(H88>0,INDEX(Poeng!$A$1:$B$100,H88,2),\"\")","v":""},null,{"$f":"IF(J88>0,INDEX(Poeng!$A$1:$B$100,J88,2),\"\")","v":""},null,{"$f":"IF(L88>0,INDEX(Poeng!$A$1:$B$100,L88,2),\"\")","v":""},null,{"$f":"IF(N88>0,INDEX(Poeng!$A$1:$B$100,N88,2),\"\")","v":""},null,{"$f":"IF(P88>0,INDEX(Poeng!$A$1:$B$100,P88,2),\"\")","v":""},0,0,0,0,0,0,{"$f":"IF(#REF!>0,#REF!,0)","v":{"$error":"#REF!"}},0,0,0,0,0,0,0,""]
["",null,null,""," ",null,null,null,{"$f":"IF(H89>0,INDEX(Poeng!$A$1:$B$100,H89,2),\"\")","v":""},null,{"$f":"IF(J89>0,INDEX(Poeng!$A$1:$B$100,J89,2),\"\")","v":""},null,{"$f":"IF(L89>0,INDEX(Poeng!$A$1:$B$100,L89,2),\"\")","v":""},null,{"$f":"IF(N89>0,INDEX(Poeng!$A$1:$B$100,N89,2),\"\")","v":""},null,{"$f":"IF(P89>0,INDEX(Poeng!$A$1:$B$100,P89,2),\"\")","v":""},0,0,0,0,0,0,{"$f":"IF(#REF!>0,#REF!,0)","v":{"$error":"#REF!"}},0,0,0,0,0,0,0,""]
["",null,null,""," ",null,null,null,{"$f":"IF(H90>0,INDEX(Poeng!$A$1:$B$100,H90,2),\"\")","v":""},null,{"$f":"IF(J90>0,INDEX(Poeng!$A$1:$B$100,J90,2),\"\")","v":""},null,{"$f":"IF(L90>0,INDEX(Poeng!$A$1:$B$100,L90,2),\"\")","v":""},null,{"$f":"IF(N90>0,INDEX(Poeng!$A$1:$B$100,N90,2),\"\")","v":""},null,{"$f":"IF(P90>0,INDEX(Poeng!$A$1:$B$100,P90,2),\"\")","v":""},0,0,0,0,0,0,{"$f":"IF(#REF!>0,#REF!,0)","v":{"$error":"#REF!"}},0,0,0,0,0,0,0,""]
["",null,null,""," ",null,null,null,{"$f":"IF(H91>0,INDEX(Poeng!$A$1:$B$100,H91,2),\"\")","v":""},null,{"$f":"IF(J91>0,INDEX(Poeng!$A$1:$B$100,J91,2),\"\")","v":""},null,{"$f":"IF(L91>0,INDEX(Poeng!$A$1:$B$100,L91,2),\"\")","v":""},null,{"$f":"IF(N91>0,INDEX(Poeng!$A$1:$B$100,N91,2),\"\")","v":""},null,{"$f":"IF(P91>0,INDEX(Poeng!$A$1:$B$100,P91,2),\"\")","v":""},0,0,0,0,0,0,{"$f":"IF(#REF!>0,#REF!,0)","v":{"$error":"#REF!"}},0,0,0,0,0,0,0,""]
["",null,null,"",{"$f":"IF(AD92<4,\" \",\"F\")","v":" "},null,null,null,{"$f":"IF(H92>0,INDEX(Poeng!$A$1:$B$100,H92,2),\"\")","v":""},null,{"$f":"IF(J92>0,INDEX(Poeng!$A$1:$B$100,J92,2),\"\")","v":""},null,{"$f":"IF(L92>0,INDEX(Poeng!$A$1:$B$100,L92,2),\"\")","v":""},null,{"$f":"IF(N92>0,INDEX(Poeng!$A$1:$B$100,N92,2),\"\")","v":""},null,{"$f":"IF(P92>0,INDEX(Poeng!$A$1:$B$100,P92,2),\"\")","v":""},0,0,0,0,0,0,{"$f":"IF(#REF!>0,#REF!,0)","v":{"$error":"#REF!"}},0,0,0,0,0,0,0,""]
["",null,null,""," ",null,null,null,{"$f":"IF(H93>0,INDEX(Poeng!$A$1:$B$100,H93,2),\"\")","v":""},null,{"$f":"IF(J93>0,INDEX(Poeng!$A$1:$B$100,J93,2),\"\")","v":""},null,{"$f":"IF(L93>0,INDEX(Poeng!$A$1:$B$100,L93,2),\"\")","v":""},null,{"$f":"IF(N93>0,INDEX(Poeng!$A$1:$B$100,N93,2),\"\")","v":""},null,{"$f":"IF(P93>0,INDEX(Poeng!$A$1:$B$100,P93,2),\"\")","v":""},0,0,0,0,0,0,{"$f":"IF(#REF!>0,#REF!,0)","v":{"$error":"#REF!"}},0,0,0,0,0,0,0,""]
["",null,null,""," ",null,null,null,{"$f":"IF(H94>0,INDEX(Poeng!$A$1:$B$100,H94,2),\"\")","v":""},null,{"$f":"IF(J94>0,INDEX(Poeng!$A$1:$B$100,J94,2),\"\")","v":""},null,{"$f":"IF(L94>0,INDEX(Poeng!$A$1:$B$100,L94,2),\"\")","v":""},null,{"$f":"IF(N94>0,INDEX(Poeng!$A$1:$B$100,N94,2),\"\")","v":""},null,{"$f":"IF(P94>0,INDEX(Poeng!$A$1:$B$100,P94,2),\"\")","v":""},0,0,0,0,0,0,{"$f":"IF(#REF!>0,#REF!,0)","v":{"$error":"#REF!"}},0,0,0,0,0,0,0,""]
["",null,null,""," ",null,null,null,{"$f":"IF(H95>0,INDEX(Poeng!$A$1:$B$100,H95,2),\"\")","v":""},null,{"$f":"IF(J95>0,INDEX(Poeng!$A$1:$B$100,J95,2),\"\")","v":""},null,{"$f":"IF(L95>0,INDEX(Poeng!$A$1:$B$100,L95,2),\"\")","v":""},null,{"$f":"IF(N95>0,INDEX(Poeng!$A$1:$B$100,N95,2),\"\")","v":""},null,{"$f":"IF(P95>0,INDEX(Poeng!$A$1:$B$100,P95,2),\"\")","v":""},0,0,0,0,0,0,{"$f":"IF(#REF!>0,#REF!,0)","v":{"$error":"#REF!"}},0,0,0,0,0,0,0,""]
["",null,null,""," ",null,null,null,{"$f":"IF(H96>0,INDEX(Poeng!$A$1:$B$100,H96,2),\"\")","v":""},null,{"$f":"IF(J96>0,INDEX(Poeng!$A$1:$B$100,J96,2),\"\")","v":""},null,{"$f":"IF(L96>0,INDEX(Poeng!$A$1:$B$100,L96,2),\"\")","v":""},null,{"$f":"IF(N96>0,INDEX(Poeng!$A$1:$B$100,N96,2),\"\")","v":""},null,{"$f":"IF(P96>0,INDEX(Poeng!$A$1:$B$100,P96,2),\"\")","v":""},0,0,0,0,0,0,{"$f":"IF(#REF!>0,#REF!,0)","v":{"$error":"#REF!"}},0,0,0,0,0,0,0,""]
["",null,null,""," ",null,null,null,{"$f":"IF(H97>0,INDEX(Poeng!$A$1:$B$100,H97,2),\"\")","v":""},null,{"$f":"IF(J97>0,INDEX(Poeng!$A$1:$B$100,J97,2),\"\")","v":""},null,{"$f":"IF(L97>0,INDEX(Poeng!$A$1:$B$100,L97,2),\"\")","v":""},null,{"$f":"IF(N97>0,INDEX(Poeng!$A$1:$B$100,N97,2),\"\")","v":""},null,{"$f":"IF(P97>0,INDEX(Poeng!$A$1:$B$100,P97,2),\"\")","v":""},0,0,0,0,0,0,{"$f":"IF(#REF!>0,#REF!,0)","v":{"$error":"#REF!"}},0,0,0,0,0,0,0,""]
["",null,null,""," ",null,null,null,{"$f":"IF(H98>0,INDEX(Poeng!$A$1:$B$100,H98,2),\"\")","v":""},null,{"$f":"IF(J98>0,INDEX(Poeng!$A$1:$B$100,J98,2),\"\")","v":""},null,{"$f":"IF(L98>0,INDEX(Poeng!$A$1:$B$100,L98,2),\"\")","v":""},null,{"$f":"IF(N98>0,INDEX(Poeng!$A$1:$B$100,N98,2),\"\")","v":""},null,{"$f":"IF(P98>0,INDEX(Poeng!$A$1:$B$100,P98,2),\"\")","v":""},0,0,0,0,0,0,{"$f":"IF(#REF!>0,#REF!,0)","v":{"$error":"#REF!"}},0,0,0,0,0,0,0,""]

{"sheet":"J15","index":2,"n_rows":96,"n_cols":32,"rows_kept":96,"cut":false,"hidden":false,"merged":[[0,2,0,16],[1,5,1,6],[1,7,1,8],[1,9,1,10],[1,11,1,12],[1,13,1,14],[1,15,1,16],[2,15,2,16],[2,5,2,6],[2,7,2,8],[2,9,2,10],[2,11,2,12],[2,13,2,14]]}
["Jenter 15",null,"  Sparebank1-CUP 2021"]
[null,null,null,null,null,"SP1- CUP 1 ",null,"SP1- CUP 2 ",null,"SP1- CUP 3",null,"SP1- CUP 4",null,"SP1- CUP 5",null,"SP1- CUP 6",null,"Poeng",null,null,null,null,null,null,"Fire beste",null,null,null,"Sum"]
["Nr","NAVN","KLUBB","POENG","Fullført","Nr.  Poeng ",null,"Nr.  Poeng ",null,"Nr.   Poeng ",null,"Nr.  Poeng ",null,"Nr.  Poeng ",null,"Nr. Poeng ",null,1,2,3,4,5,6,7,1,2,3,4]
[{"$f":"AF4","v":1},"Marie Wollan Benum","Byåsen IL",{"$f":"IF(B4<>\"\",AC4,\"\")","v":400},{"$f":"IF(AD4<4,\" \",\"F\")","v":"F"},null,{"$f":"IF(F4>0,INDEX(Poeng!$A$1:$B$100,F4,2),\"\")","v":""},1,{"$f":"IF(H4>0,INDEX(Poeng!$A$1:$B$100,H4,2),\"\")","v":100},1,{"$f":"IF(J4>0,INDEX(Poeng!$A$1:$B$100,J4,2),\"\")","v":100},1,{"$f":"IF(L4>0,INDEX(Poeng!$A$1:$B$100,L4,2),\"\")","v":100},1,{"$f":"IF(N4>0,INDEX(Poeng!$A$1:$B$100,N4,2),\"\")","v":100},1,{"$f":"IF(P4>0,INDEX(Poeng!$A$1:$B$100,P4,2),\"\")","v":100},{"$f":"IF(F4>0,G4,0)","v":0},{"$f":"IF(H4>0,I4,0)","v":100},{"$f":"IF(J4>0,K4,0)","v":100},{"$f":"IF(L4>0,M4,0)","v":100},{"$f":"IF(N4>0,O4,0)","v":100},{"$f":"IF(P4>0,Q4,0)","v":100},{"$f":"IF(#REF!>0,#REF!,0)","v":{"$error":"#REF!"}},{"$f":"LARGE(R4:W4,1)","v":100},{"$f":"LARGE(R4:W4,2)","v":100},{"$f":"LARGE(R4:W4,3)","v":100},{"$f":"LARGE(R4:W4,4)","v":100},{"$f":"SUM(Y4:AB4)","v":400},{"$f":"COUNT(F4:Q4)/2","v":5},{"$f":"AC4*10^8+Y4*10^6/2+Z4*10^4/2+AA4*10^2/2+AB4/2","v":40050505050},{"$f":"IF(B4<>\"\",RANK(AE4,AE$4:AE$71,0),\"\")","v":1}]
[2,"Nora Hafsmo","Byåsen IL",340,"F",1,{"$f":"IF(F5>0,INDEX(Poeng!$A$1:$B$100,F5,2),\"\")","v":100},2,{"$f":"IF(H5>0,INDEX(Poeng!$A$1:$B$100,H5,2),\"\")","v":80},3,{"$f":"IF(J5>0,INDEX(Poeng!$A$1:$B$100,J5,2),\"\")","v":60},2,{"$f":"IF(L5>0,INDEX(Poeng!$A$1:$B$100,L5,2),\"\")","v":80},2,{"$f":"IF(N5>0,INDEX(Poeng!$A$1:$B$100,N5,2),\"\")","v":80},2,{"$f":"IF(P5>0,INDEX(Poeng!$A$1:$B$100,P5,2),\"\")","v":80},100,80,60,80,80,80,{"$f":"IF(#REF!>0,#REF!,0)","v":{"$error":"#REF!"}},100,80,80,80,340,6,34050404040,2]
[3,"Agnes Vatterholm Jernberg","Byaasen Skiklub",230,"F",3,{"$f":"IF(F6>0,INDEX(Poeng!$A$1:$B$100,F6,2),\"\")","v":60},3,{"$f":"IF(H6>0,INDEX(Poeng!$A$1:$B$100,H6,2),\"\")","v":60},6,{"$f":"IF(J6>0,INDEX(Poeng!$A$1:$B$100,J6,2),\"\")","v":40},4,{"$f":"IF(L6>0,INDEX(Poeng!$A$1:$B$100,L6,2),\"\")","v":50},3,{"$f":"IF(N6>0,INDEX(Poeng!$A$1:$B$100,N6,2),\"\")","v":60},5,{"$f":"IF(P6>0,INDEX(Poeng!$A$1:$B$100,P6,2),\"\")","v":45},60,60,40,50,60,45,{"$f":"IF(#REF!>0,#REF!,0)","v":{"$error":"#REF!"}},60,60,60,50,230,6,23030303025,3]
[4,"Juni Hagelid Norheim","Byåsen IL",205,"F",4,{"$f":"IF(F7>0,INDEX(Poeng!$A$1:$B$100,F7,2),\"\")","v":50},null,{"$f":"IF(H7>0,INDEX(Poeng!$A$1:$B$100,H7,2),\"\")","v":""},4,{"$f":"IF(J7>0,INDEX(Poeng!$A$1:$B$100,J7,2),\"\")","v":50},null,{"$f":"IF(L7>0,INDEX(Poeng!$A$1:$B$100,L7,2),\"\")","v":""},5,{"$f":"IF(N7>0,INDEX(Poeng!$A$1:$B$100,N7,2),\"\")","v":45},3,{"$f":"IF(P7>0,INDEX(Poeng!$A$1:$B$100,P7,2),\"\")","v":60},50,0,50,0,45,60,{"$f":"IF(#REF!>0,#REF!,0)","v":{"$error":"#REF!"}},60,50,50,45,205,4,20530252522.5,4]
[5,"Kristin Petersen","Heimdal Ski",181,"F",7,{"$f":"IF(F8>0,INDEX(Poeng!$A$1:$B$100,F8,2),\"\")","v":36},4,{"$f":"IF(H8>0,INDEX(Poeng!$A$1:$B$100,H8,2),\"\")","v":50},8,{"$f":"IF(J8>0,INDEX(Poeng!$A$1:$B$100,J8,2),\"\")","v":32},5,{"$f":"IF(L8>0,INDEX(Poeng!$A$1:$B$100,L8,2),\"\")","v":45},4,{"$f":"IF(N8>0,INDEX(Poeng!$A$1:$B$100,N8,2),\"\")","v":50},7,{"$f":"IF(P8>0,INDEX(Poeng!$A$1:$B$100,P8,2),\"\")","v":36},36,50,32,45,50,36,{"$f":"IF(#REF!>0,#REF!,0)","v":{"$error":"#REF!"}},50,50,45,36,181,6,18125252268,5]
[6,"Ella Fjær Skåre","Strindheim IL ",176,"F",5,{"$f":"IF(F9>0,INDEX(Poeng!$A$1:$B$100,F9,2),\"\")","v":45},null,{"$f":"IF(H9>0,INDEX(Poeng!$A$1:$B$100,H9,2),\"\")","v":""},5,{"$f":"IF(J9>0,INDEX(Poeng!$A$1:$B$100,J9,2),\"\")","v":45},null,{"$f":"IF(L9>0,INDEX(Poeng!$A$1:$B$100,L9,2),\"\")","v":""},7,{"$f":"IF(N9>0,INDEX(Poeng!$A$1:$B$100,N9,2),\"\")","v":36},4,{"$f":"IF(P9>0,INDEX(Poeng!$A$1:$B$100,P9,2),\"\")","v":50},45,0,45,0,36,50,{"$f":"IF(#REF!>0,#REF!,0)","v":{"$error":"#REF!"}},50,45,45,36,176,4,17625227268,6]
[7,"Lina Brathole Hindberg","Strindheim IL ",160," ",2,{"$f":"IF(F10>0,INDEX(Poeng!$A$1:$B$100,F10,2),\"\")","v":80},null,{"$f":"IF(H10>0,INDEX(Poeng!$A$1:$B$100,H10,2),\"\")","v":""},2,{"$f":"IF(J10>0,INDEX(Poeng!$A$1:$B$100,J10,2),\"\")","v":80},null,{"$f":"IF(L10>0,INDEX(Poeng!$A$1:$B$100,L10,2),\"\")","v":""},null,{"$f":"IF(N10>0,INDEX(Poeng!$A$1:$B$100,N10,2),\"\")","v":""},null,{"$f":"IF(P10>0,INDEX(Poeng!$A$1:$B$100,P10,2),\"\")","v":""},80,0,80,0,0,0,{"$f":"IF(#REF!>0,#REF!,0)","v":{"$error":"#REF!"}},80,80,0,0,160,2,16040400000,7]
[8,"Frida Vikin","Rennebu IL",120," ",6,{"$f":"IF(F11>0,INDEX(Poeng!$A$1:$B$100,F11,2),\"\")","v":40},null,{"$f":"IF(H11>0,INDEX(Poeng!$A$1:$B$100,H11,2),\"\")","v":""},null,{"$f":"IF(J11>0,INDEX(Poeng!$A$1:$B$100,J11,2),\"\")","v":""},6,{"$f":"IF(L11>0,INDEX(Poeng!$A$1:$B$100,L11,2),\"\")","v":40},null,{"$f":"IF(N11>0,INDEX(Poeng!$A$1:$B$100,N11,2),\"\")","v":""},6,{"$f":"IF(P11>0,INDEX(Poeng!$A$1:$B$100,P11,2),\"\")","v":40},40,0,0,40,0,40,{"$f":"IF(#REF!>0,#REF!,0)","v":{"$error":"#REF!"}},40,40,40,0,120,3,12020202000,8]
[9,"Hanna Aasbø","Surnadal IL",109," ",null,{"$f":"IF(F12>0,INDEX(Poeng!$A$1:$B$100,F12,2),\"\")","v":""},5,{"$f":"IF(H12>0,INDEX(Poeng!$A$1:$B$100,H12,2),\"\")","v":45},null,{"$f":"IF(J12>0,INDEX(Poeng!$A$1:$B$100,J12,2),\"\")","v":""},8,{"$f":"IF(L12>0,INDEX(Poeng!$A$1:$B$100,L12,2),\"\")","v":32},null,{"$f":"IF(N12>0,INDEX(Poeng!$A$1:$B$100,N12,2),\"\")","v":""},8,{"$f":"IF(P12>0,INDEX(Poeng!$A$1:$B$100,P12,2),\"\")","v":32},0,45,0,32,0,32,{"$f":"IF(#REF!>0,#REF!,0)","v":{"$error":"#REF!"}},45,32,32,0,109,3,10922661600,9]
[10,"Nora Vågø Kristensen","Klæbu IL",105," ",null,{"$f":"IF(F13>0,INDEX(Poeng!$A$1:$B$100,F13,2),\"\")","v":""},null,{"$f":"IF(H13>0,INDEX(Poeng!$A$1:$B$100,H13,2),\"\")","v":""},7,{"$f":"IF(J13>0,INDEX(Poeng!$A$1:$B$100,J13,2),\"\")","v":36},null,{"$f":"IF(L13>0,INDEX(Poeng!$A$1:$B$100,L13,2),\"\")","v":""},6,{"$f":"IF(N13>0,INDEX(Poeng!$A$1:$B$100,N13,2),\"\")","v":40},9,{"$f":"IF(P13>0,INDEX(Poeng!$A$1:$B$100,P13,2),\"\")","v":29},0,0,36,0,40,29,{"$f":"IF(#REF!>0,#REF!,0)","v":{"$error":"#REF!"}},40,36,29,0,105,3,10520181450,10]
[11,"Margareta Melø Gjermundnes","Nidelv IL",68," ",null,{"$f":"IF(F14>0,INDEX(Poeng!$A$1:$B$100,F14,2),\"\")","v":""},null,{"$f":"IF(H14>0,INDEX(Poeng!$A$1:$B$100,H14,2),\"\")","v":""},null,{"$f":"IF(J14>0,INDEX(Poeng!$A$1:$B$100,J14,2),\"\")","v":""},7,{"$f":"IF(L14>0,INDEX(Poeng!$A$1:$B$100,L14,2),\"\")","v":36},8,{"$f":"IF(N14>0,INDEX(Poeng!$A$1:$B$100,N14,2),\"\")","v":32},null,{"$f":"IF(P14>0,INDEX(Poeng!$A$1:$B$100,P14,2),\"\")","v":""},0,0,0,36,32,0,{"$f":"IF(#REF!>0,#REF!,0)","v":{"$error":"#REF!"}},36,32,0,0,68,2,6818160000,11]
[12,"Nora Ytterhus","Rennebu IL",60," ",null,{"$f":"IF(F15>0,INDEX(Poeng!$A$1:$B$100,F15,2),\"\")","v":""},null,{"$f":"IF(H15>0,INDEX(Poeng!$A$1:$B$100,H15,2),\"\")","v":""},null,{"$f":"IF(J15>0,INDEX(Poeng!$A$1:$B$100,J15,2),\"\")","v":""},3,{"$f":"IF(L15>0,INDEX(Poeng!$A$1:$B$100,L15,2),\"\")","v":60},null,{"$f":"IF(N15>0,INDEX(Poeng!$A$1:$B$100,N15,2),\"\")","v":""},null,{"$f":"IF(P15>0,INDEX(Poeng!$A$1:$B$100,P15,2),\"\")","v":""},0,0,0,60,0,0,{"$f":"IF(#REF!>0,#REF!,0)","v":{"$error":"#REF!"}},60,0,0,0,60,1,6030000000,12]
[13,"Selma Sunde Rabben","Strindheim IL ",58," ",null,{"$f":"IF(F16>0,INDEX(Poeng!$A$1:$B$100,F16,2),\"\")","v":""},null,{"$f":"IF(H16>0,INDEX(Poeng!$A$1:$B$100,H16,2),\"\")","v":""},9,{"$f":"IF(J16>0,INDEX(Poeng!$A$1:$B$100,J16,2),\"\")","v":29},null,{"$f":"IF(L16>0,INDEX(Poeng!$A$1:$B$100,L16,2),\"\")","v":""},9,{"$f":"IF(N16>0,INDEX(Poeng!$A$1:$B$100,N16,2),\"\")","v":29},null,{"$f":"IF(P16>0,INDEX(Poeng!$A$1:$B$100,P16,2),\"\")","v":""},0,0,29,0,29,0,{"$f":"IF(#REF!>0,#REF!,0)","v":{"$error":"#REF!"}},29,29,0,0,58,2,5814645000,13]
[14,"Hanne Wekre","Heimdal Ski",32," ",8,{"$f":"IF(F17>0,INDEX(Poeng!$A$1:$B$100,F17,2),\"\")","v":32},null,{"$f":"IF(H17>0,INDEX(Poeng!$A$1:$B$100,H17,2),\"\")","v":""},null,{"$f":"IF(J17>0,INDEX(Poeng!$A$1:$B$100,J17,2),\"\")","v":""},null,{"$f":"IF(L17>0,INDEX(Poeng!$A$1:$B$100,L17,2),\"\")","v":""},null,{"$f":"IF(N17>0,INDEX(Poeng!$A$1:$B$100,N17,2),\"\")","v":""},null,{"$f":"IF(P17>0,INDEX(Poeng!$A$1:$B$100,P17,2),\"\")","v":""},32,0,0,0,0,0,{"$f":"IF(#REF!>0,#REF!,0)","v":{"$error":"#REF!"}},32,0,0,0,32,1,3216000000,14]
[{"$f":"AF18","v":""},null,null,{"$f":"IF(B18<>\"\",AC18,\"\")","v":""},{"$f":"IF(AD18<4,\" \",\"F\")","v":" "},null,{"$f":"IF(F18>0,INDEX(Poeng!$A$1:$B$100,F18,2),\"\")","v":""},null,{"$f":"IF(H18>0,INDEX(Poeng!$A$1:$B$100,H18,2),\"\")","v":""},null,{"$f":"IF(J18>0,INDEX(Poeng!$A$1:$B$100,J18,2),\"\")","v":""},null,{"$f":"IF(L18>0,INDEX(Poeng!$A$1:$B$100,L18,2),\"\")","v":""},null,{"$f":"IF(N18>0,INDEX(Poeng!$A$1:$B$100,N18,2),\"\")","v":""},null,{"$f":"IF(P18>0,INDEX(Poeng!$A$1:$B$100,P18,2),\"\")","v":""},0,0,0,0,0,0,{"$f":"IF(#REF!>0,#REF!,0)","v":{"$error":"#REF!"}},0,0,0,0,0,0,0,""]
["",null,null,""," ",null,{"$f":"IF(F19>0,INDEX(Poeng!$A$1:$B$100,F19,2),\"\")","v":""},null,{"$f":"IF(H19>0,INDEX(Poeng!$A$1:$B$100,H19,2),\"\")","v":""},null,{"$f":"IF(J19>0,INDEX(Poeng!$A$1:$B$100,J19,2),\"\")","v":""},null,{"$f":"IF(L19>0,INDEX(Poeng!$A$1:$B$100,L19,2),\"\")","v":""},null,{"$f":"IF(N19>0,INDEX(Poeng!$A$1:$B$100,N19,2),\"\")","v":""},null,{"$f":"IF(P19>0,INDEX(Poeng!$A$1:$B$100,P19,2),\"\")","v":""},0,0,0,0,0,0,{"$f":"IF(#REF!>0,#REF!,0)","v":{"$error":"#REF!"}},0,0,0,0,0,0,0,""]
[{"$f":"AF20","v":""},null,null,{"$f":"IF(B20<>\"\",AC20,\"\")","v":""},{"$f":"IF(AD20<4,\" \",\"F\")","v":" "},null,{"$f":"IF(F20>0,INDEX(Poeng!$A$1:$B$100,F20,2),\"\")","v":""},null,{"$f":"IF(H20>0,INDEX(Poeng!$A$1:$B$100,H20,2),\"\")","v":""},null,{"$f":"IF(J20>0,INDEX(Poeng!$A$1:$B$100,J20,2),\"\")","v":""},null,{"$f":"IF(L20>0,INDEX(Poeng!$A$1:$B$100,L20,2),\"\")","v":""},null,{"$f":"IF(N20>0,INDEX(Poeng!$A$1:$B$100,N20,2),\"\")","v":""},null,{"$f":"IF(P20>0,INDEX(Poeng!$A$1:$B$100,P20,2),\"\")","v":""},0,0,0,0,0,0,{"$f":"IF(#REF!>0,#REF!,0)","v":{"$error":"#REF!"}},0,0,0,0,0,0,0,""]
["",null,null,""," ",null,{"$f":"IF(F21>0,INDEX(Poeng!$A$1:$B$100,F21,2),\"\")","v":""},null,{"$f":"IF(H21>0,INDEX(Poeng!$A$1:$B$100,H21,2),\"\")","v":""},null,{"$f":"IF(J21>0,INDEX(Poeng!$A$1:$B$100,J21,2),\"\")","v":""},null,{"$f":"IF(L21>0,INDEX(Poeng!$A$1:$B$100,L21,2),\"\")","v":""},null,{"$f":"IF(N21>0,INDEX(Poeng!$A$1:$B$100,N21,2),\"\")","v":""},null,{"$f":"IF(P21>0,INDEX(Poeng!$A$1:$B$100,P21,2),\"\")","v":""},0,0,0,0,0,0,{"$f":"IF(#REF!>0,#REF!,0)","v":{"$error":"#REF!"}},0,0,0,0,0,0,0,""]
["",null,null,""," ",null,{"$f":"IF(F22>0,INDEX(Poeng!$A$1:$B$100,F22,2),\"\")","v":""},null,{"$f":"IF(H22>0,INDEX(Poeng!$A$1:$B$100,H22,2),\"\")","v":""},null,{"$f":"IF(J22>0,INDEX(Poeng!$A$1:$B$100,J22,2),\"\")","v":""},null,{"$f":"IF(L22>0,INDEX(Poeng!$A$1:$B$100,L22,2),\"\")","v":""},null,{"$f":"IF(N22>0,INDEX(Poeng!$A$1:$B$100,N22,2),\"\")","v":""},null,{"$f":"IF(P22>0,INDEX(Poeng!$A$1:$B$100,P22,2),\"\")","v":""},0,0,0,0,0,0,{"$f":"IF(#REF!>0,#REF!,0)","v":{"$error":"#REF!"}},0,0,0,0,0,0,0,""]
["",null,null,""," ",null,{"$f":"IF(F23>0,INDEX(Poeng!$A$1:$B$100,F23,2),\"\")","v":""},null,{"$f":"IF(H23>0,INDEX(Poeng!$A$1:$B$100,H23,2),\"\")","v":""},null,{"$f":"IF(J23>0,INDEX(Poeng!$A$1:$B$100,J23,2),\"\")","v":""},null,{"$f":"IF(L23>0,INDEX(Poeng!$A$1:$B$100,L23,2),\"\")","v":""},null,{"$f":"IF(N23>0,INDEX(Poeng!$A$1:$B$100,N23,2),\"\")","v":""},null,{"$f":"IF(P23>0,INDEX(Poeng!$A$1:$B$100,P23,2),\"\")","v":""},0,0,0,0,0,0,{"$f":"IF(#REF!>0,#REF!,0)","v":{"$error":"#REF!"}},0,0,0,0,0,0,0,""]
["",null,null,"",{"$f":"IF(AD24<4,\" \",\"F\")","v":" "},null,null,null,{"$f":"IF(H24>0,INDEX(Poeng!$A$1:$B$100,H24,2),\"\")","v":""},null,{"$f":"IF(J24>0,INDEX(Poeng!$A$1:$B$100,J24,2),\"\")","v":""},null,{"$f":"IF(L24>0,INDEX(Poeng!$A$1:$B$100,L24,2),\"\")","v":""},null,{"$f":"IF(N24>0,INDEX(Poeng!$A$1:$B$100,N24,2),\"\")","v":""},null,{"$f":"IF(P24>0,INDEX(Poeng!$A$1:$B$100,P24,2),\"\")","v":""},0,0,0,0,0,0,{"$f":"IF(#REF!>0,#REF!,0)","v":{"$error":"#REF!"}},0,0,0,0,0,0,0,""]
["",null,null,""," ",null,{"$f":"IF(F25>0,INDEX(Poeng!$A$1:$B$100,F25,2),\"\")","v":""},null,{"$f":"IF(H25>0,INDEX(Poeng!$A$1:$B$100,H25,2),\"\")","v":""},null,{"$f":"IF(J25>0,INDEX(Poeng!$A$1:$B$100,J25,2),\"\")","v":""},null,{"$f":"IF(L25>0,INDEX(Poeng!$A$1:$B$100,L25,2),\"\")","v":""},null,{"$f":"IF(N25>0,INDEX(Poeng!$A$1:$B$100,N25,2),\"\")","v":""},null,{"$f":"IF(P25>0,INDEX(Poeng!$A$1:$B$100,P25,2),\"\")","v":""},0,0,0,0,0,0,{"$f":"IF(#REF!>0,#REF!,0)","v":{"$error":"#REF!"}},0,0,0,0,0,0,0,""]
["",null,null,""," ",null,{"$f":"IF(F26>0,INDEX(Poeng!$A$1:$B$100,F26,2),\"\")","v":""},null,{"$f":"IF(H26>0,INDEX(Poeng!$A$1:$B$100,H26,2),\"\")","v":""},null,{"$f":"IF(J26>0,INDEX(Poeng!$A$1:$B$100,J26,2),\"\")","v":""},null,{"$f":"IF(L26>0,INDEX(Poeng!$A$1:$B$100,L26,2),\"\")","v":""},null,{"$f":"IF(N26>0,INDEX(Poeng!$A$1:$B$100,N26,2),\"\")","v":""},null,null,0,0,0,0,0,0,{"$f":"IF(#REF!>0,#REF!,0)","v":{"$error":"#REF!"}},0,0,0,0,0,0,0,""]
["",null,null,""," ",null,{"$f":"IF(F27>0,INDEX(Poeng!$A$1:$B$100,F27,2),\"\")","v":""},null,{"$f":"IF(H27>0,INDEX(Poeng!$A$1:$B$100,H27,2),\"\")","v":""},null,{"$f":"IF(J27>0,INDEX(Poeng!$A$1:$B$100,J27,2),\"\")","v":""},null,{"$f":"IF(L27>0,INDEX(Poeng!$A$1:$B$100,L27,2),\"\")","v":""},null,{"$f":"IF(N27>0,INDEX(Poeng!$A$1:$B$100,N27,2),\"\")","v":""},null,{"$f":"IF(P27>0,INDEX(Poeng!$A$1:$B$100,P27,2),\"\")","v":""},0,0,0,0,0,0,{"$f":"IF(#REF!>0,#REF!,0)","v":{"$error":"#REF!"}},0,0,0,0,0,0,0,""]
["",null,null,""," ",null,{"$f":"IF(F28>0,INDEX(Poeng!$A$1:$B$100,F28,2),\"\")","v":""},null,{"$f":"IF(H28>0,INDEX(Poeng!$A$1:$B$100,H28,2),\"\")","v":""},null,{"$f":"IF(J28>0,INDEX(Poeng!$A$1:$B$100,J28,2),\"\")","v":""},null,{"$f":"IF(L28>0,INDEX(Poeng!$A$1:$B$100,L28,2),\"\")","v":""},null,{"$f":"IF(N28>0,INDEX(Poeng!$A$1:$B$100,N28,2),\"\")","v":""},null,{"$f":"IF(P28>0,INDEX(Poeng!$A$1:$B$100,P28,2),\"\")","v":""},0,0,0,0,0,0,{"$f":"IF(#REF!>0,#REF!,0)","v":{"$error":"#REF!"}},0,0,0,0,0,0,0,""]
["",null,null,""," ",null,{"$f":"IF(F29>0,INDEX(Poeng!$A$1:$B$100,F29,2),\"\")","v":""},null,{"$f":"IF(H29>0,INDEX(Poeng!$A$1:$B$100,H29,2),\"\")","v":""},null,{"$f":"IF(J29>0,INDEX(Poeng!$A$1:$B$100,J29,2),\"\")","v":""},null,{"$f":"IF(L29>0,INDEX(Poeng!$A$1:$B$100,L29,2),\"\")","v":""},null,{"$f":"IF(N29>0,INDEX(Poeng!$A$1:$B$100,N29,2),\"\")","v":""},null,{"$f":"IF(P29>0,INDEX(Poeng!$A$1:$B$100,P29,2),\"\")","v":""},0,0,0,0,0,0,{"$f":"IF(#REF!>0,#REF!,0)","v":{"$error":"#REF!"}},0,0,0,0,0,0,0,""]
["",null,null,"",{"$f":"IF(AD30<4,\" \",\"F\")","v":" "},null,{"$f":"IF(F30>0,INDEX(Poeng!$A$1:$B$100,F30,2),\"\")","v":""},null,{"$f":"IF(H30>0,INDEX(Poeng!$A$1:$B$100,H30,2),\"\")","v":""},null,{"$f":"IF(J30>0,INDEX(Poeng!$A$1:$B$100,J30,2),\"\")","v":""},null,null,null,{"$f":"IF(N30>0,INDEX(Poeng!$A$1:$B$100,N30,2),\"\")","v":""},null,{"$f":"IF(P30>0,INDEX(Poeng!$A$1:$B$100,P30,2),\"\")","v":""},0,0,0,0,0,0,{"$f":"IF(#REF!>0,#REF!,0)","v":{"$error":"#REF!"}},0,0,0,0,0,0,0,""]
[{"$f":"AF31","v":""},null,null,"",{"$f":"IF(AD31<4,\" \",\"F\")","v":" "},null,{"$f":"IF(F31>0,INDEX(Poeng!$A$1:$B$100,F31,2),\"\")","v":""},null,{"$f":"IF(H31>0,INDEX(Poeng!$A$1:$B$100,H31,2),\"\")","v":""},null,{"$f":"IF(J31>0,INDEX(Poeng!$A$1:$B$100,J31,2),\"\")","v":""},null,{"$f":"IF(L31>0,INDEX(Poeng!$A$1:$B$100,L31,2),\"\")","v":""},null,{"$f":"IF(N31>0,INDEX(Poeng!$A$1:$B$100,N31,2),\"\")","v":""},null,{"$f":"IF(P31>0,INDEX(Poeng!$A$1:$B$100,P31,2),\"\")","v":""},0,0,0,0,0,0,{"$f":"IF(#REF!>0,#REF!,0)","v":{"$error":"#REF!"}},{"$f":"LARGE(R31:W31,1)","v":0},{"$f":"LARGE(R31:W31,2)","v":0},{"$f":"LARGE(R31:W31,3)","v":0},{"$f":"LARGE(R31:W31,4)","v":0},{"$f":"SUM(Y31:AB31)","v":0},0,{"$f":"AC31*10^8+Y31*10^6/2+Z31*10^4/2+AA31*10^2/2+AB31/2","v":0},""]
["",null,null,""," ",null,{"$f":"IF(F32>0,INDEX(Poeng!$A$1:$B$100,F32,2),\"\")","v":""},null,{"$f":"IF(H32>0,INDEX(Poeng!$A$1:$B$100,H32,2),\"\")","v":""},null,{"$f":"IF(J32>0,INDEX(Poeng!$A$1:$B$100,J32,2),\"\")","v":""},null,{"$f":"IF(L32>0,INDEX(Poeng!$A$1:$B$100,L32,2),\"\")","v":""},null,{"$f":"IF(N32>0,INDEX(Poeng!$A$1:$B$100,N32,2),\"\")","v":""},null,{"$f":"IF(P32>0,INDEX(Poeng!$A$1:$B$100,P32,2),\"\")","v":""},0,0,0,0,0,0,{"$f":"IF(#REF!>0,#REF!,0)","v":{"$error":"#REF!"}},0,0,0,0,0,0,0,""]
["",null,null,""," ",null,{"$f":"IF(F33>0,INDEX(Poeng!$A$1:$B$100,F33,2),\"\")","v":""},null,{"$f":"IF(H33>0,INDEX(Poeng!$A$1:$B$100,H33,2),\"\")","v":""},null,{"$f":"IF(J33>0,INDEX(Poeng!$A$1:$B$100,J33,2),\"\")","v":""},null,{"$f":"IF(L33>0,INDEX(Poeng!$A$1:$B$100,L33,2),\"\")","v":""},null,{"$f":"IF(N33>0,INDEX(Poeng!$A$1:$B$100,N33,2),\"\")","v":""},null,{"$f":"IF(P33>0,INDEX(Poeng!$A$1:$B$100,P33,2),\"\")","v":""},0,0,0,0,0,0,{"$f":"IF(#REF!>0,#REF!,0)","v":{"$error":"#REF!"}},0,0,0,0,0,0,0,""]
["",null,null,""," ",null,{"$f":"IF(F34>0,INDEX(Poeng!$A$1:$B$100,F34,2),\"\")","v":""},null,{"$f":"IF(H34>0,INDEX(Poeng!$A$1:$B$100,H34,2),\"\")","v":""},null,{"$f":"IF(J34>0,INDEX(Poeng!$A$1:$B$100,J34,2),\"\")","v":""},null,{"$f":"IF(L34>0,INDEX(Poeng!$A$1:$B$100,L34,2),\"\")","v":""},null,{"$f":"IF(N34>0,INDEX(Poeng!$A$1:$B$100,N34,2),\"\")","v":""},null,{"$f":"IF(P34>0,INDEX(Poeng!$A$1:$B$100,P34,2),\"\")","v":""},0,0,0,0,0,0,{"$f":"IF(#REF!>0,#REF!,0)","v":{"$error":"#REF!"}},0,0,0,0,0,0,0,""]
["",null,null,""," ",null,{"$f":"IF(F35>0,INDEX(Poeng!$A$1:$B$100,F35,2),\"\")","v":""},null,{"$f":"IF(H35>0,INDEX(Poeng!$A$1:$B$100,H35,2),\"\")","v":""},null,{"$f":"IF(J35>0,INDEX(Poeng!$A$1:$B$100,J35,2),\"\")","v":""},null,{"$f":"IF(L35>0,INDEX(Poeng!$A$1:$B$100,L35,2),\"\")","v":""},null,{"$f":"IF(N35>0,INDEX(Poeng!$A$1:$B$100,N35,2),\"\")","v":""},null,{"$f":"IF(P35>0,INDEX(Poeng!$A$1:$B$100,P35,2),\"\")","v":""},0,0,0,0,0,0,{"$f":"IF(#REF!>0,#REF!,0)","v":{"$error":"#REF!"}},0,0,0,0,0,0,0,""]
["",null,null,{"$f":"IF(B36<>\"\",AC36,\"\")","v":""}," ",null,{"$f":"IF(F36>0,INDEX(Poeng!$A$1:$B$100,F36,2),\"\")","v":""},null,{"$f":"IF(H36>0,INDEX(Poeng!$A$1:$B$100,H36,2),\"\")","v":""},null,{"$f":"IF(J36>0,INDEX(Poeng!$A$1:$B$100,J36,2),\"\")","v":""},null,{"$f":"IF(L36>0,INDEX(Poeng!$A$1:$B$100,L36,2),\"\")","v":""},null,{"$f":"IF(N36>0,INDEX(Poeng!$A$1:$B$100,N36,2),\"\")","v":""},null,{"$f":"IF(P36>0,INDEX(Poeng!$A$1:$B$100,P36,2),\"\")","v":""},{"$f":"IF(F36>0,G36,0)","v":0},{"$f":"IF(H36>0,I36,0)","v":0},{"$f":"IF(J36>0,K36,0)","v":0},{"$f":"IF(L36>0,M36,0)","v":0},{"$f":"IF(N36>0,O36,0)","v":0},{"$f":"IF(P36>0,Q36,0)","v":0},{"$f":"IF(#REF!>0,#REF!,0)","v":{"$error":"#REF!"}},0,0,0,0,0,{"$f":"COUNT(F36:Q36)/2","v":0},0,{"$f":"IF(B36<>\"\",RANK(AE36,AE$4:AE$71,0),\"\")","v":""}]
["",null,null,""," ",null,{"$f":"IF(F37>0,INDEX(Poeng!$A$1:$B$100,F37,2),\"\")","v":""},null,{"$f":"IF(H37>0,INDEX(Poeng!$A$1:$B$100,H37,2),\"\")","v":""},null,{"$f":"IF(J37>0,INDEX(Poeng!$A$1:$B$100,J37,2),\"\")","v":""},null,{"$f":"IF(L37>0,INDEX(Poeng!$A$1:$B$100,L37,2),\"\")","v":""},null,{"$f":"IF(N37>0,INDEX(Poeng!$A$1:$B$100,N37,2),\"\")","v":""},null,{"$f":"IF(P37>0,INDEX(Poeng!$A$1:$B$100,P37,2),\"\")","v":""},0,0,0,0,0,0,{"$f":"IF(#REF!>0,#REF!,0)","v":{"$error":"#REF!"}},0,0,0,0,0,0,0,""]
["",null,null,""," ",null,{"$f":"IF(F38>0,INDEX(Poeng!$A$1:$B$100,F38,2),\"\")","v":""},null,{"$f":"IF(H38>0,INDEX(Poeng!$A$1:$B$100,H38,2),\"\")","v":""},null,{"$f":"IF(J38>0,INDEX(Poeng!$A$1:$B$100,J38,2),\"\")","v":""},null,{"$f":"IF(L38>0,INDEX(Poeng!$A$1:$B$100,L38,2),\"\")","v":""},null,{"$f":"IF(N38>0,INDEX(Poeng!$A$1:$B$100,N38,2),\"\")","v":""},null,{"$f":"IF(P38>0,INDEX(Poeng!$A$1:$B$100,P38,2),\"\")","v":""},0,0,0,0,0,0,{"$f":"IF(#REF!>0,#REF!,0)","v":{"$error":"#REF!"}},0,0,0,0,0,0,0,""]
["",null,null,""," ",null,{"$f":"IF(F39>0,INDEX(Poeng!$A$1:$B$100,F39,2),\"\")","v":""},null,{"$f":"IF(H39>0,INDEX(Poeng!$A$1:$B$100,H39,2),\"\")","v":""},null,{"$f":"IF(J39>0,INDEX(Poeng!$A$1:$B$100,J39,2),\"\")","v":""},null,{"$f":"IF(L39>0,INDEX(Poeng!$A$1:$B$100,L39,2),\"\")","v":""},null,{"$f":"IF(N39>0,INDEX(Poeng!$A$1:$B$100,N39,2),\"\")","v":""},null,{"$f":"IF(P39>0,INDEX(Poeng!$A$1:$B$100,P39,2),\"\")","v":""},0,0,0,0,0,0,{"$f":"IF(#REF!>0,#REF!,0)","v":{"$error":"#REF!"}},0,0,0,0,0,0,0,""]
["",null,null,""," ",null,{"$f":"IF(F40>0,INDEX(Poeng!$A$1:$B$100,F40,2),\"\")","v":""},null,{"$f":"IF(H40>0,INDEX(Poeng!$A$1:$B$100,H40,2),\"\")","v":""},null,{"$f":"IF(J40>0,INDEX(Poeng!$A$1:$B$100,J40,2),\"\")","v":""},null,{"$f":"IF(L40>0,INDEX(Poeng!$A$1:$B$100,L40,2),\"\")","v":""},null,{"$f":"IF(N40>0,INDEX(Poeng!$A$1:$B$100,N40,2),\"\")","v":""},null,{"$f":"IF(P40>0,INDEX(Poeng!$A$1:$B$100,P40,2),\"\")","v":""},0,0,0,0,0,0,{"$f":"IF(#REF!>0,#REF!,0)","v":{"$error":"#REF!"}},0,0,0,0,0,0,0,""]
["",null,null,""," ",null,{"$f":"IF(F41>0,INDEX(Poeng!$A$1:$B$100,F41,2),\"\")","v":""},null,{"$f":"IF(H41>0,INDEX(Poeng!$A$1:$B$100,H41,2),\"\")","v":""},null,{"$f":"IF(J41>0,INDEX(Poeng!$A$1:$B$100,J41,2),\"\")","v":""},null,{"$f":"IF(L41>0,INDEX(Poeng!$A$1:$B$100,L41,2),\"\")","v":""},null,{"$f":"IF(N41>0,INDEX(Poeng!$A$1:$B$100,N41,2),\"\")","v":""},null,{"$f":"IF(P41>0,INDEX(Poeng!$A$1:$B$100,P41,2),\"\")","v":""},0,0,0,0,0,0,{"$f":"IF(#REF!>0,#REF!,0)","v":{"$error":"#REF!"}},0,0,0,0,0,0,0,""]
["",null,null,""," ",null,{"$f":"IF(F42>0,INDEX(Poeng!$A$1:$B$100,F42,2),\"\")","v":""},null,{"$f":"IF(H42>0,INDEX(Poeng!$A$1:$B$100,H42,2),\"\")","v":""},null,{"$f":"IF(J42>0,INDEX(Poeng!$A$1:$B$100,J42,2),\"\")","v":""},null,{"$f":"IF(L42>0,INDEX(Poeng!$A$1:$B$100,L42,2),\"\")","v":""},null,{"$f":"IF(N42>0,INDEX(Poeng!$A$1:$B$100,N42,2),\"\")","v":""},null,{"$f":"IF(P42>0,INDEX(Poeng!$A$1:$B$100,P42,2),\"\")","v":""},0,0,0,0,0,0,{"$f":"IF(#REF!>0,#REF!,0)","v":{"$error":"#REF!"}},0,0,0,0,0,0,0,""]
["",null,null,""," ",null,{"$f":"IF(F43>0,INDEX(Poeng!$A$1:$B$100,F43,2),\"\")","v":""},null,{"$f":"IF(H43>0,INDEX(Poeng!$A$1:$B$100,H43,2),\"\")","v":""},null,{"$f":"IF(J43>0,INDEX(Poeng!$A$1:$B$100,J43,2),\"\")","v":""},null,{"$f":"IF(L43>0,INDEX(Poeng!$A$1:$B$100,L43,2),\"\")","v":""},null,{"$f":"IF(N43>0,INDEX(Poeng!$A$1:$B$100,N43,2),\"\")","v":""},null,{"$f":"IF(P43>0,INDEX(Poeng!$A$1:$B$100,P43,2),\"\")","v":""},0,0,0,0,0,0,{"$f":"IF(#REF!>0,#REF!,0)","v":{"$error":"#REF!"}},0,0,0,0,0,0,0,""]
["",null,null,""," ",null,{"$f":"IF(F44>0,INDEX(Poeng!$A$1:$B$100,F44,2),\"\")","v":""},null,{"$f":"IF(H44>0,INDEX(Poeng!$A$1:$B$100,H44,2),\"\")","v":""},null,{"$f":"IF(J44>0,INDEX(Poeng!$A$1:$B$100,J44,2),\"\")","v":""},null,{"$f":"IF(L44>0,INDEX(Poeng!$A$1:$B$100,L44,2),\"\")","v":""},null,{"$f":"IF(N44>0,INDEX(Poeng!$A$1:$B$100,N44,2),\"\")","v":""},null,{"$f":"IF(P44>0,INDEX(Poeng!$A$1:$B$100,P44,2),\"\")","v":""},0,0,0,0,0,0,{"$f":"IF(#REF!>0,#REF!,0)","v":{"$error":"#REF!"}},0,0,0,0,0,0,0,""]
["",null,null,""," ",null,{"$f":"IF(F45>0,INDEX(Poeng!$A$1:$B$100,F45,2),\"\")","v":""},null,{"$f":"IF(H45>0,INDEX(Poeng!$A$1:$B$100,H45,2),\"\")","v":""},null,{"$f":"IF(J45>0,INDEX(Poeng!$A$1:$B$100,J45,2),\"\")","v":""},null,{"$f":"IF(L45>0,INDEX(Poeng!$A$1:$B$100,L45,2),\"\")","v":""},null,{"$f":"IF(N45>0,INDEX(Poeng!$A$1:$B$100,N45,2),\"\")","v":""},null,{"$f":"IF(P45>0,INDEX(Poeng!$A$1:$B$100,P45,2),\"\")","v":""},0,0,0,0,0,0,{"$f":"IF(#REF!>0,#REF!,0)","v":{"$error":"#REF!"}},0,0,0,0,0,0,0,""]
["",null,null,""," ",null,{"$f":"IF(F46>0,INDEX(Poeng!$A$1:$B$100,F46,2),\"\")","v":""},null,{"$f":"IF(H46>0,INDEX(Poeng!$A$1:$B$100,H46,2),\"\")","v":""},null,{"$f":"IF(J46>0,INDEX(Poeng!$A$1:$B$100,J46,2),\"\")","v":""},null,{"$f":"IF(L46>0,INDEX(Poeng!$A$1:$B$100,L46,2),\"\")","v":""},null,{"$f":"IF(N46>0,INDEX(Poeng!$A$1:$B$100,N46,2),\"\")","v":""},null,{"$f":"IF(P46>0,INDEX(Poeng!$A$1:$B$100,P46,2),\"\")","v":""},0,0,0,0,0,0,{"$f":"IF(#REF!>0,#REF!,0)","v":{"$error":"#REF!"}},0,0,0,0,0,0,0,""]
["",null,null,""," ",null,null,null,{"$f":"IF(H47>0,INDEX(Poeng!$A$1:$B$100,H47,2),\"\")","v":""},null,{"$f":"IF(J47>0,INDEX(Poeng!$A$1:$B$100,J47,2),\"\")","v":""},null,{"$f":"IF(L47>0,INDEX(Poeng!$A$1:$B$100,L47,2),\"\")","v":""},null,{"$f":"IF(N47>0,INDEX(Poeng!$A$1:$B$100,N47,2),\"\")","v":""},null,{"$f":"IF(P47>0,INDEX(Poeng!$A$1:$B$100,P47,2),\"\")","v":""},0,0,0,0,0,0,{"$f":"IF(#REF!>0,#REF!,0)","v":{"$error":"#REF!"}},0,0,0,0,0,0,0,""]
["",null,null,""," ",null,null,null,{"$f":"IF(H48>0,INDEX(Poeng!$A$1:$B$100,H48,2),\"\")","v":""},null,{"$f":"IF(J48>0,INDEX(Poeng!$A$1:$B$100,J48,2),\"\")","v":""},null,{"$f":"IF(L48>0,INDEX(Poeng!$A$1:$B$100,L48,2),\"\")","v":""},null,{"$f":"IF(N48>0,INDEX(Poeng!$A$1:$B$100,N48,2),\"\")","v":""},null,{"$f":"IF(P48>0,INDEX(Poeng!$A$1:$B$100,P48,2),\"\")","v":""},0,0,0,0,0,0,{"$f":"IF(#REF!>0,#REF!,0)","v":{"$error":"#REF!"}},0,0,0,0,0,0,0,""]
["",null,null,""," ",null,null,null,{"$f":"IF(H49>0,INDEX(Poeng!$A$1:$B$100,H49,2),\"\")","v":""},null,{"$f":"IF(J49>0,INDEX(Poeng!$A$1:$B$100,J49,2),\"\")","v":""},null,{"$f":"IF(L49>0,INDEX(Poeng!$A$1:$B$100,L49,2),\"\")","v":""},null,{"$f":"IF(N49>0,INDEX(Poeng!$A$1:$B$100,N49,2),\"\")","v":""},null,{"$f":"IF(P49>0,INDEX(Poeng!$A$1:$B$100,P49,2),\"\")","v":""},0,0,0,0,0,0,{"$f":"IF(#REF!>0,#REF!,0)","v":{"$error":"#REF!"}},0,0,0,0,0,0,0,""]
["",null,null,""," ",null,null,null,{"$f":"IF(H50>0,INDEX(Poeng!$A$1:$B$100,H50,2),\"\")","v":""},null,{"$f":"IF(J50>0,INDEX(Poeng!$A$1:$B$100,J50,2),\"\")","v":""},null,{"$f":"IF(L50>0,INDEX(Poeng!$A$1:$B$100,L50,2),\"\")","v":""},null,{"$f":"IF(N50>0,INDEX(Poeng!$A$1:$B$100,N50,2),\"\")","v":""},null,{"$f":"IF(P50>0,INDEX(Poeng!$A$1:$B$100,P50,2),\"\")","v":""},0,0,0,0,0,0,{"$f":"IF(#REF!>0,#REF!,0)","v":{"$error":"#REF!"}},0,0,0,0,0,0,0,""]
["",null,null,""," ",null,null,null,{"$f":"IF(H51>0,INDEX(Poeng!$A$1:$B$100,H51,2),\"\")","v":""},null,{"$f":"IF(J51>0,INDEX(Poeng!$A$1:$B$100,J51,2),\"\")","v":""},null,{"$f":"IF(L51>0,INDEX(Poeng!$A$1:$B$100,L51,2),\"\")","v":""},null,{"$f":"IF(N51>0,INDEX(Poeng!$A$1:$B$100,N51,2),\"\")","v":""},null,{"$f":"IF(P51>0,INDEX(Poeng!$A$1:$B$100,P51,2),\"\")","v":""},0,0,0,0,0,0,{"$f":"IF(#REF!>0,#REF!,0)","v":{"$error":"#REF!"}},0,0,0,0,0,0,0,""]
["",null,null,""," ",null,null,null,{"$f":"IF(H52>0,INDEX(Poeng!$A$1:$B$100,H52,2),\"\")","v":""},null,{"$f":"IF(J52>0,INDEX(Poeng!$A$1:$B$100,J52,2),\"\")","v":""},null,{"$f":"IF(L52>0,INDEX(Poeng!$A$1:$B$100,L52,2),\"\")","v":""},null,{"$f":"IF(N52>0,INDEX(Poeng!$A$1:$B$100,N52,2),\"\")","v":""},null,{"$f":"IF(P52>0,INDEX(Poeng!$A$1:$B$100,P52,2),\"\")","v":""},0,0,0,0,0,0,{"$f":"IF(#REF!>0,#REF!,0)","v":{"$error":"#REF!"}},0,0,0,0,0,0,0,""]
["",null,null,""," ",null,null,null,{"$f":"IF(H53>0,INDEX(Poeng!$A$1:$B$100,H53,2),\"\")","v":""},null,{"$f":"IF(J53>0,INDEX(Poeng!$A$1:$B$100,J53,2),\"\")","v":""},null,{"$f":"IF(L53>0,INDEX(Poeng!$A$1:$B$100,L53,2),\"\")","v":""},null,{"$f":"IF(N53>0,INDEX(Poeng!$A$1:$B$100,N53,2),\"\")","v":""},null,{"$f":"IF(P53>0,INDEX(Poeng!$A$1:$B$100,P53,2),\"\")","v":""},0,0,0,0,0,0,{"$f":"IF(#REF!>0,#REF!,0)","v":{"$error":"#REF!"}},0,0,0,0,0,0,0,""]
["",null,null,""," ",null,null,null,{"$f":"IF(H54>0,INDEX(Poeng!$A$1:$B$100,H54,2),\"\")","v":""},null,{"$f":"IF(J54>0,INDEX(Poeng!$A$1:$B$100,J54,2),\"\")","v":""},null,{"$f":"IF(L54>0,INDEX(Poeng!$A$1:$B$100,L54,2),\"\")","v":""},null,{"$f":"IF(N54>0,INDEX(Poeng!$A$1:$B$100,N54,2),\"\")","v":""},null,{"$f":"IF(P54>0,INDEX(Poeng!$A$1:$B$100,P54,2),\"\")","v":""},0,0,0,0,0,0,{"$f":"IF(#REF!>0,#REF!,0)","v":{"$error":"#REF!"}},0,0,0,0,0,0,0,""]
["",null,null,""," ",null,null,null,{"$f":"IF(H55>0,INDEX(Poeng!$A$1:$B$100,H55,2),\"\")","v":""},null,{"$f":"IF(J55>0,INDEX(Poeng!$A$1:$B$100,J55,2),\"\")","v":""},null,{"$f":"IF(L55>0,INDEX(Poeng!$A$1:$B$100,L55,2),\"\")","v":""},null,{"$f":"IF(N55>0,INDEX(Poeng!$A$1:$B$100,N55,2),\"\")","v":""},null,{"$f":"IF(P55>0,INDEX(Poeng!$A$1:$B$100,P55,2),\"\")","v":""},0,0,0,0,0,0,{"$f":"IF(#REF!>0,#REF!,0)","v":{"$error":"#REF!"}},0,0,0,0,0,0,0,""]
["",null,null,""," ",null,null,null,{"$f":"IF(H56>0,INDEX(Poeng!$A$1:$B$100,H56,2),\"\")","v":""},null,{"$f":"IF(J56>0,INDEX(Poeng!$A$1:$B$100,J56,2),\"\")","v":""},null,{"$f":"IF(L56>0,INDEX(Poeng!$A$1:$B$100,L56,2),\"\")","v":""},null,{"$f":"IF(N56>0,INDEX(Poeng!$A$1:$B$100,N56,2),\"\")","v":""},null,{"$f":"IF(P56>0,INDEX(Poeng!$A$1:$B$100,P56,2),\"\")","v":""},0,0,0,0,0,0,{"$f":"IF(#REF!>0,#REF!,0)","v":{"$error":"#REF!"}},0,0,0,0,0,0,0,""]
["",null,null,""," ",null,null,null,{"$f":"IF(H57>0,INDEX(Poeng!$A$1:$B$100,H57,2),\"\")","v":""},null,{"$f":"IF(J57>0,INDEX(Poeng!$A$1:$B$100,J57,2),\"\")","v":""},null,{"$f":"IF(L57>0,INDEX(Poeng!$A$1:$B$100,L57,2),\"\")","v":""},null,{"$f":"IF(N57>0,INDEX(Poeng!$A$1:$B$100,N57,2),\"\")","v":""},null,{"$f":"IF(P57>0,INDEX(Poeng!$A$1:$B$100,P57,2),\"\")","v":""},0,0,0,0,0,0,{"$f":"IF(#REF!>0,#REF!,0)","v":{"$error":"#REF!"}},0,0,0,0,0,0,0,""]
["",null,null,""," ",null,null,null,{"$f":"IF(H58>0,INDEX(Poeng!$A$1:$B$100,H58,2),\"\")","v":""},null,{"$f":"IF(J58>0,INDEX(Poeng!$A$1:$B$100,J58,2),\"\")","v":""},null,{"$f":"IF(L58>0,INDEX(Poeng!$A$1:$B$100,L58,2),\"\")","v":""},null,{"$f":"IF(N58>0,INDEX(Poeng!$A$1:$B$100,N58,2),\"\")","v":""},null,{"$f":"IF(P58>0,INDEX(Poeng!$A$1:$B$100,P58,2),\"\")","v":""},0,0,0,0,0,0,{"$f":"IF(#REF!>0,#REF!,0)","v":{"$error":"#REF!"}},0,0,0,0,0,0,0,""]
["",null,null,""," ",null,null,null,{"$f":"IF(H59>0,INDEX(Poeng!$A$1:$B$100,H59,2),\"\")","v":""},null,{"$f":"IF(J59>0,INDEX(Poeng!$A$1:$B$100,J59,2),\"\")","v":""},null,{"$f":"IF(L59>0,INDEX(Poeng!$A$1:$B$100,L59,2),\"\")","v":""},null,{"$f":"IF(N59>0,INDEX(Poeng!$A$1:$B$100,N59,2),\"\")","v":""},null,{"$f":"IF(P59>0,INDEX(Poeng!$A$1:$B$100,P59,2),\"\")","v":""},0,0,0,0,0,0,{"$f":"IF(#REF!>0,#REF!,0)","v":{"$error":"#REF!"}},0,0,0,0,0,0,0,""]
["",null,null,""," ",null,null,null,{"$f":"IF(H60>0,INDEX(Poeng!$A$1:$B$100,H60,2),\"\")","v":""},null,{"$f":"IF(J60>0,INDEX(Poeng!$A$1:$B$100,J60,2),\"\")","v":""},null,{"$f":"IF(L60>0,INDEX(Poeng!$A$1:$B$100,L60,2),\"\")","v":""},null,{"$f":"IF(N60>0,INDEX(Poeng!$A$1:$B$100,N60,2),\"\")","v":""},null,{"$f":"IF(P60>0,INDEX(Poeng!$A$1:$B$100,P60,2),\"\")","v":""},0,0,0,0,0,0,{"$f":"IF(#REF!>0,#REF!,0)","v":{"$error":"#REF!"}},0,0,0,0,0,0,0,""]
["",null,null,""," ",null,null,null,{"$f":"IF(H61>0,INDEX(Poeng!$A$1:$B$100,H61,2),\"\")","v":""},null,{"$f":"IF(J61>0,INDEX(Poeng!$A$1:$B$100,J61,2),\"\")","v":""},null,{"$f":"IF(L61>0,INDEX(Poeng!$A$1:$B$100,L61,2),\"\")","v":""},null,{"$f":"IF(N61>0,INDEX(Poeng!$A$1:$B$100,N61,2),\"\")","v":""},null,{"$f":"IF(P61>0,INDEX(Poeng!$A$1:$B$100,P61,2),\"\")","v":""},0,0,0,0,0,0,{"$f":"IF(#REF!>0,#REF!,0)","v":{"$error":"#REF!"}},0,0,0,0,0,0,0,""]
["",null,null,""," ",null,null,null,{"$f":"IF(H62>0,INDEX(Poeng!$A$1:$B$100,H62,2),\"\")","v":""},null,{"$f":"IF(J62>0,INDEX(Poeng!$A$1:$B$100,J62,2),\"\")","v":""},null,{"$f":"IF(L62>0,INDEX(Poeng!$A$1:$B$100,L62,2),\"\")","v":""},null,{"$f":"IF(N62>0,INDEX(Poeng!$A$1:$B$100,N62,2),\"\")","v":""},null,{"$f":"IF(P62>0,INDEX(Poeng!$A$1:$B$100,P62,2),\"\")","v":""},0,0,0,0,0,0,{"$f":"IF(#REF!>0,#REF!,0)","v":{"$error":"#REF!"}},0,0,0,0,0,0,0,""]
["",null,null,""," ",null,null,null,{"$f":"IF(H63>0,INDEX(Poeng!$A$1:$B$100,H63,2),\"\")","v":""},null,{"$f":"IF(J63>0,INDEX(Poeng!$A$1:$B$100,J63,2),\"\")","v":""},null,{"$f":"IF(L63>0,INDEX(Poeng!$A$1:$B$100,L63,2),\"\")","v":""},null,{"$f":"IF(N63>0,INDEX(Poeng!$A$1:$B$100,N63,2),\"\")","v":""},null,{"$f":"IF(P63>0,INDEX(Poeng!$A$1:$B$100,P63,2),\"\")","v":""},0,0,0,0,0,0,{"$f":"IF(#REF!>0,#REF!,0)","v":{"$error":"#REF!"}},0,0,0,0,0,0,0,""]
["",null,null,""," ",null,null,null,{"$f":"IF(H64>0,INDEX(Poeng!$A$1:$B$100,H64,2),\"\")","v":""},null,{"$f":"IF(J64>0,INDEX(Poeng!$A$1:$B$100,J64,2),\"\")","v":""},null,{"$f":"IF(L64>0,INDEX(Poeng!$A$1:$B$100,L64,2),\"\")","v":""},null,{"$f":"IF(N64>0,INDEX(Poeng!$A$1:$B$100,N64,2),\"\")","v":""},null,{"$f":"IF(P64>0,INDEX(Poeng!$A$1:$B$100,P64,2),\"\")","v":""},0,0,0,0,0,0,{"$f":"IF(#REF!>0,#REF!,0)","v":{"$error":"#REF!"}},0,0,0,0,0,0,0,""]
[{"$f":"AF65","v":""},null,null,""," ",null,null,null,{"$f":"IF(H65>0,INDEX(Poeng!$A$1:$B$100,H65,2),\"\")","v":""},null,{"$f":"IF(J65>0,INDEX(Poeng!$A$1:$B$100,J65,2),\"\")","v":""},null,{"$f":"IF(L65>0,INDEX(Poeng!$A$1:$B$100,L65,2),\"\")","v":""},null,{"$f":"IF(N65>0,INDEX(Poeng!$A$1:$B$100,N65,2),\"\")","v":""},null,{"$f":"IF(P65>0,INDEX(Poeng!$A$1:$B$100,P65,2),\"\")","v":""},0,0,0,0,0,0,{"$f":"IF(#REF!>0,#REF!,0)","v":{"$error":"#REF!"}},{"$f":"LARGE(R65:W65,1)","v":0},{"$f":"LARGE(R65:W65,2)","v":0},{"$f":"LARGE(R65:W65,3)","v":0},{"$f":"LARGE(R65:W65,4)","v":0},{"$f":"SUM(Y65:AB65)","v":0},0,{"$f":"AC65*10^8+Y65*10^6/2+Z65*10^4/2+AA65*10^2/2+AB65/2","v":0},""]
["",null,null,""," ",null,null,null,{"$f":"IF(H66>0,INDEX(Poeng!$A$1:$B$100,H66,2),\"\")","v":""},null,{"$f":"IF(J66>0,INDEX(Poeng!$A$1:$B$100,J66,2),\"\")","v":""},null,{"$f":"IF(L66>0,INDEX(Poeng!$A$1:$B$100,L66,2),\"\")","v":""},null,{"$f":"IF(N66>0,INDEX(Poeng!$A$1:$B$100,N66,2),\"\")","v":""},null,{"$f":"IF(P66>0,INDEX(Poeng!$A$1:$B$100,P66,2),\"\")","v":""},0,0,0,0,0,0,{"$f":"IF(#REF!>0,#REF!,0)","v":{"$error":"#REF!"}},0,0,0,0,0,0,0,""]
["",null,null,""," ",null,null,null,{"$f":"IF(H67>0,INDEX(Poeng!$A$1:$B$100,H67,2),\"\")","v":""},null,{"$f":"IF(J67>0,INDEX(Poeng!$A$1:$B$100,J67,2),\"\")","v":""},null,{"$f":"IF(L67>0,INDEX(Poeng!$A$1:$B$100,L67,2),\"\")","v":""},null,{"$f":"IF(N67>0,INDEX(Poeng!$A$1:$B$100,N67,2),\"\")","v":""},null,{"$f":"IF(P67>0,INDEX(Poeng!$A$1:$B$100,P67,2),\"\")","v":""},0,0,0,0,0,0,{"$f":"IF(#REF!>0,#REF!,0)","v":{"$error":"#REF!"}},0,0,0,0,0,0,0,""]
["",null,null,{"$f":"IF(B68<>\"\",AC68,\"\")","v":""}," ",null,null,null,{"$f":"IF(H68>0,INDEX(Poeng!$A$1:$B$100,H68,2),\"\")","v":""},null,{"$f":"IF(J68>0,INDEX(Poeng!$A$1:$B$100,J68,2),\"\")","v":""},null,{"$f":"IF(L68>0,INDEX(Poeng!$A$1:$B$100,L68,2),\"\")","v":""},null,{"$f":"IF(N68>0,INDEX(Poeng!$A$1:$B$100,N68,2),\"\")","v":""},null,{"$f":"IF(P68>0,INDEX(Poeng!$A$1:$B$100,P68,2),\"\")","v":""},{"$f":"IF(F68>0,G68,0)","v":0},{"$f":"IF(H68>0,I68,0)","v":0},{"$f":"IF(J68>0,K68,0)","v":0},{"$f":"IF(L68>0,M68,0)","v":0},{"$f":"IF(N68>0,O68,0)","v":0},{"$f":"IF(P68>0,Q68,0)","v":0},{"$f":"IF(#REF!>0,#REF!,0)","v":{"$error":"#REF!"}},0,0,0,0,0,{"$f":"COUNT(F68:Q68)/2","v":0},0,{"$f":"IF(B68<>\"\",RANK(AE68,AE$4:AE$71,0),\"\")","v":""}]
["",null,null,""," ",null,null,null,{"$f":"IF(H69>0,INDEX(Poeng!$A$1:$B$100,H69,2),\"\")","v":""},null,{"$f":"IF(J69>0,INDEX(Poeng!$A$1:$B$100,J69,2),\"\")","v":""},null,{"$f":"IF(L69>0,INDEX(Poeng!$A$1:$B$100,L69,2),\"\")","v":""},null,{"$f":"IF(N69>0,INDEX(Poeng!$A$1:$B$100,N69,2),\"\")","v":""},null,{"$f":"IF(P69>0,INDEX(Poeng!$A$1:$B$100,P69,2),\"\")","v":""},0,0,0,0,0,0,{"$f":"IF(#REF!>0,#REF!,0)","v":{"$error":"#REF!"}},0,0,0,0,0,0,0,""]
["",null,null,""," ",null,null,null,{"$f":"IF(H70>0,INDEX(Poeng!$A$1:$B$100,H70,2),\"\")","v":""},null,{"$f":"IF(J70>0,INDEX(Poeng!$A$1:$B$100,J70,2),\"\")","v":""},null,{"$f":"IF(L70>0,INDEX(Poeng!$A$1:$B$100,L70,2),\"\")","v":""},null,{"$f":"IF(N70>0,INDEX(Poeng!$A$1:$B$100,N70,2),\"\")","v":""},null,{"$f":"IF(P70>0,INDEX(Poeng!$A$1:$B$100,P70,2),\"\")","v":""},0,0,0,0,0,0,{"$f":"IF(#REF!>0,#REF!,0)","v":{"$error":"#REF!"}},0,0,0,0,0,0,0,""]
["",null,null,""," ",null,null,null,{"$f":"IF(H71>0,INDEX(Poeng!$A$1:$B$100,H71,2),\"\")","v":""},null,{"$f":"IF(J71>0,INDEX(Poeng!$A$1:$B$100,J71,2),\"\")","v":""},null,{"$f":"IF(L71>0,INDEX(Poeng!$A$1:$B$100,L71,2),\"\")","v":""},null,{"$f":"IF(N71>0,INDEX(Poeng!$A$1:$B$100,N71,2),\"\")","v":""},null,{"$f":"IF(P71>0,INDEX(Poeng!$A$1:$B$100,P71,2),\"\")","v":""},0,0,0,0,0,0,{"$f":"IF(#REF!>0,#REF!,0)","v":{"$error":"#REF!"}},0,0,0,0,0,0,0,""]
["",null,null,""," ",null,null,null,{"$f":"IF(H72>0,INDEX(Poeng!$A$1:$B$100,H72,2),\"\")","v":""},null,{"$f":"IF(J72>0,INDEX(Poeng!$A$1:$B$100,J72,2),\"\")","v":""},null,{"$f":"IF(L72>0,INDEX(Poeng!$A$1:$B$100,L72,2),\"\")","v":""},null,{"$f":"IF(N72>0,INDEX(Poeng!$A$1:$B$100,N72,2),\"\")","v":""},null,{"$f":"IF(P72>0,INDEX(Poeng!$A$1:$B$100,P72,2),\"\")","v":""},0,0,0,0,0,0,{"$f":"IF(#REF!>0,#REF!,0)","v":{"$error":"#REF!"}},0,0,0,0,0,0,0,""]
["",null,null,""," ",null,null,null,{"$f":"IF(H73>0,INDEX(Poeng!$A$1:$B$100,H73,2),\"\")","v":""},null,{"$f":"IF(J73>0,INDEX(Poeng!$A$1:$B$100,J73,2),\"\")","v":""},null,{"$f":"IF(L73>0,INDEX(Poeng!$A$1:$B$100,L73,2),\"\")","v":""},null,{"$f":"IF(N73>0,INDEX(Poeng!$A$1:$B$100,N73,2),\"\")","v":""},null,{"$f":"IF(P73>0,INDEX(Poeng!$A$1:$B$100,P73,2),\"\")","v":""},0,0,0,0,0,0,{"$f":"IF(#REF!>0,#REF!,0)","v":{"$error":"#REF!"}},0,0,0,0,0,0,0,""]
["",null,null,""," ",null,null,null,{"$f":"IF(H74>0,INDEX(Poeng!$A$1:$B$100,H74,2),\"\")","v":""},null,{"$f":"IF(J74>0,INDEX(Poeng!$A$1:$B$100,J74,2),\"\")","v":""},null,{"$f":"IF(L74>0,INDEX(Poeng!$A$1:$B$100,L74,2),\"\")","v":""},null,{"$f":"IF(N74>0,INDEX(Poeng!$A$1:$B$100,N74,2),\"\")","v":""},null,{"$f":"IF(P74>0,INDEX(Poeng!$A$1:$B$100,P74,2),\"\")","v":""},0,0,0,0,0,0,{"$f":"IF(#REF!>0,#REF!,0)","v":{"$error":"#REF!"}},0,0,0,0,0,0,0,""]
["",null,null,""," ",null,null,null,{"$f":"IF(H75>0,INDEX(Poeng!$A$1:$B$100,H75,2),\"\")","v":""},null,{"$f":"IF(J75>0,INDEX(Poeng!$A$1:$B$100,J75,2),\"\")","v":""},null,{"$f":"IF(L75>0,INDEX(Poeng!$A$1:$B$100,L75,2),\"\")","v":""},null,{"$f":"IF(N75>0,INDEX(Poeng!$A$1:$B$100,N75,2),\"\")","v":""},null,{"$f":"IF(P75>0,INDEX(Poeng!$A$1:$B$100,P75,2),\"\")","v":""},0,0,0,0,0,0,{"$f":"IF(#REF!>0,#REF!,0)","v":{"$error":"#REF!"}},0,0,0,0,0,0,0,""]
["",null,null,""," ",null,null,null,{"$f":"IF(H76>0,INDEX(Poeng!$A$1:$B$100,H76,2),\"\")","v":""},null,{"$f":"IF(J76>0,INDEX(Poeng!$A$1:$B$100,J76,2),\"\")","v":""},null,{"$f":"IF(L76>0,INDEX(Poeng!$A$1:$B$100,L76,2),\"\")","v":""},null,{"$f":"IF(N76>0,INDEX(Poeng!$A$1:$B$100,N76,2),\"\")","v":""},null,{"$f":"IF(P76>0,INDEX(Poeng!$A$1:$B$100,P76,2),\"\")","v":""},0,0,0,0,0,0,{"$f":"IF(#REF!>0,#REF!,0)","v":{"$error":"#REF!"}},0,0,0,0,0,0,0,""]
["",null,null,""," ",null,null,null,{"$f":"IF(H77>0,INDEX(Poeng!$A$1:$B$100,H77,2),\"\")","v":""},null,{"$f":"IF(J77>0,INDEX(Poeng!$A$1:$B$100,J77,2),\"\")","v":""},null,{"$f":"IF(L77>0,INDEX(Poeng!$A$1:$B$100,L77,2),\"\")","v":""},null,{"$f":"IF(N77>0,INDEX(Poeng!$A$1:$B$100,N77,2),\"\")","v":""},null,{"$f":"IF(P77>0,INDEX(Poeng!$A$1:$B$100,P77,2),\"\")","v":""},0,0,0,0,0,0,{"$f":"IF(#REF!>0,#REF!,0)","v":{"$error":"#REF!"}},0,0,0,0,0,0,0,""]
["",null,null,""," ",null,null,null,{"$f":"IF(H78>0,INDEX(Poeng!$A$1:$B$100,H78,2),\"\")","v":""},null,{"$f":"IF(J78>0,INDEX(Poeng!$A$1:$B$100,J78,2),\"\")","v":""},null,{"$f":"IF(L78>0,INDEX(Poeng!$A$1:$B$100,L78,2),\"\")","v":""},null,{"$f":"IF(N78>0,INDEX(Poeng!$A$1:$B$100,N78,2),\"\")","v":""},null,{"$f":"IF(P78>0,INDEX(Poeng!$A$1:$B$100,P78,2),\"\")","v":""},0,0,0,0,0,0,{"$f":"IF(#REF!>0,#REF!,0)","v":{"$error":"#REF!"}},0,0,0,0,0,0,0,""]
["",null,null,""," ",null,null,null,{"$f":"IF(H79>0,INDEX(Poeng!$A$1:$B$100,H79,2),\"\")","v":""},null,{"$f":"IF(J79>0,INDEX(Poeng!$A$1:$B$100,J79,2),\"\")","v":""},null,{"$f":"IF(L79>0,INDEX(Poeng!$A$1:$B$100,L79,2),\"\")","v":""},null,{"$f":"IF(N79>0,INDEX(Poeng!$A$1:$B$100,N79,2),\"\")","v":""},null,{"$f":"IF(P79>0,INDEX(Poeng!$A$1:$B$100,P79,2),\"\")","v":""},0,0,0,0,0,0,{"$f":"IF(#REF!>0,#REF!,0)","v":{"$error":"#REF!"}},0,0,0,0,0,0,0,""]
["",null,null,""," ",null,null,null,{"$f":"IF(H80>0,INDEX(Poeng!$A$1:$B$100,H80,2),\"\")","v":""},null,{"$f":"IF(J80>0,INDEX(Poeng!$A$1:$B$100,J80,2),\"\")","v":""},null,{"$f":"IF(L80>0,INDEX(Poeng!$A$1:$B$100,L80,2),\"\")","v":""},null,{"$f":"IF(N80>0,INDEX(Poeng!$A$1:$B$100,N80,2),\"\")","v":""},null,{"$f":"IF(P80>0,INDEX(Poeng!$A$1:$B$100,P80,2),\"\")","v":""},0,0,0,0,0,0,{"$f":"IF(#REF!>0,#REF!,0)","v":{"$error":"#REF!"}},0,0,0,0,0,0,0,""]
["",null,null,""," ",null,null,null,{"$f":"IF(H81>0,INDEX(Poeng!$A$1:$B$100,H81,2),\"\")","v":""},null,{"$f":"IF(J81>0,INDEX(Poeng!$A$1:$B$100,J81,2),\"\")","v":""},null,{"$f":"IF(L81>0,INDEX(Poeng!$A$1:$B$100,L81,2),\"\")","v":""},null,{"$f":"IF(N81>0,INDEX(Poeng!$A$1:$B$100,N81,2),\"\")","v":""},null,{"$f":"IF(P81>0,INDEX(Poeng!$A$1:$B$100,P81,2),\"\")","v":""},0,0,0,0,0,0,{"$f":"IF(#REF!>0,#REF!,0)","v":{"$error":"#REF!"}},0,0,0,0,0,0,0,""]
["",null,null,""," ",null,null,null,{"$f":"IF(H82>0,INDEX(Poeng!$A$1:$B$100,H82,2),\"\")","v":""},null,{"$f":"IF(J82>0,INDEX(Poeng!$A$1:$B$100,J82,2),\"\")","v":""},null,{"$f":"IF(L82>0,INDEX(Poeng!$A$1:$B$100,L82,2),\"\")","v":""},null,{"$f":"IF(N82>0,INDEX(Poeng!$A$1:$B$100,N82,2),\"\")","v":""},null,{"$f":"IF(P82>0,INDEX(Poeng!$A$1:$B$100,P82,2),\"\")","v":""},0,0,0,0,0,0,{"$f":"IF(#REF!>0,#REF!,0)","v":{"$error":"#REF!"}},0,0,0,0,0,0,0,""]
["",null,null,""," ",null,null,null,{"$f":"IF(H83>0,INDEX(Poeng!$A$1:$B$100,H83,2),\"\")","v":""},null,{"$f":"IF(J83>0,INDEX(Poeng!$A$1:$B$100,J83,2),\"\")","v":""},null,{"$f":"IF(L83>0,INDEX(Poeng!$A$1:$B$100,L83,2),\"\")","v":""},null,{"$f":"IF(N83>0,INDEX(Poeng!$A$1:$B$100,N83,2),\"\")","v":""},null,{"$f":"IF(P83>0,INDEX(Poeng!$A$1:$B$100,P83,2),\"\")","v":""},0,0,0,0,0,0,{"$f":"IF(#REF!>0,#REF!,0)","v":{"$error":"#REF!"}},0,0,0,0,0,0,0,""]
["",null,null,""," ",null,null,null,{"$f":"IF(H84>0,INDEX(Poeng!$A$1:$B$100,H84,2),\"\")","v":""},null,{"$f":"IF(J84>0,INDEX(Poeng!$A$1:$B$100,J84,2),\"\")","v":""},null,{"$f":"IF(L84>0,INDEX(Poeng!$A$1:$B$100,L84,2),\"\")","v":""},null,{"$f":"IF(N84>0,INDEX(Poeng!$A$1:$B$100,N84,2),\"\")","v":""},null,{"$f":"IF(P84>0,INDEX(Poeng!$A$1:$B$100,P84,2),\"\")","v":""},0,0,0,0,0,0,{"$f":"IF(#REF!>0,#REF!,0)","v":{"$error":"#REF!"}},0,0,0,0,0,0,0,""]
["",null,null,""," ",null,null,null,{"$f":"IF(H85>0,INDEX(Poeng!$A$1:$B$100,H85,2),\"\")","v":""},null,{"$f":"IF(J85>0,INDEX(Poeng!$A$1:$B$100,J85,2),\"\")","v":""},null,{"$f":"IF(L85>0,INDEX(Poeng!$A$1:$B$100,L85,2),\"\")","v":""},null,{"$f":"IF(N85>0,INDEX(Poeng!$A$1:$B$100,N85,2),\"\")","v":""},null,{"$f":"IF(P85>0,INDEX(Poeng!$A$1:$B$100,P85,2),\"\")","v":""},0,0,0,0,0,0,{"$f":"IF(#REF!>0,#REF!,0)","v":{"$error":"#REF!"}},0,0,0,0,0,0,0,""]
["",null,null,""," ",null,null,null,{"$f":"IF(H86>0,INDEX(Poeng!$A$1:$B$100,H86,2),\"\")","v":""},null,{"$f":"IF(J86>0,INDEX(Poeng!$A$1:$B$100,J86,2),\"\")","v":""},null,{"$f":"IF(L86>0,INDEX(Poeng!$A$1:$B$100,L86,2),\"\")","v":""},null,{"$f":"IF(N86>0,INDEX(Poeng!$A$1:$B$100,N86,2),\"\")","v":""},null,{"$f":"IF(P86>0,INDEX(Poeng!$A$1:$B$100,P86,2),\"\")","v":""},0,0,0,0,0,0,{"$f":"IF(#REF!>0,#REF!,0)","v":{"$error":"#REF!"}},0,0,0,0,0,0,0,""]
["",null,null,""," ",null,null,null,{"$f":"IF(H87>0,INDEX(Poeng!$A$1:$B$100,H87,2),\"\")","v":""},null,{"$f":"IF(J87>0,INDEX(Poeng!$A$1:$B$100,J87,2),\"\")","v":""},null,{"$f":"IF(L87>0,INDEX(Poeng!$A$1:$B$100,L87,2),\"\")","v":""},null,{"$f":"IF(N87>0,INDEX(Poeng!$A$1:$B$100,N87,2),\"\")","v":""},null,{"$f":"IF(P87>0,INDEX(Poeng!$A$1:$B$100,P87,2),\"\")","v":""},0,0,0,0,0,0,{"$f":"IF(#REF!>0,#REF!,0)","v":{"$error":"#REF!"}},0,0,0,0,0,0,0,""]
["",null,null,""," ",null,null,null,{"$f":"IF(H88>0,INDEX(Poeng!$A$1:$B$100,H88,2),\"\")","v":""},null,{"$f":"IF(J88>0,INDEX(Poeng!$A$1:$B$100,J88,2),\"\")","v":""},null,{"$f":"IF(L88>0,INDEX(Poeng!$A$1:$B$100,L88,2),\"\")","v":""},null,{"$f":"IF(N88>0,INDEX(Poeng!$A$1:$B$100,N88,2),\"\")","v":""},null,{"$f":"IF(P88>0,INDEX(Poeng!$A$1:$B$100,P88,2),\"\")","v":""},0,0,0,0,0,0,{"$f":"IF(#REF!>0,#REF!,0)","v":{"$error":"#REF!"}},0,0,0,0,0,0,0,""]
["",null,null,""," ",null,null,null,{"$f":"IF(H89>0,INDEX(Poeng!$A$1:$B$100,H89,2),\"\")","v":""},null,{"$f":"IF(J89>0,INDEX(Poeng!$A$1:$B$100,J89,2),\"\")","v":""},null,{"$f":"IF(L89>0,INDEX(Poeng!$A$1:$B$100,L89,2),\"\")","v":""},null,{"$f":"IF(N89>0,INDEX(Poeng!$A$1:$B$100,N89,2),\"\")","v":""},null,{"$f":"IF(P89>0,INDEX(Poeng!$A$1:$B$100,P89,2),\"\")","v":""},0,0,0,0,0,0,{"$f":"IF(#REF!>0,#REF!,0)","v":{"$error":"#REF!"}},0,0,0,0,0,0,0,""]
["",null,null,""," ",null,null,null,{"$f":"IF(H90>0,INDEX(Poeng!$A$1:$B$100,H90,2),\"\")","v":""},null,{"$f":"IF(J90>0,INDEX(Poeng!$A$1:$B$100,J90,2),\"\")","v":""},null,{"$f":"IF(L90>0,INDEX(Poeng!$A$1:$B$100,L90,2),\"\")","v":""},null,{"$f":"IF(N90>0,INDEX(Poeng!$A$1:$B$100,N90,2),\"\")","v":""},null,{"$f":"IF(P90>0,INDEX(Poeng!$A$1:$B$100,P90,2),\"\")","v":""},0,0,0,0,0,0,{"$f":"IF(#REF!>0,#REF!,0)","v":{"$error":"#REF!"}},0,0,0,0,0,0,0,""]
["",null,null,""," ",null,null,null,{"$f":"IF(H91>0,INDEX(Poeng!$A$1:$B$100,H91,2),\"\")","v":""},null,{"$f":"IF(J91>0,INDEX(Poeng!$A$1:$B$100,J91,2),\"\")","v":""},null,{"$f":"IF(L91>0,INDEX(Poeng!$A$1:$B$100,L91,2),\"\")","v":""},null,{"$f":"IF(N91>0,INDEX(Poeng!$A$1:$B$100,N91,2),\"\")","v":""},null,{"$f":"IF(P91>0,INDEX(Poeng!$A$1:$B$100,P91,2),\"\")","v":""},0,0,0,0,0,0,{"$f":"IF(#REF!>0,#REF!,0)","v":{"$error":"#REF!"}},0,0,0,0,0,0,0,""]
["",null,null,"",{"$f":"IF(AD92<4,\" \",\"F\")","v":" "},null,null,null,{"$f":"IF(H92>0,INDEX(Poeng!$A$1:$B$100,H92,2),\"\")","v":""},null,{"$f":"IF(J92>0,INDEX(Poeng!$A$1:$B$100,J92,2),\"\")","v":""},null,{"$f":"IF(L92>0,INDEX(Poeng!$A$1:$B$100,L92,2),\"\")","v":""},null,{"$f":"IF(N92>0,INDEX(Poeng!$A$1:$B$100,N92,2),\"\")","v":""},null,{"$f":"IF(P92>0,INDEX(Poeng!$A$1:$B$100,P92,2),\"\")","v":""},0,0,0,0,0,0,{"$f":"IF(#REF!>0,#REF!,0)","v":{"$error":"#REF!"}},0,0,0,0,0,0,0,""]
["",null,null,"",{"$f":"IF(AD93<4,\" \",\"F\")","v":" "},null,null,null,{"$f":"IF(H93>0,INDEX(Poeng!$A$1:$B$100,H93,2),\"\")","v":""},null,{"$f":"IF(J93>0,INDEX(Poeng!$A$1:$B$100,J93,2),\"\")","v":""},null,{"$f":"IF(L93>0,INDEX(Poeng!$A$1:$B$100,L93,2),\"\")","v":""},null,{"$f":"IF(N93>0,INDEX(Poeng!$A$1:$B$100,N93,2),\"\")","v":""},null,{"$f":"IF(P93>0,INDEX(Poeng!$A$1:$B$100,P93,2),\"\")","v":""},0,0,0,0,0,0,{"$f":"IF(#REF!>0,#REF!,0)","v":{"$error":"#REF!"}},0,0,0,0,0,0,0,""]
["",null,null,"",{"$f":"IF(AD94<4,\" \",\"F\")","v":" "},null,null,null,{"$f":"IF(H94>0,INDEX(Poeng!$A$1:$B$100,H94,2),\"\")","v":""},null,{"$f":"IF(J94>0,INDEX(Poeng!$A$1:$B$100,J94,2),\"\")","v":""},null,{"$f":"IF(L94>0,INDEX(Poeng!$A$1:$B$100,L94,2),\"\")","v":""},null,{"$f":"IF(N94>0,INDEX(Poeng!$A$1:$B$100,N94,2),\"\")","v":""},null,{"$f":"IF(P94>0,INDEX(Poeng!$A$1:$B$100,P94,2),\"\")","v":""},0,0,0,0,0,0,{"$f":"IF(#REF!>0,#REF!,0)","v":{"$error":"#REF!"}},0,0,0,0,0,0,0,""]
["",null,null,"",{"$f":"IF(AD95<4,\" \",\"F\")","v":" "},null,null,null,{"$f":"IF(H95>0,INDEX(Poeng!$A$1:$B$100,H95,2),\"\")","v":""},null,{"$f":"IF(J95>0,INDEX(Poeng!$A$1:$B$100,J95,2),\"\")","v":""},null,{"$f":"IF(L95>0,INDEX(Poeng!$A$1:$B$100,L95,2),\"\")","v":""},null,{"$f":"IF(N95>0,INDEX(Poeng!$A$1:$B$100,N95,2),\"\")","v":""},null,{"$f":"IF(P95>0,INDEX(Poeng!$A$1:$B$100,P95,2),\"\")","v":""},0,0,0,0,0,0,{"$f":"IF(#REF!>0,#REF!,0)","v":{"$error":"#REF!"}},0,0,0,0,0,0,0,""]
["",null,null,"",{"$f":"IF(AD96<4,\" \",\"F\")","v":" "},null,null,null,{"$f":"IF(H96>0,INDEX(Poeng!$A$1:$B$100,H96,2),\"\")","v":""},null,{"$f":"IF(J96>0,INDEX(Poeng!$A$1:$B$100,J96,2),\"\")","v":""},null,{"$f":"IF(L96>0,INDEX(Poeng!$A$1:$B$100,L96,2),\"\")","v":""},null,{"$f":"IF(N96>0,INDEX(Poeng!$A$1:$B$100,N96,2),\"\")","v":""},null,{"$f":"IF(P96>0,INDEX(Poeng!$A$1:$B$100,P96,2),\"\")","v":""},0,0,0,0,0,0,{"$f":"IF(#REF!>0,#REF!,0)","v":{"$error":"#REF!"}},0,0,0,0,0,0,0,""]

{"sheet":"J16","index":3,"n_rows":94,"n_cols":32,"rows_kept":94,"cut":false,"hidden":false,"merged":[[0,2,0,16],[1,5,1,6],[1,7,1,8],[1,9,1,10],[1,11,1,12],[1,13,1,14],[1,15,1,16],[2,15,2,16],[2,5,2,6],[2,7,2,8],[2,9,2,10],[2,11,2,12],[2,13,2,14]]}
["Jenter 16",null,"  Sparebank1-CUP 2021"]
[null,null,null,null,null,"SP1- CUP 1 ",null,"SP1- CUP 2 ",null,"SP1- CUP 3",null,"SP1- CUP 4",null,"SP1- CUP 5",null,"SP1- CUP 6",null,"Poeng",null,null,null,null,null,null,"Fire beste",null,null,null,"Sum"]
["Nr","NAVN","KLUBB","POENG","Fullført","Nr.  Poeng ",null,"Nr.  Poeng ",null,"Nr.   Poeng ",null,"Nr.  Poeng ",null,"Nr.  Poeng ",null,"Nr. Poeng ",null,1,2,3,4,5,6,7,1,2,3,4]
[{"$f":"AF4","v":1},"Petronella Haram","Strindheim IL ",{"$f":"IF(B4<>\"\",AC4,\"\")","v":400},{"$f":"IF(AD4<4,\" \",\"F\")","v":"F"},1,{"$f":"IF(F4>0,INDEX(Poeng!$A$1:$B$100,F4,2),\"\")","v":100},1,{"$f":"IF(H4>0,INDEX(Poeng!$A$1:$B$100,H4,2),\"\")","v":100},2,{"$f":"IF(J4>0,INDEX(Poeng!$A$1:$B$100,J4,2),\"\")","v":80},1,{"$f":"IF(L4>0,INDEX(Poeng!$A$1:$B$100,L4,2),\"\")","v":100},1,{"$f":"IF(N4>0,INDEX(Poeng!$A$1:$B$100,N4,2),\"\")","v":100},1,{"$f":"IF(P4>0,INDEX(Poeng!$A$1:$B$100,P4,2),\"\")","v":100},{"$f":"IF(F4>0,G4,0)","v":100},{"$f":"IF(H4>0,I4,0)","v":100},{"$f":"IF(J4>0,K4,0)","v":80},{"$f":"IF(L4>0,M4,0)","v":100},{"$f":"IF(N4>0,O4,0)","v":100},{"$f":"IF(P4>0,Q4,0)","v":100},{"$f":"IF(#REF!>0,#REF!,0)","v":{"$error":"#REF!"}},{"$f":"LARGE(R4:W4,1)","v":100},{"$f":"LARGE(R4:W4,2)","v":100},{"$f":"LARGE(R4:W4,3)","v":100},{"$f":"LARGE(R4:W4,4)","v":100},{"$f":"SUM(Y4:AB4)","v":400},{"$f":"COUNT(F4:Q4)/2","v":6},{"$f":"AC4*10^8+Y4*10^6/2+Z4*10^4/2+AA4*10^2/2+AB4/2","v":40050505050},{"$f":"IF(B4<>\"\",RANK(AE4,AE$4:AE$70,0),\"\")","v":1}]
[2,"Emma Kalvøy Bye","Byåsen IL",300,"F",3,{"$f":"IF(F5>0,INDEX(Poeng!$A$1:$B$100,F5,2),\"\")","v":60},11,{"$f":"IF(H5>0,INDEX(Poeng!$A$1:$B$100,H5,2),\"\")","v":24},1,{"$f":"IF(J5>0,INDEX(Poeng!$A$1:$B$100,J5,2),\"\")","v":100},2,{"$f":"IF(L5>0,INDEX(Poeng!$A$1:$B$100,L5,2),\"\")","v":80},4,{"$f":"IF(N5>0,INDEX(Poeng!$A$1:$B$100,N5,2),\"\")","v":50},3,{"$f":"IF(P5>0,INDEX(Poeng!$A$1:$B$100,P5,2),\"\")","v":60},60,24,100,80,50,60,{"$f":"IF(#REF!>0,#REF!,0)","v":{"$error":"#REF!"}},100,80,60,60,300,6,30050403030,2]
[3,"Una Arnesen Kittelsen","Byaasen Skiklub",260,"F",null,{"$f":"IF(F6>0,INDEX(Poeng!$A$1:$B$100,F6,2),\"\")","v":""},3,{"$f":"IF(H6>0,INDEX(Poeng!$A$1:$B$100,H6,2),\"\")","v":60},3,{"$f":"IF(J6>0,INDEX(Poeng!$A$1:$B$100,J6,2),\"\")","v":60},3,{"$f":"IF(L6>0,INDEX(Poeng!$A$1:$B$100,L6,2),\"\")","v":60},3,{"$f":"IF(N6>0,INDEX(Poeng!$A$1:$B$100,N6,2),\"\")","v":60},2,{"$f":"IF(P6>0,INDEX(Poeng!$A$1:$B$100,P6,2),\"\")","v":80},0,60,60,60,60,80,{"$f":"IF(#REF!>0,#REF!,0)","v":{"$error":"#REF!"}},80,60,60,60,260,5,26040303030,3]
[4,"Kristine Aune Aakerli","Heimdal Ski",255,"F",2,{"$f":"IF(F7>0,INDEX(Poeng!$A$1:$B$100,F7,2),\"\")","v":80},2,{"$f":"IF(H7>0,INDEX(Poeng!$A$1:$B$100,H7,2),\"\")","v":80},12,{"$f":"IF(J7>0,INDEX(Poeng!$A$1:$B$100,J7,2),\"\")","v":22},8,{"$f":"IF(L7>0,INDEX(Poeng!$A$1:$B$100,L7,2),\"\")","v":32},5,{"$f":"IF(N7>0,INDEX(Poeng!$A$1:$B$100,N7,2),\"\")","v":45},4,{"$f":"IF(P7>0,INDEX(Poeng!$A$1:$B$100,P7,2),\"\")","v":50},80,80,22,32,45,50,{"$f":"IF(#REF!>0,#REF!,0)","v":{"$error":"#REF!"}},80,80,50,45,255,6,25540402522.5,4]
[5,"Madelen Løvoll Vikan","Byåsen IL",196,"F",10,{"$f":"IF(F8>0,INDEX(Poeng!$A$1:$B$100,F8,2),\"\")","v":26},null,{"$f":"IF(H8>0,INDEX(Poeng!$A$1:$B$100,H8,2),\"\")","v":""},null,{"$f":"IF(J8>0,INDEX(Poeng!$A$1:$B$100,J8,2),\"\")","v":""},4,{"$f":"IF(L8>0,INDEX(Poeng!$A$1:$B$100,L8,2),\"\")","v":50},2,{"$f":"IF(N8>0,INDEX(Poeng!$A$1:$B$100,N8,2),\"\")","v":80},6,{"$f":"IF(P8>0,INDEX(Poeng!$A$1:$B$100,P8,2),\"\")","v":40},26,0,0,50,80,40,{"$f":"IF(#REF!>0,#REF!,0)","v":{"$error":"#REF!"}},80,50,40,26,196,4,19640252013,5]
[6,"Embla Aksnes","Hommelvik IL",175,"F",7,{"$f":"IF(F9>0,INDEX(Poeng!$A$1:$B$100,F9,2),\"\")","v":36},6,{"$f":"IF(H9>0,INDEX(Poeng!$A$1:$B$100,H9,2),\"\")","v":40},4,{"$f":"IF(J9>0,INDEX(Poeng!$A$1:$B$100,J9,2),\"\")","v":50},6,{"$f":"IF(L9>0,INDEX(Poeng!$A$1:$B$100,L9,2),\"\")","v":40},null,{"$f":"IF(N9>0,INDEX(Poeng!$A$1:$B$100,N9,2),\"\")","v":""},5,{"$f":"IF(P9>0,INDEX(Poeng!$A$1:$B$100,P9,2),\"\")","v":45},36,40,50,40,0,45,{"$f":"IF(#REF!>0,#REF!,0)","v":{"$error":"#REF!"}},50,45,40,40,175,5,17525227020,6]
[7,"Oda Sæter","Byåsen IL",149,"F",9,{"$f":"IF(F10>0,INDEX(Poeng!$A$1:$B$100,F10,2),\"\")","v":29},7,{"$f":"IF(H10>0,INDEX(Poeng!$A$1:$B$100,H10,2),\"\")","v":36},5,{"$f":"IF(J10>0,INDEX(Poeng!$A$1:$B$100,J10,2),\"\")","v":45},11,{"$f":"IF(L10>0,INDEX(Poeng!$A$1:$B$100,L10,2),\"\")","v":24},7,{"$f":"IF(N10>0,INDEX(Poeng!$A$1:$B$100,N10,2),\"\")","v":36},8,{"$f":"IF(P10>0,INDEX(Poeng!$A$1:$B$100,P10,2),\"\")","v":32},29,36,45,24,36,32,{"$f":"IF(#REF!>0,#REF!,0)","v":{"$error":"#REF!"}},45,36,36,32,149,6,14922681816,7]
[8,"Helene Gross-Benberg","Byåsen IL",140," ",4,{"$f":"IF(F11>0,INDEX(Poeng!$A$1:$B$100,F11,2),\"\")","v":50},5,{"$f":"IF(H11>0,INDEX(Poeng!$A$1:$B$100,H11,2),\"\")","v":45},null,{"$f":"IF(J11>0,INDEX(Poeng!$A$1:$B$100,J11,2),\"\")","v":""},5,{"$f":"IF(L11>0,INDEX(Poeng!$A$1:$B$100,L11,2),\"\")","v":45},null,{"$f":"IF(N11>0,INDEX(Poeng!$A$1:$B$100,N11,2),\"\")","v":""},null,{"$f":"IF(P11>0,INDEX(Poeng!$A$1:$B$100,P11,2),\"\")","v":""},50,45,0,45,0,0,{"$f":"IF(#REF!>0,#REF!,0)","v":{"$error":"#REF!"}},50,45,45,0,140,3,14025227250,8]
[9,"Alexandra Gaddass Sand","Strindheim IL ",138,"F",11,{"$f":"IF(F12>0,INDEX(Poeng!$A$1:$B$100,F12,2),\"\")","v":24},9,{"$f":"IF(H12>0,INDEX(Poeng!$A$1:$B$100,H12,2),\"\")","v":29},6,{"$f":"IF(J12>0,INDEX(Poeng!$A$1:$B$100,J12,2),\"\")","v":40},10,{"$f":"IF(L12>0,INDEX(Poeng!$A$1:$B$100,L12,2),\"\")","v":26},6,{"$f":"IF(N12>0,INDEX(Poeng!$A$1:$B$100,N12,2),\"\")","v":40},9,{"$f":"IF(P12>0,INDEX(Poeng!$A$1:$B$100,P12,2),\"\")","v":29},24,29,40,26,40,29,{"$f":"IF(#REF!>0,#REF!,0)","v":{"$error":"#REF!"}},40,40,29,29,138,6,13820201464.5,9]
[10,"Maria Strømdal Wik","Byaasen Skiklub",126," ",null,{"$f":"IF(F13>0,INDEX(Poeng!$A$1:$B$100,F13,2),\"\")","v":""},4,{"$f":"IF(H13>0,INDEX(Poeng!$A$1:$B$100,H13,2),\"\")","v":50},null,{"$f":"IF(J13>0,INDEX(Poeng!$A$1:$B$100,J13,2),\"\")","v":""},6,{"$f":"IF(L13>0,INDEX(Poeng!$A$1:$B$100,L13,2),\"\")","v":40},null,{"$f":"IF(N13>0,INDEX(Poeng!$A$1:$B$100,N13,2),\"\")","v":""},7,{"$f":"IF(P13>0,INDEX(Poeng!$A$1:$B$100,P13,2),\"\")","v":36},0,50,0,40,0,36,{"$f":"IF(#REF!>0,#REF!,0)","v":{"$error":"#REF!"}},50,40,36,0,126,3,12625201800,10]
[11,"Lina Storler Snøfugl","Byaasen Skiklub",120,"F",8,{"$f":"IF(F14>0,INDEX(Poeng!$A$1:$B$100,F14,2),\"\")","v":32},10,{"$f":"IF(H14>0,INDEX(Poeng!$A$1:$B$100,H14,2),\"\")","v":26},7,{"$f":"IF(J14>0,INDEX(Poeng!$A$1:$B$100,J14,2),\"\")","v":36},null,{"$f":"IF(L14>0,INDEX(Poeng!$A$1:$B$100,L14,2),\"\")","v":""},null,{"$f":"IF(N14>0,INDEX(Poeng!$A$1:$B$100,N14,2),\"\")","v":""},10,{"$f":"IF(P14>0,INDEX(Poeng!$A$1:$B$100,P14,2),\"\")","v":26},32,26,36,0,0,26,{"$f":"IF(#REF!>0,#REF!,0)","v":{"$error":"#REF!"}},36,32,26,26,120,4,12018161313,11]
[12,"Sigrid Haugskott","Buvik IL",117,"F",null,{"$f":"IF(F15>0,INDEX(Poeng!$A$1:$B$100,F15,2),\"\")","v":""},8,{"$f":"IF(H15>0,INDEX(Poeng!$A$1:$B$100,H15,2),\"\")","v":32},8,{"$f":"IF(J15>0,INDEX(Poeng!$A$1:$B$100,J15,2),\"\")","v":32},9,{"$f":"IF(L15>0,INDEX(Poeng!$A$1:$B$100,L15,2),\"\")","v":29},null,{"$f":"IF(N15>0,INDEX(Poeng!$A$1:$B$100,N15,2),\"\")","v":""},11,{"$f":"IF(P15>0,INDEX(Poeng!$A$1:$B$100,P15,2),\"\")","v":24},0,32,32,29,0,24,{"$f":"IF(#REF!>0,#REF!,0)","v":{"$error":"#REF!"}},32,32,29,24,117,4,11716161462,12]
[13,"Maja Kyllo","Hommelvik IL",102,"F",12,{"$f":"IF(F16>0,INDEX(Poeng!$A$1:$B$100,F16,2),\"\")","v":22},null,{"$f":"IF(H16>0,INDEX(Poeng!$A$1:$B$100,H16,2),\"\")","v":""},10,{"$f":"IF(J16>0,INDEX(Poeng!$A$1:$B$100,J16,2),\"\")","v":26},null,{"$f":"IF(L16>0,INDEX(Poeng!$A$1:$B$100,L16,2),\"\")","v":""},8,{"$f":"IF(N16>0,INDEX(Poeng!$A$1:$B$100,N16,2),\"\")","v":32},12,{"$f":"IF(P16>0,INDEX(Poeng!$A$1:$B$100,P16,2),\"\")","v":22},22,0,26,0,32,22,{"$f":"IF(#REF!>0,#REF!,0)","v":{"$error":"#REF!"}},32,26,22,22,102,4,10216131111,13]
[14,"Iris Waagan Øksnes","Hommelvik IL",95,"F",null,{"$f":"IF(F17>0,INDEX(Poeng!$A$1:$B$100,F17,2),\"\")","v":""},12,{"$f":"IF(H17>0,INDEX(Poeng!$A$1:$B$100,H17,2),\"\")","v":22},11,{"$f":"IF(J17>0,INDEX(Poeng!$A$1:$B$100,J17,2),\"\")","v":24},13,{"$f":"IF(L17>0,INDEX(Poeng!$A$1:$B$100,L17,2),\"\")","v":20},9,{"$f":"IF(N17>0,INDEX(Poeng!$A$1:$B$100,N17,2),\"\")","v":29},15,{"$f":"IF(P17>0,INDEX(Poeng!$A$1:$B$100,P17,2),\"\")","v":16},0,22,24,20,29,16,{"$f":"IF(#REF!>0,#REF!,0)","v":{"$error":"#REF!"}},29,24,22,20,95,5,9514621110,14]
[15,"Oda Elise Berg","Leksvik IL",81," ",5,{"$f":"IF(F18>0,INDEX(Poeng!$A$1:$B$100,F18,2),\"\")","v":45},null,{"$f":"IF(H18>0,INDEX(Poeng!$A$1:$B$100,H18,2),\"\")","v":""},null,{"$f":"IF(J18>0,INDEX(Poeng!$A$1:$B$100,J18,2),\"\")","v":""},7,{"$f":"IF(L18>0,INDEX(Poeng!$A$1:$B$100,L18,2),\"\")","v":36},null,{"$f":"IF(N18>0,INDEX(Poeng!$A$1:$B$100,N18,2),\"\")","v":""},null,{"$f":"IF(P18>0,INDEX(Poeng!$A$1:$B$100,P18,2),\"\")","v":""},45,0,0,36,0,0,{"$f":"IF(#REF!>0,#REF!,0)","v":{"$error":"#REF!"}},45,36,0,0,81,2,8122680000,15]
[16,"Ine Løseth","Buvik IL",69," ",null,{"$f":"IF(F19>0,INDEX(Poeng!$A$1:$B$100,F19,2),\"\")","v":""},null,{"$f":"IF(H19>0,INDEX(Poeng!$A$1:$B$100,H19,2),\"\")","v":""},9,{"$f":"IF(J19>0,INDEX(Poeng!$A$1:$B$100,J19,2),\"\")","v":29},12,{"$f":"IF(L19>0,INDEX(Poeng!$A$1:$B$100,L19,2),\"\")","v":22},null,{"$f":"IF(N19>0,INDEX(Poeng!$A$1:$B$100,N19,2),\"\")","v":""},14,{"$f":"IF(P19>0,INDEX(Poeng!$A$1:$B$100,P19,2),\"\")","v":18},{"$f":"IF(F19>0,G19,0)","v":0},{"$f":"IF(H19>0,I19,0)","v":0},{"$f":"IF(J19>0,K19,0)","v":29},{"$f":"IF(L19>0,M19,0)","v":22},{"$f":"IF(N19>0,O19,0)","v":0},{"$f":"IF(P19>0,Q19,0)","v":18},{"$f":"IF(#REF!>0,#REF!,0)","v":{"$error":"#REF!"}},{"$f":"LARGE(R19:W19,1)","v":29},{"$f":"LARGE(R19:W19,2)","v":22},{"$f":"LARGE(R19:W19,3)","v":18},{"$f":"LARGE(R19:W19,4)","v":0},{"$f":"SUM(Y19:AB19)","v":69},{"$f":"COUNT(F19:Q19)/2","v":3},{"$f":"AC19*10^8+Y19*10^6/2+Z19*10^4/2+AA19*10^2/2+AB19/2","v":6914610900},16]
[17,"Dina Berg Solli","Selbu IL",46," ",null,null,null,{"$f":"IF(H20>0,INDEX(Poeng!$A$1:$B$100,H20,2),\"\")","v":""},null,{"$f":"IF(J20>0,INDEX(Poeng!$A$1:$B$100,J20,2),\"\")","v":""},null,{"$f":"IF(L20>0,INDEX(Poeng!$A$1:$B$100,L20,2),\"\")","v":""},10,{"$f":"IF(N20>0,INDEX(Poeng!$A$1:$B$100,N20,2),\"\")","v":26},13,{"$f":"IF(P20>0,INDEX(Poeng!$A$1:$B$100,P20,2),\"\")","v":20},0,0,0,0,26,20,{"$f":"IF(#REF!>0,#REF!,0)","v":{"$error":"#REF!"}},26,20,0,0,46,2,4613100000,17]
[18,"Lisa Sagen","Byåsen IL",40," ",6,{"$f":"IF(F21>0,INDEX(Poeng!$A$1:$B$100,F21,2),\"\")","v":40},null,{"$f":"IF(H21>0,INDEX(Poeng!$A$1:$B$100,H21,2),\"\")","v":""},null,{"$f":"IF(J21>0,INDEX(Poeng!$A$1:$B$100,J21,2),\"\")","v":""},null,{"$f":"IF(L21>0,INDEX(Poeng!$A$1:$B$100,L21,2),\"\")","v":""},null,{"$f":"IF(N21>0,INDEX(Poeng!$A$1:$B$100,N21,2),\"\")","v":""},null,{"$f":"IF(P21>0,INDEX(Poeng!$A$1:$B$100,P21,2),\"\")","v":""},{"$f":"IF(F21>0,G21,0)","v":40},{"$f":"IF(H21>0,I21,0)","v":0},{"$f":"IF(J21>0,K21,0)","v":0},{"$f":"IF(L21>0,M21,0)","v":0},{"$f":"IF(N21>0,O21,0)","v":0},{"$f":"IF(P21>0,Q21,0)","v":0},{"$f":"IF(#REF!>0,#REF!,0)","v":{"$error":"#REF!"}},{"$f":"LARGE(R21:W21,1)","v":40},{"$f":"LARGE(R21:W21,2)","v":0},{"$f":"LARGE(R21:W21,3)","v":0},{"$f":"LARGE(R21:W21,4)","v":0},{"$f":"SUM(Y21:AB21)","v":40},{"$f":"COUNT(F21:Q21)/2","v":1},{"$f":"AC21*10^8+Y21*10^6/2+Z21*10^4/2+AA21*10^2/2+AB21/2","v":4020000000},{"$f":"IF(B21<>\"\",RANK(AE21,AE$4:AE$70,0),\"\")","v":18}]
[{"$f":"AF22","v":""},null,null,{"$f":"IF(B22<>\"\",AC22,\"\")","v":""},{"$f":"IF(AD22<4,\" \",\"F\")","v":" "},null,{"$f":"IF(F22>0,INDEX(Poeng!$A$1:$B$100,F22,2),\"\")","v":""},null,{"$f":"IF(H22>0,INDEX(Poeng!$A$1:$B$100,H22,2),\"\")","v":""},null,{"$f":"IF(J22>0,INDEX(Poeng!$A$1:$B$100,J22,2),\"\")","v":""},null,{"$f":"IF(L22>0,INDEX(Poeng!$A$1:$B$100,L22,2),\"\")","v":""},null,{"$f":"IF(N22>0,INDEX(Poeng!$A$1:$B$100,N22,2),\"\")","v":""},null,{"$f":"IF(P22>0,INDEX(Poeng!$A$1:$B$100,P22,2),\"\")","v":""},0,0,0,0,0,0,{"$f":"IF(#REF!>0,#REF!,0)","v":{"$error":"#REF!"}},0,0,0,0,0,0,0,""]
["",null,null,""," ",null,{"$f":"IF(F23>0,INDEX(Poeng!$A$1:$B$100,F23,2),\"\")","v":""},null,{"$f":"IF(H23>0,INDEX(Poeng!$A$1:$B$100,H23,2),\"\")","v":""},null,{"$f":"IF(J23>0,INDEX(Poeng!$A$1:$B$100,J23,2),\"\")","v":""},null,{"$f":"IF(L23>0,INDEX(Poeng!$A$1:$B$100,L23,2),\"\")","v":""},null,{"$f":"IF(N23>0,INDEX(Poeng!$A$1:$B$100,N23,2),\"\")","v":""},null,{"$f":"IF(P23>0,INDEX(Poeng!$A$1:$B$100,P23,2),\"\")","v":""},0,0,0,0,0,0,{"$f":"IF(#REF!>0,#REF!,0)","v":{"$error":"#REF!"}},0,0,0,0,0,0,0,""]
["",null,null,""," ",null,{"$f":"IF(F24>0,INDEX(Poeng!$A$1:$B$100,F24,2),\"\")","v":""},null,{"$f":"IF(H24>0,INDEX(Poeng!$A$1:$B$100,H24,2),\"\")","v":""},null,{"$f":"IF(J24>0,INDEX(Poeng!$A$1:$B$100,J24,2),\"\")","v":""},null,{"$f":"IF(L24>0,INDEX(Poeng!$A$1:$B$100,L24,2),\"\")","v":""},null,{"$f":"IF(N24>0,INDEX(Poeng!$A$1:$B$100,N24,2),\"\")","v":""},null,{"$f":"IF(P24>0,INDEX(Poeng!$A$1:$B$100,P24,2),\"\")","v":""},0,0,0,0,0,0,{"$f":"IF(#REF!>0,#REF!,0)","v":{"$error":"#REF!"}},0,0,0,0,0,0,0,""]
["",null,null,""," ",null,{"$f":"IF(F25>0,INDEX(Poeng!$A$1:$B$100,F25,2),\"\")","v":""},null,{"$f":"IF(H25>0,INDEX(Poeng!$A$1:$B$100,H25,2),\"\")","v":""},null,{"$f":"IF(J25>0,INDEX(Poeng!$A$1:$B$100,J25,2),\"\")","v":""},null,{"$f":"IF(L25>0,INDEX(Poeng!$A$1:$B$100,L25,2),\"\")","v":""},null,{"$f":"IF(N25>0,INDEX(Poeng!$A$1:$B$100,N25,2),\"\")","v":""},null,{"$f":"IF(P25>0,INDEX(Poeng!$A$1:$B$100,P25,2),\"\")","v":""},0,0,0,0,0,0,{"$f":"IF(#REF!>0,#REF!,0)","v":{"$error":"#REF!"}},0,0,0,0,0,0,0,""]
["",null,null,"",null,null,null,null,null,null,null,null,null,null,{"$f":"IF(N26>0,INDEX(Poeng!$A$1:$B$100,N26,2),\"\")","v":""},null,{"$f":"IF(P26>0,INDEX(Poeng!$A$1:$B$100,P26,2),\"\")","v":""},0,0,0,0,0,0,{"$f":"IF(#REF!>0,#REF!,0)","v":{"$error":"#REF!"}},0,0,0,0,0,0,0,""]
["",null,null,"",{"$f":"IF(AD27<4,\" \",\"F\")","v":" "},null,{"$f":"IF(F27>0,INDEX(Poeng!$A$1:$B$100,F27,2),\"\")","v":""},null,{"$f":"IF(H27>0,INDEX(Poeng!$A$1:$B$100,H27,2),\"\")","v":""},null,{"$f":"IF(J27>0,INDEX(Poeng!$A$1:$B$100,J27,2),\"\")","v":""},null,{"$f":"IF(L27>0,INDEX(Poeng!$A$1:$B$100,L27,2),\"\")","v":""},null,{"$f":"IF(N27>0,INDEX(Poeng!$A$1:$B$100,N27,2),\"\")","v":""},null,{"$f":"IF(P27>0,INDEX(Poeng!$A$1:$B$100,P27,2),\"\")","v":""},0,0,0,0,0,0,{"$f":"IF(#REF!>0,#REF!,0)","v":{"$error":"#REF!"}},0,0,0,0,0,0,0,""]
["",null,null,""," ",null,{"$f":"IF(F28>0,INDEX(Poeng!$A$1:$B$100,F28,2),\"\")","v":""},null,{"$f":"IF(H28>0,INDEX(Poeng!$A$1:$B$100,H28,2),\"\")","v":""},null,{"$f":"IF(J28>0,INDEX(Poeng!$A$1:$B$100,J28,2),\"\")","v":""},null,{"$f":"IF(L28>0,INDEX(Poeng!$A$1:$B$100,L28,2),\"\")","v":""},null,{"$f":"IF(N28>0,INDEX(Poeng!$A$1:$B$100,N28,2),\"\")","v":""},null,{"$f":"IF(P28>0,INDEX(Poeng!$A$1:$B$100,P28,2),\"\")","v":""},0,0,0,0,0,0,{"$f":"IF(#REF!>0,#REF!,0)","v":{"$error":"#REF!"}},0,0,0,0,0,0,0,""]
["",null,null,""," ",null,{"$f":"IF(F29>0,INDEX(Poeng!$A$1:$B$100,F29,2),\"\")","v":""},null,{"$f":"IF(H29>0,INDEX(Poeng!$A$1:$B$100,H29,2),\"\")","v":""},null,{"$f":"IF(J29>0,INDEX(Poeng!$A$1:$B$100,J29,2),\"\")","v":""},null,{"$f":"IF(L29>0,INDEX(Poeng!$A$1:$B$100,L29,2),\"\")","v":""},null,{"$f":"IF(N29>0,INDEX(Poeng!$A$1:$B$100,N29,2),\"\")","v":""},null,null,0,0,0,0,0,0,{"$f":"IF(#REF!>0,#REF!,0)","v":{"$error":"#REF!"}},0,0,0,0,0,0,0,""]
["",null,null,""," ",null,{"$f":"IF(F30>0,INDEX(Poeng!$A$1:$B$100,F30,2),\"\")","v":""},null,{"$f":"IF(H30>0,INDEX(Poeng!$A$1:$B$100,H30,2),\"\")","v":""},null,{"$f":"IF(J30>0,INDEX(Poeng!$A$1:$B$100,J30,2),\"\")","v":""},null,{"$f":"IF(L30>0,INDEX(Poeng!$A$1:$B$100,L30,2),\"\")","v":""},null,{"$f":"IF(N30>0,INDEX(Poeng!$A$1:$B$100,N30,2),\"\")","v":""},null,{"$f":"IF(P30>0,INDEX(Poeng!$A$1:$B$100,P30,2),\"\")","v":""},0,0,0,0,0,0,{"$f":"IF(#REF!>0,#REF!,0)","v":{"$error":"#REF!"}},0,0,0,0,0,0,0,""]
["",null,null,""," ",null,{"$f":"IF(F31>0,INDEX(Poeng!$A$1:$B$100,F31,2),\"\")","v":""},null,{"$f":"IF(H31>0,INDEX(Poeng!$A$1:$B$100,H31,2),\"\")","v":""},null,{"$f":"IF(J31>0,INDEX(Poeng!$A$1:$B$100,J31,2),\"\")","v":""},null,{"$f":"IF(L31>0,INDEX(Poeng!$A$1:$B$100,L31,2),\"\")","v":""},null,{"$f":"IF(N31>0,INDEX(Poeng!$A$1:$B$100,N31,2),\"\")","v":""},null,{"$f":"IF(P31>0,INDEX(Poeng!$A$1:$B$100,P31,2),\"\")","v":""},0,0,0,0,0,0,{"$f":"IF(#REF!>0,#REF!,0)","v":{"$error":"#REF!"}},0,0,0,0,0,0,0,""]
["",null,null,""," ",null,{"$f":"IF(F32>0,INDEX(Poeng!$A$1:$B$100,F32,2),\"\")","v":""},null,{"$f":"IF(H32>0,INDEX(Poeng!$A$1:$B$100,H32,2),\"\")","v":""},null,{"$f":"IF(J32>0,INDEX(Poeng!$A$1:$B$100,J32,2),\"\")","v":""},null,{"$f":"IF(L32>0,INDEX(Poeng!$A$1:$B$100,L32,2),\"\")","v":""},null,{"$f":"IF(N32>0,INDEX(Poeng!$A$1:$B$100,N32,2),\"\")","v":""},null,{"$f":"IF(P32>0,INDEX(Poeng!$A$1:$B$100,P32,2),\"\")","v":""},0,0,0,0,0,0,{"$f":"IF(#REF!>0,#REF!,0)","v":{"$error":"#REF!"}},0,0,0,0,0,0,0,""]
["",null,null,""," ",null,{"$f":"IF(F33>0,INDEX(Poeng!$A$1:$B$100,F33,2),\"\")","v":""},null,{"$f":"IF(H33>0,INDEX(Poeng!$A$1:$B$100,H33,2),\"\")","v":""},null,{"$f":"IF(J33>0,INDEX(Poeng!$A$1:$B$100,J33,2),\"\")","v":""},null,{"$f":"IF(L33>0,INDEX(Poeng!$A$1:$B$100,L33,2),\"\")","v":""},null,{"$f":"IF(N33>0,INDEX(Poeng!$A$1:$B$100,N33,2),\"\")","v":""},null,{"$f":"IF(P33>0,INDEX(Poeng!$A$1:$B$100,P33,2),\"\")","v":""},0,0,0,0,0,0,{"$f":"IF(#REF!>0,#REF!,0)","v":{"$error":"#REF!"}},0,0,0,0,0,0,0,""]
["",null,null,""," ",null,{"$f":"IF(F34>0,INDEX(Poeng!$A$1:$B$100,F34,2),\"\")","v":""},null,{"$f":"IF(H34>0,INDEX(Poeng!$A$1:$B$100,H34,2),\"\")","v":""},null,{"$f":"IF(J34>0,INDEX(Poeng!$A$1:$B$100,J34,2),\"\")","v":""},null,{"$f":"IF(L34>0,INDEX(Poeng!$A$1:$B$100,L34,2),\"\")","v":""},null,{"$f":"IF(N34>0,INDEX(Poeng!$A$1:$B$100,N34,2),\"\")","v":""},null,{"$f":"IF(P34>0,INDEX(Poeng!$A$1:$B$100,P34,2),\"\")","v":""},0,0,0,0,0,0,{"$f":"IF(#REF!>0,#REF!,0)","v":{"$error":"#REF!"}},0,0,0,0,0,0,0,""]
[{"$f":"AF35","v":""},null,null,{"$f":"IF(B35<>\"\",AC35,\"\")","v":""}," ",null,{"$f":"IF(F35>0,INDEX(Poeng!$A$1:$B$100,F35,2),\"\")","v":""},null,{"$f":"IF(H35>0,INDEX(Poeng!$A$1:$B$100,H35,2),\"\")","v":""},null,{"$f":"IF(J35>0,INDEX(Poeng!$A$1:$B$100,J35,2),\"\")","v":""},null,{"$f":"IF(L35>0,INDEX(Poeng!$A$1:$B$100,L35,2),\"\")","v":""},null,{"$f":"IF(N35>0,INDEX(Poeng!$A$1:$B$100,N35,2),\"\")","v":""},null,{"$f":"IF(P35>0,INDEX(Poeng!$A$1:$B$100,P35,2),\"\")","v":""},{"$f":"IF(F35>0,G35,0)","v":0},{"$f":"IF(H35>0,I35,0)","v":0},{"$f":"IF(J35>0,K35,0)","v":0},{"$f":"IF(L35>0,M35,0)","v":0},{"$f":"IF(N35>0,O35,0)","v":0},{"$f":"IF(P35>0,Q35,0)","v":0},{"$f":"IF(#REF!>0,#REF!,0)","v":{"$error":"#REF!"}},{"$f":"LARGE(R35:W35,1)","v":0},{"$f":"LARGE(R35:W35,2)","v":0},{"$f":"LARGE(R35:W35,3)","v":0},{"$f":"LARGE(R35:W35,4)","v":0},{"$f":"SUM(Y35:AB35)","v":0},{"$f":"COUNT(F35:Q35)/2","v":0},{"$f":"AC35*10^8+Y35*10^6/2+Z35*10^4/2+AA35*10^2/2+AB35/2","v":0},""]
["",null,null,""," ",null,{"$f":"IF(F36>0,INDEX(Poeng!$A$1:$B$100,F36,2),\"\")","v":""},null,{"$f":"IF(H36>0,INDEX(Poeng!$A$1:$B$100,H36,2),\"\")","v":""},null,{"$f":"IF(J36>0,INDEX(Poeng!$A$1:$B$100,J36,2),\"\")","v":""},null,{"$f":"IF(L36>0,INDEX(Poeng!$A$1:$B$100,L36,2),\"\")","v":""},null,{"$f":"IF(N36>0,INDEX(Poeng!$A$1:$B$100,N36,2),\"\")","v":""},null,{"$f":"IF(P36>0,INDEX(Poeng!$A$1:$B$100,P36,2),\"\")","v":""},0,0,0,0,0,0,{"$f":"IF(#REF!>0,#REF!,0)","v":{"$error":"#REF!"}},0,0,0,0,0,0,0,{"$f":"IF(B36<>\"\",RANK(AE36,AE$4:AE$70,0),\"\")","v":""}]
["",null,null,""," ",null,{"$f":"IF(F37>0,INDEX(Poeng!$A$1:$B$100,F37,2),\"\")","v":""},null,{"$f":"IF(H37>0,INDEX(Poeng!$A$1:$B$100,H37,2),\"\")","v":""},null,{"$f":"IF(J37>0,INDEX(Poeng!$A$1:$B$100,J37,2),\"\")","v":""},null,{"$f":"IF(L37>0,INDEX(Poeng!$A$1:$B$100,L37,2),\"\")","v":""},null,{"$f":"IF(N37>0,INDEX(Poeng!$A$1:$B$100,N37,2),\"\")","v":""},null,{"$f":"IF(P37>0,INDEX(Poeng!$A$1:$B$100,P37,2),\"\")","v":""},0,0,0,0,0,0,{"$f":"IF(#REF!>0,#REF!,0)","v":{"$error":"#REF!"}},0,0,0,0,0,0,0,""]
["",null,null,""," ",null,{"$f":"IF(F38>0,INDEX(Poeng!$A$1:$B$100,F38,2),\"\")","v":""},null,{"$f":"IF(H38>0,INDEX(Poeng!$A$1:$B$100,H38,2),\"\")","v":""},null,{"$f":"IF(J38>0,INDEX(Poeng!$A$1:$B$100,J38,2),\"\")","v":""},null,{"$f":"IF(L38>0,INDEX(Poeng!$A$1:$B$100,L38,2),\"\")","v":""},null,{"$f":"IF(N38>0,INDEX(Poeng!$A$1:$B$100,N38,2),\"\")","v":""},null,{"$f":"IF(P38>0,INDEX(Poeng!$A$1:$B$100,P38,2),\"\")","v":""},0,0,0,0,0,0,{"$f":"IF(#REF!>0,#REF!,0)","v":{"$error":"#REF!"}},0,0,0,0,0,0,0,""]
["",null,null,""," ",null,{"$f":"IF(F39>0,INDEX(Poeng!$A$1:$B$100,F39,2),\"\")","v":""},null,{"$f":"IF(H39>0,INDEX(Poeng!$A$1:$B$100,H39,2),\"\")","v":""},null,{"$f":"IF(J39>0,INDEX(Poeng!$A$1:$B$100,J39,2),\"\")","v":""},null,{"$f":"IF(L39>0,INDEX(Poeng!$A$1:$B$100,L39,2),\"\")","v":""},null,{"$f":"IF(N39>0,INDEX(Poeng!$A$1:$B$100,N39,2),\"\")","v":""},null,{"$f":"IF(P39>0,INDEX(Poeng!$A$1:$B$100,P39,2),\"\")","v":""},0,0,0,0,0,0,{"$f":"IF(#REF!>0,#REF!,0)","v":{"$error":"#REF!"}},0,0,0,0,0,0,0,""]
["",null,null,""," ",null,{"$f":"IF(F40>0,INDEX(Poeng!$A$1:$B$100,F40,2),\"\")","v":""},null,{"$f":"IF(H40>0,INDEX(Poeng!$A$1:$B$100,H40,2),\"\")","v":""},null,{"$f":"IF(J40>0,INDEX(Poeng!$A$1:$B$100,J40,2),\"\")","v":""},null,{"$f":"IF(L40>0,INDEX(Poeng!$A$1:$B$100,L40,2),\"\")","v":""},null,{"$f":"IF(N40>0,INDEX(Poeng!$A$1:$B$100,N40,2),\"\")","v":""},null,{"$f":"IF(P40>0,INDEX(Poeng!$A$1:$B$100,P40,2),\"\")","v":""},0,0,0,0,0,0,{"$f":"IF(#REF!>0,#REF!,0)","v":{"$error":"#REF!"}},0,0,0,0,0,0,0,""]
["",null,null,""," ",null,{"$f":"IF(F41>0,INDEX(Poeng!$A$1:$B$100,F41,2),\"\")","v":""},null,{"$f":"IF(H41>0,INDEX(Poeng!$A$1:$B$100,H41,2),\"\")","v":""},null,{"$f":"IF(J41>0,INDEX(Poeng!$A$1:$B$100,J41,2),\"\")","v":""},null,{"$f":"IF(L41>0,INDEX(Poeng!$A$1:$B$100,L41,2),\"\")","v":""},null,{"$f":"IF(N41>0,INDEX(Poeng!$A$1:$B$100,N41,2),\"\")","v":""},null,{"$f":"IF(P41>0,INDEX(Poeng!$A$1:$B$100,P41,2),\"\")","v":""},0,0,0,0,0,0,{"$f":"IF(#REF!>0,#REF!,0)","v":{"$error":"#REF!"}},0,0,0,0,0,0,0,""]
["",null,null,""," ",null,{"$f":"IF(F42>0,INDEX(Poeng!$A$1:$B$100,F42,2),\"\")","v":""},null,{"$f":"IF(H42>0,INDEX(Poeng!$A$1:$B$100,H42,2),\"\")","v":""},null,{"$f":"IF(J42>0,INDEX(Poeng!$A$1:$B$100,J42,2),\"\")","v":""},null,{"$f":"IF(L42>0,INDEX(Poeng!$A$1:$B$100,L42,2),\"\")","v":""},null,{"$f":"IF(N42>0,INDEX(Poeng!$A$1:$B$100,N42,2),\"\")","v":""},null,{"$f":"IF(P42>0,INDEX(Poeng!$A$1:$B$100,P42,2),\"\")","v":""},0,0,0,0,0,0,{"$f":"IF(#REF!>0,#REF!,0)","v":{"$error":"#REF!"}},0,0,0,0,0,0,0,""]
["",null,null,""," ",null,{"$f":"IF(F43>0,INDEX(Poeng!$A$1:$B$100,F43,2),\"\")","v":""},null,{"$f":"IF(H43>0,INDEX(Poeng!$A$1:$B$100,H43,2),\"\")","v":""},null,{"$f":"IF(J43>0,INDEX(Poeng!$A$1:$B$100,J43,2),\"\")","v":""},null,{"$f":"IF(L43>0,INDEX(Poeng!$A$1:$B$100,L43,2),\"\")","v":""},null,{"$f":"IF(N43>0,INDEX(Poeng!$A$1:$B$100,N43,2),\"\")","v":""},null,{"$f":"IF(P43>0,INDEX(Poeng!$A$1:$B$100,P43,2),\"\")","v":""},0,0,0,0,0,0,{"$f":"IF(#REF!>0,#REF!,0)","v":{"$error":"#REF!"}},0,0,0,0,0,0,0,""]
["",null,null,""," ",null,{"$f":"IF(F44>0,INDEX(Poeng!$A$1:$B$100,F44,2),\"\")","v":""},null,{"$f":"IF(H44>0,INDEX(Poeng!$A$1:$B$100,H44,2),\"\")","v":""},null,{"$f":"IF(J44>0,INDEX(Poeng!$A$1:$B$100,J44,2),\"\")","v":""},null,{"$f":"IF(L44>0,INDEX(Poeng!$A$1:$B$100,L44,2),\"\")","v":""},null,{"$f":"IF(N44>0,INDEX(Poeng!$A$1:$B$100,N44,2),\"\")","v":""},null,{"$f":"IF(P44>0,INDEX(Poeng!$A$1:$B$100,P44,2),\"\")","v":""},0,0,0,0,0,0,{"$f":"IF(#REF!>0,#REF!,0)","v":{"$error":"#REF!"}},0,0,0,0,0,0,0,""]
["",null,null,""," ",null,{"$f":"IF(F45>0,INDEX(Poeng!$A$1:$B$100,F45,2),\"\")","v":""},null,{"$f":"IF(H45>0,INDEX(Poeng!$A$1:$B$100,H45,2),\"\")","v":""},null,{"$f":"IF(J45>0,INDEX(Poeng!$A$1:$B$100,J45,2),\"\")","v":""},null,{"$f":"IF(L45>0,INDEX(Poeng!$A$1:$B$100,L45,2),\"\")","v":""},null,{"$f":"IF(N45>0,INDEX(Poeng!$A$1:$B$100,N45,2),\"\")","v":""},null,{"$f":"IF(P45>0,INDEX(Poeng!$A$1:$B$100,P45,2),\"\")","v":""},0,0,0,0,0,0,{"$f":"IF(#REF!>0,#REF!,0)","v":{"$error":"#REF!"}},0,0,0,0,0,0,0,""]
["",null,null,""," ",null,null,null,{"$f":"IF(H46>0,INDEX(Poeng!$A$1:$B$100,H46,2),\"\")","v":""},null,{"$f":"IF(J46>0,INDEX(Poeng!$A$1:$B$100,J46,2),\"\")","v":""},null,{"$f":"IF(L46>0,INDEX(Poeng!$A$1:$B$100,L46,2),\"\")","v":""},null,{"$f":"IF(N46>0,INDEX(Poeng!$A$1:$B$100,N46,2),\"\")","v":""},null,{"$f":"IF(P46>0,INDEX(Poeng!$A$1:$B$100,P46,2),\"\")","v":""},0,0,0,0,0,0,{"$f":"IF(#REF!>0,#REF!,0)","v":{"$error":"#REF!"}},0,0,0,0,0,0,0,""]
["",null,null,""," ",null,null,null,{"$f":"IF(H47>0,INDEX(Poeng!$A$1:$B$100,H47,2),\"\")","v":""},null,{"$f":"IF(J47>0,INDEX(Poeng!$A$1:$B$100,J47,2),\"\")","v":""},null,{"$f":"IF(L47>0,INDEX(Poeng!$A$1:$B$100,L47,2),\"\")","v":""},null,{"$f":"IF(N47>0,INDEX(Poeng!$A$1:$B$100,N47,2),\"\")","v":""},null,{"$f":"IF(P47>0,INDEX(Poeng!$A$1:$B$100,P47,2),\"\")","v":""},0,0,0,0,0,0,{"$f":"IF(#REF!>0,#REF!,0)","v":{"$error":"#REF!"}},0,0,0,0,0,0,0,""]
["",null,null,""," ",null,null,null,{"$f":"IF(H48>0,INDEX(Poeng!$A$1:$B$100,H48,2),\"\")","v":""},null,{"$f":"IF(J48>0,INDEX(Poeng!$A$1:$B$100,J48,2),\"\")","v":""},null,{"$f":"IF(L48>0,INDEX(Poeng!$A$1:$B$100,L48,2),\"\")","v":""},null,{"$f":"IF(N48>0,INDEX(Poeng!$A$1:$B$100,N48,2),\"\")","v":""},null,{"$f":"IF(P48>0,INDEX(Poeng!$A$1:$B$100,P48,2),\"\")","v":""},0,0,0,0,0,0,{"$f":"IF(#REF!>0,#REF!,0)","v":{"$error":"#REF!"}},0,0,0,0,0,0,0,""]
["",null,null,""," ",null,null,null,{"$f":"IF(H49>0,INDEX(Poeng!$A$1:$B$100,H49,2),\"\")","v":""},null,{"$f":"IF(J49>0,INDEX(Poeng!$A$1:$B$100,J49,2),\"\")","v":""},null,{"$f":"IF(L49>0,INDEX(Poeng!$A$1:$B$100,L49,2),\"\")","v":""},null,{"$f":"IF(N49>0,INDEX(Poeng!$A$1:$B$100,N49,2),\"\")","v":""},null,{"$f":"IF(P49>0,INDEX(Poeng!$A$1:$B$100,P49,2),\"\")","v":""},0,0,0,0,0,0,{"$f":"IF(#REF!>0,#REF!,0)","v":{"$error":"#REF!"}},0,0,0,0,0,0,0,""]
["",null,null,""," ",null,null,null,{"$f":"IF(H50>0,INDEX(Poeng!$A$1:$B$100,H50,2),\"\")","v":""},null,{"$f":"IF(J50>0,INDEX(Poeng!$A$1:$B$100,J50,2),\"\")","v":""},null,{"$f":"IF(L50>0,INDEX(Poeng!$A$1:$B$100,L50,2),\"\")","v":""},null,{"$f":"IF(N50>0,INDEX(Poeng!$A$1:$B$100,N50,2),\"\")","v":""},null,{"$f":"IF(P50>0,INDEX(Poeng!$A$1:$B$100,P50,2),\"\")","v":""},0,0,0,0,0,0,{"$f":"IF(#REF!>0,#REF!,0)","v":{"$error":"#REF!"}},0,0,0,0,0,0,0,""]
["",null,null,""," ",null,null,null,{"$f":"IF(H51>0,INDEX(Poeng!$A$1:$B$100,H51,2),\"\")","v":""},null,{"$f":"IF(J51>0,INDEX(Poeng!$A$1:$B$100,J51,2),\"\")","v":""},null,{"$f":"IF(L51>0,INDEX(Poeng!$A$1:$B$100,L51,2),\"\")","v":""},null,{"$f":"IF(N51>0,INDEX(Poeng!$A$1:$B$100,N51,2),\"\")","v":""},null,{"$f":"IF(P51>0,INDEX(Poeng!$A$1:$B$100,P51,2),\"\")","v":""},0,0,0,0,0,0,{"$f":"IF(#REF!>0,#REF!,0)","v":{"$error":"#REF!"}},0,0,0,0,0,0,0,""]
["",null,null,""," ",null,null,null,{"$f":"IF(H52>0,INDEX(Poeng!$A$1:$B$100,H52,2),\"\")","v":""},null,{"$f":"IF(J52>0,INDEX(Poeng!$A$1:$B$100,J52,2),\"\")","v":""},null,{"$f":"IF(L52>0,INDEX(Poeng!$A$1:$B$100,L52,2),\"\")","v":""},null,{"$f":"IF(N52>0,INDEX(Poeng!$A$1:$B$100,N52,2),\"\")","v":""},null,{"$f":"IF(P52>0,INDEX(Poeng!$A$1:$B$100,P52,2),\"\")","v":""},0,0,0,0,0,0,{"$f":"IF(#REF!>0,#REF!,0)","v":{"$error":"#REF!"}},0,0,0,0,0,0,0,""]
["",null,null,""," ",null,null,null,{"$f":"IF(H53>0,INDEX(Poeng!$A$1:$B$100,H53,2),\"\")","v":""},null,{"$f":"IF(J53>0,INDEX(Poeng!$A$1:$B$100,J53,2),\"\")","v":""},null,{"$f":"IF(L53>0,INDEX(Poeng!$A$1:$B$100,L53,2),\"\")","v":""},null,{"$f":"IF(N53>0,INDEX(Poeng!$A$1:$B$100,N53,2),\"\")","v":""},null,{"$f":"IF(P53>0,INDEX(Poeng!$A$1:$B$100,P53,2),\"\")","v":""},0,0,0,0,0,0,{"$f":"IF(#REF!>0,#REF!,0)","v":{"$error":"#REF!"}},0,0,0,0,0,0,0,""]
["",null,null,""," ",null,null,null,{"$f":"IF(H54>0,INDEX(Poeng!$A$1:$B$100,H54,2),\"\")","v":""},null,{"$f":"IF(J54>0,INDEX(Poeng!$A$1:$B$100,J54,2),\"\")","v":""},null,{"$f":"IF(L54>0,INDEX(Poeng!$A$1:$B$100,L54,2),\"\")","v":""},null,{"$f":"IF(N54>0,INDEX(Poeng!$A$1:$B$100,N54,2),\"\")","v":""},null,{"$f":"IF(P54>0,INDEX(Poeng!$A$1:$B$100,P54,2),\"\")","v":""},0,0,0,0,0,0,{"$f":"IF(#REF!>0,#REF!,0)","v":{"$error":"#REF!"}},0,0,0,0,0,0,0,{"$f":"IF(B54<>\"\",RANK(AE54,AE$4:AE$69,0),\"\")","v":""}]
["",null,null,""," ",null,null,null,{"$f":"IF(H55>0,INDEX(Poeng!$A$1:$B$100,H55,2),\"\")","v":""},null,{"$f":"IF(J55>0,INDEX(Poeng!$A$1:$B$100,J55,2),\"\")","v":""},null,{"$f":"IF(L55>0,INDEX(Poeng!$A$1:$B$100,L55,2),\"\")","v":""},null,{"$f":"IF(N55>0,INDEX(Poeng!$A$1:$B$100,N55,2),\"\")","v":""},null,{"$f":"IF(P55>0,INDEX(Poeng!$A$1:$B$100,P55,2),\"\")","v":""},0,0,0,0,0,0,{"$f":"IF(#REF!>0,#REF!,0)","v":{"$error":"#REF!"}},0,0,0,0,0,0,0,""]
["",null,null,""," ",null,null,null,{"$f":"IF(H56>0,INDEX(Poeng!$A$1:$B$100,H56,2),\"\")","v":""},null,{"$f":"IF(J56>0,INDEX(Poeng!$A$1:$B$100,J56,2),\"\")","v":""},null,{"$f":"IF(L56>0,INDEX(Poeng!$A$1:$B$100,L56,2),\"\")","v":""},null,{"$f":"IF(N56>0,INDEX(Poeng!$A$1:$B$100,N56,2),\"\")","v":""},null,{"$f":"IF(P56>0,INDEX(Poeng!$A$1:$B$100,P56,2),\"\")","v":""},0,0,0,0,0,0,{"$f":"IF(#REF!>0,#REF!,0)","v":{"$error":"#REF!"}},0,0,0,0,0,0,0,""]
["",null,null,""," ",null,null,null,{"$f":"IF(H57>0,INDEX(Poeng!$A$1:$B$100,H57,2),\"\")","v":""},null,{"$f":"IF(J57>0,INDEX(Poeng!$A$1:$B$100,J57,2),\"\")","v":""},null,{"$f":"IF(L57>0,INDEX(Poeng!$A$1:$B$100,L57,2),\"\")","v":""},null,{"$f":"IF(N57>0,INDEX(Poeng!$A$1:$B$100,N57,2),\"\")","v":""},null,{"$f":"IF(P57>0,INDEX(Poeng!$A$1:$B$100,P57,2),\"\")","v":""},0,0,0,0,0,0,{"$f":"IF(#REF!>0,#REF!,0)","v":{"$error":"#REF!"}},0,0,0,0,0,0,0,""]
["",null,null,""," ",null,null,null,{"$f":"IF(H58>0,INDEX(Poeng!$A$1:$B$100,H58,2),\"\")","v":""},null,{"$f":"IF(J58>0,INDEX(Poeng!$A$1:$B$100,J58,2),\"\")","v":""},null,{"$f":"IF(L58>0,INDEX(Poeng!$A$1:$B$100,L58,2),\"\")","v":""},null,{"$f":"IF(N58>0,INDEX(Poeng!$A$1:$B$100,N58,2),\"\")","v":""},null,{"$f":"IF(P58>0,INDEX(Poeng!$A$1:$B$100,P58,2),\"\")","v":""},0,0,0,0,0,0,{"$f":"IF(#REF!>0,#REF!,0)","v":{"$error":"#REF!"}},0,0,0,0,0,0,0,""]
["",null,null,"",{"$f":"IF(AD59<4,\" \",\"F\")","v":" "},null,null,null,{"$f":"IF(H59>0,INDEX(Poeng!$A$1:$B$100,H59,2),\"\")","v":""},null,{"$f":"IF(J59>0,INDEX(Poeng!$A$1:$B$100,J59,2),\"\")","v":""},null,{"$f":"IF(L59>0,INDEX(Poeng!$A$1:$B$100,L59,2),\"\")","v":""},null,{"$f":"IF(N59>0,INDEX(Poeng!$A$1:$B$100,N59,2),\"\")","v":""},null,{"$f":"IF(P59>0,INDEX(Poeng!$A$1:$B$100,P59,2),\"\")","v":""},0,0,0,0,0,0,{"$f":"IF(#REF!>0,#REF!,0)","v":{"$error":"#REF!"}},0,0,0,0,0,0,0,""]
["",null,null,""," ",null,null,null,{"$f":"IF(H60>0,INDEX(Poeng!$A$1:$B$100,H60,2),\"\")","v":""},null,{"$f":"IF(J60>0,INDEX(Poeng!$A$1:$B$100,J60,2),\"\")","v":""},null,{"$f":"IF(L60>0,INDEX(Poeng!$A$1:$B$100,L60,2),\"\")","v":""},null,{"$f":"IF(N60>0,INDEX(Poeng!$A$1:$B$100,N60,2),\"\")","v":""},null,{"$f":"IF(P60>0,INDEX(Poeng!$A$1:$B$100,P60,2),\"\")","v":""},0,0,0,0,0,0,{"$f":"IF(#REF!>0,#REF!,0)","v":{"$error":"#REF!"}},0,0,0,0,0,0,0,""]
["",null,null,""," ",null,null,null,{"$f":"IF(H61>0,INDEX(Poeng!$A$1:$B$100,H61,2),\"\")","v":""},null,{"$f":"IF(J61>0,INDEX(Poeng!$A$1:$B$100,J61,2),\"\")","v":""},null,{"$f":"IF(L61>0,INDEX(Poeng!$A$1:$B$100,L61,2),\"\")","v":""},null,{"$f":"IF(N61>0,INDEX(Poeng!$A$1:$B$100,N61,2),\"\")","v":""},null,{"$f":"IF(P61>0,INDEX(Poeng!$A$1:$B$100,P61,2),\"\")","v":""},0,0,0,0,0,0,{"$f":"IF(#REF!>0,#REF!,0)","v":{"$error":"#REF!"}},0,0,0,0,0,0,0,""]
["",null,null,""," ",null,null,null,{"$f":"IF(H62>0,INDEX(Poeng!$A$1:$B$100,H62,2),\"\")","v":""},null,{"$f":"IF(J62>0,INDEX(Poeng!$A$1:$B$100,J62,2),\"\")","v":""},null,{"$f":"IF(L62>0,INDEX(Poeng!$A$1:$B$100,L62,2),\"\")","v":""},null,{"$f":"IF(N62>0,INDEX(Poeng!$A$1:$B$100,N62,2),\"\")","v":""},null,{"$f":"IF(P62>0,INDEX(Poeng!$A$1:$B$100,P62,2),\"\")","v":""},0,0,0,0,0,0,{"$f":"IF(#REF!>0,#REF!,0)","v":{"$error":"#REF!"}},0,0,0,0,0,0,0,""]
["",null,null,""," ",null,null,null,{"$f":"IF(H63>0,INDEX(Poeng!$A$1:$B$100,H63,2),\"\")","v":""},null,{"$f":"IF(J63>0,INDEX(Poeng!$A$1:$B$100,J63,2),\"\")","v":""},null,{"$f":"IF(L63>0,INDEX(Poeng!$A$1:$B$100,L63,2),\"\")","v":""},null,{"$f":"IF(N63>0,INDEX(Poeng!$A$1:$B$100,N63,2),\"\")","v":""},null,{"$f":"IF(P63>0,INDEX(Poeng!$A$1:$B$100,P63,2),\"\")","v":""},0,0,0,0,0,0,{"$f":"IF(#REF!>0,#REF!,0)","v":{"$error":"#REF!"}},0,0,0,0,0,0,0,""]
["",null,null,""," ",null,null,null,{"$f":"IF(H64>0,INDEX(Poeng!$A$1:$B$100,H64,2),\"\")","v":""},null,{"$f":"IF(J64>0,INDEX(Poeng!$A$1:$B$100,J64,2),\"\")","v":""},null,{"$f":"IF(L64>0,INDEX(Poeng!$A$1:$B$100,L64,2),\"\")","v":""},null,{"$f":"IF(N64>0,INDEX(Poeng!$A$1:$B$100,N64,2),\"\")","v":""},null,{"$f":"IF(P64>0,INDEX(Poeng!$A$1:$B$100,P64,2),\"\")","v":""},0,0,0,0,0,0,{"$f":"IF(#REF!>0,#REF!,0)","v":{"$error":"#REF!"}},0,0,0,0,0,0,0,""]
["",null,null,""," ",null,null,null,{"$f":"IF(H65>0,INDEX(Poeng!$A$1:$B$100,H65,2),\"\")","v":""},null,{"$f":"IF(J65>0,INDEX(Poeng!$A$1:$B$100,J65,2),\"\")","v":""},null,{"$f":"IF(L65>0,INDEX(Poeng!$A$1:$B$100,L65,2),\"\")","v":""},null,{"$f":"IF(N65>0,INDEX(Poeng!$A$1:$B$100,N65,2),\"\")","v":""},null,{"$f":"IF(P65>0,INDEX(Poeng!$A$1:$B$100,P65,2),\"\")","v":""},0,0,0,0,0,0,{"$f":"IF(#REF!>0,#REF!,0)","v":{"$error":"#REF!"}},0,0,0,0,0,0,0,""]
["",null,null,""," ",null,null,null,{"$f":"IF(H66>0,INDEX(Poeng!$A$1:$B$100,H66,2),\"\")","v":""},null,{"$f":"IF(J66>0,INDEX(Poeng!$A$1:$B$100,J66,2),\"\")","v":""},null,{"$f":"IF(L66>0,INDEX(Poeng!$A$1:$B$100,L66,2),\"\")","v":""},null,{"$f":"IF(N66>0,INDEX(Poeng!$A$1:$B$100,N66,2),\"\")","v":""},null,{"$f":"IF(P66>0,INDEX(Poeng!$A$1:$B$100,P66,2),\"\")","v":""},0,0,0,0,0,0,{"$f":"IF(#REF!>0,#REF!,0)","v":{"$error":"#REF!"}},0,0,0,0,0,0,0,""]
[{"$f":"AF67","v":""},null,null,{"$f":"IF(B67<>\"\",AC67,\"\")","v":""}," ",null,null,null,{"$f":"IF(H67>0,INDEX(Poeng!$A$1:$B$100,H67,2),\"\")","v":""},null,{"$f":"IF(J67>0,INDEX(Poeng!$A$1:$B$100,J67,2),\"\")","v":""},null,{"$f":"IF(L67>0,INDEX(Poeng!$A$1:$B$100,L67,2),\"\")","v":""},null,{"$f":"IF(N67>0,INDEX(Poeng!$A$1:$B$100,N67,2),\"\")","v":""},null,{"$f":"IF(P67>0,INDEX(Poeng!$A$1:$B$100,P67,2),\"\")","v":""},{"$f":"IF(F67>0,G67,0)","v":0},{"$f":"IF(H67>0,I67,0)","v":0},{"$f":"IF(J67>0,K67,0)","v":0},{"$f":"IF(L67>0,M67,0)","v":0},{"$f":"IF(N67>0,O67,0)","v":0},{"$f":"IF(P67>0,Q67,0)","v":0},{"$f":"IF(#REF!>0,#REF!,0)","v":{"$error":"#REF!"}},{"$f":"LARGE(R67:W67,1)","v":0},{"$f":"LARGE(R67:W67,2)","v":0},{"$f":"LARGE(R67:W67,3)","v":0},{"$f":"LARGE(R67:W67,4)","v":0},{"$f":"SUM(Y67:AB67)","v":0},{"$f":"COUNT(F67:Q67)/2","v":0},{"$f":"AC67*10^8+Y67*10^6/2+Z67*10^4/2+AA67*10^2/2+AB67/2","v":0},""]
["",null,null,""," ",null,null,null,{"$f":"IF(H68>0,INDEX(Poeng!$A$1:$B$100,H68,2),\"\")","v":""},null,{"$f":"IF(J68>0,INDEX(Poeng!$A$1:$B$100,J68,2),\"\")","v":""},null,{"$f":"IF(L68>0,INDEX(Poeng!$A$1:$B$100,L68,2),\"\")","v":""},null,{"$f":"IF(N68>0,INDEX(Poeng!$A$1:$B$100,N68,2),\"\")","v":""},null,{"$f":"IF(P68>0,INDEX(Poeng!$A$1:$B$100,P68,2),\"\")","v":""},0,0,0,0,0,0,{"$f":"IF(#REF!>0,#REF!,0)","v":{"$error":"#REF!"}},0,0,0,0,0,0,0,""]
["",null,null,""," ",null,null,null,{"$f":"IF(H69>0,INDEX(Poeng!$A$1:$B$100,H69,2),\"\")","v":""},null,{"$f":"IF(J69>0,INDEX(Poeng!$A$1:$B$100,J69,2),\"\")","v":""},null,{"$f":"IF(L69>0,INDEX(Poeng!$A$1:$B$100,L69,2),\"\")","v":""},null,{"$f":"IF(N69>0,INDEX(Poeng!$A$1:$B$100,N69,2),\"\")","v":""},null,{"$f":"IF(P69>0,INDEX(Poeng!$A$1:$B$100,P69,2),\"\")","v":""},0,0,0,0,0,0,{"$f":"IF(#REF!>0,#REF!,0)","v":{"$error":"#REF!"}},0,0,0,0,0,0,0,""]
["",null,null,""," ",null,null,null,{"$f":"IF(H70>0,INDEX(Poeng!$A$1:$B$100,H70,2),\"\")","v":""},null,{"$f":"IF(J70>0,INDEX(Poeng!$A$1:$B$100,J70,2),\"\")","v":""},null,{"$f":"IF(L70>0,INDEX(Poeng!$A$1:$B$100,L70,2),\"\")","v":""},null,{"$f":"IF(N70>0,INDEX(Poeng!$A$1:$B$100,N70,2),\"\")","v":""},null,{"$f":"IF(P70>0,INDEX(Poeng!$A$1:$B$100,P70,2),\"\")","v":""},0,0,0,0,0,0,{"$f":"IF(#REF!>0,#REF!,0)","v":{"$error":"#REF!"}},0,0,0,0,0,0,0,""]
["",null,null,""," ",null,null,null,{"$f":"IF(H71>0,INDEX(Poeng!$A$1:$B$100,H71,2),\"\")","v":""},null,{"$f":"IF(J71>0,INDEX(Poeng!$A$1:$B$100,J71,2),\"\")","v":""},null,{"$f":"IF(L71>0,INDEX(Poeng!$A$1:$B$100,L71,2),\"\")","v":""},null,{"$f":"IF(N71>0,INDEX(Poeng!$A$1:$B$100,N71,2),\"\")","v":""},null,{"$f":"IF(P71>0,INDEX(Poeng!$A$1:$B$100,P71,2),\"\")","v":""},0,0,0,0,0,0,{"$f":"IF(#REF!>0,#REF!,0)","v":{"$error":"#REF!"}},0,0,0,0,0,0,0,""]
["",null,null,""," ",null,null,null,{"$f":"IF(H72>0,INDEX(Poeng!$A$1:$B$100,H72,2),\"\")","v":""},null,{"$f":"IF(J72>0,INDEX(Poeng!$A$1:$B$100,J72,2),\"\")","v":""},null,{"$f":"IF(L72>0,INDEX(Poeng!$A$1:$B$100,L72,2),\"\")","v":""},null,{"$f":"IF(N72>0,INDEX(Poeng!$A$1:$B$100,N72,2),\"\")","v":""},null,{"$f":"IF(P72>0,INDEX(Poeng!$A$1:$B$100,P72,2),\"\")","v":""},0,0,0,0,0,0,{"$f":"IF(#REF!>0,#REF!,0)","v":{"$error":"#REF!"}},0,0,0,0,0,0,0,""]
["",null,null,""," ",null,null,null,{"$f":"IF(H73>0,INDEX(Poeng!$A$1:$B$100,H73,2),\"\")","v":""},null,{"$f":"IF(J73>0,INDEX(Poeng!$A$1:$B$100,J73,2),\"\")","v":""},null,{"$f":"IF(L73>0,INDEX(Poeng!$A$1:$B$100,L73,2),\"\")","v":""},null,{"$f":"IF(N73>0,INDEX(Poeng!$A$1:$B$100,N73,2),\"\")","v":""},null,{"$f":"IF(P73>0,INDEX(Poeng!$A$1:$B$100,P73,2),\"\")","v":""},0,0,0,0,0,0,{"$f":"IF(#REF!>0,#REF!,0)","v":{"$error":"#REF!"}},0,0,0,0,0,0,0,""]
["",null,null,""," ",null,null,null,{"$f":"IF(H74>0,INDEX(Poeng!$A$1:$B$100,H74,2),\"\")","v":""},null,{"$f":"IF(J74>0,INDEX(Poeng!$A$1:$B$100,J74,2),\"\")","v":""},null,{"$f":"IF(L74>0,INDEX(Poeng!$A$1:$B$100,L74,2),\"\")","v":""},null,{"$f":"IF(N74>0,INDEX(Poeng!$A$1:$B$100,N74,2),\"\")","v":""},null,{"$f":"IF(P74>0,INDEX(Poeng!$A$1:$B$100,P74,2),\"\")","v":""},0,0,0,0,0,0,{"$f":"IF(#REF!>0,#REF!,0)","v":{"$error":"#REF!"}},0,0,0,0,0,0,0,""]
["",null,null,""," ",null,null,null,{"$f":"IF(H75>0,INDEX(Poeng!$A$1:$B$100,H75,2),\"\")","v":""},null,{"$f":"IF(J75>0,INDEX(Poeng!$A$1:$B$100,J75,2),\"\")","v":""},null,{"$f":"IF(L75>0,INDEX(Poeng!$A$1:$B$100,L75,2),\"\")","v":""},null,{"$f":"IF(N75>0,INDEX(Poeng!$A$1:$B$100,N75,2),\"\")","v":""},null,{"$f":"IF(P75>0,INDEX(Poeng!$A$1:$B$100,P75,2),\"\")","v":""},0,0,0,0,0,0,{"$f":"IF(#REF!>0,#REF!,0)","v":{"$error":"#REF!"}},0,0,0,0,0,0,0,""]
["",null,null,""," ",null,null,null,{"$f":"IF(H76>0,INDEX(Poeng!$A$1:$B$100,H76,2),\"\")","v":""},null,{"$f":"IF(J76>0,INDEX(Poeng!$A$1:$B$100,J76,2),\"\")","v":""},null,{"$f":"IF(L76>0,INDEX(Poeng!$A$1:$B$100,L76,2),\"\")","v":""},null,{"$f":"IF(N76>0,INDEX(Poeng!$A$1:$B$100,N76,2),\"\")","v":""},null,{"$f":"IF(P76>0,INDEX(Poeng!$A$1:$B$100,P76,2),\"\")","v":""},0,0,0,0,0,0,{"$f":"IF(#REF!>0,#REF!,0)","v":{"$error":"#REF!"}},0,0,0,0,0,0,0,""]
["",null,null,""," ",null,null,null,{"$f":"IF(H77>0,INDEX(Poeng!$A$1:$B$100,H77,2),\"\")","v":""},null,{"$f":"IF(J77>0,INDEX(Poeng!$A$1:$B$100,J77,2),\"\")","v":""},null,{"$f":"IF(L77>0,INDEX(Poeng!$A$1:$B$100,L77,2),\"\")","v":""},null,{"$f":"IF(N77>0,INDEX(Poeng!$A$1:$B$100,N77,2),\"\")","v":""},null,{"$f":"IF(P77>0,INDEX(Poeng!$A$1:$B$100,P77,2),\"\")","v":""},0,0,0,0,0,0,{"$f":"IF(#REF!>0,#REF!,0)","v":{"$error":"#REF!"}},0,0,0,0,0,0,0,""]
["",null,null,""," ",null,null,null,{"$f":"IF(H78>0,INDEX(Poeng!$A$1:$B$100,H78,2),\"\")","v":""},null,{"$f":"IF(J78>0,INDEX(Poeng!$A$1:$B$100,J78,2),\"\")","v":""},null,{"$f":"IF(L78>0,INDEX(Poeng!$A$1:$B$100,L78,2),\"\")","v":""},null,{"$f":"IF(N78>0,INDEX(Poeng!$A$1:$B$100,N78,2),\"\")","v":""},null,{"$f":"IF(P78>0,INDEX(Poeng!$A$1:$B$100,P78,2),\"\")","v":""},0,0,0,0,0,0,{"$f":"IF(#REF!>0,#REF!,0)","v":{"$error":"#REF!"}},0,0,0,0,0,0,0,""]
["",null,null,""," ",null,null,null,{"$f":"IF(H79>0,INDEX(Poeng!$A$1:$B$100,H79,2),\"\")","v":""},null,{"$f":"IF(J79>0,INDEX(Poeng!$A$1:$B$100,J79,2),\"\")","v":""},null,{"$f":"IF(L79>0,INDEX(Poeng!$A$1:$B$100,L79,2),\"\")","v":""},null,{"$f":"IF(N79>0,INDEX(Poeng!$A$1:$B$100,N79,2),\"\")","v":""},null,{"$f":"IF(P79>0,INDEX(Poeng!$A$1:$B$100,P79,2),\"\")","v":""},0,0,0,0,0,0,{"$f":"IF(#REF!>0,#REF!,0)","v":{"$error":"#REF!"}},0,0,0,0,0,0,0,""]
["",null,null,""," ",null,null,null,{"$f":"IF(H80>0,INDEX(Poeng!$A$1:$B$100,H80,2),\"\")","v":""},null,{"$f":"IF(J80>0,INDEX(Poeng!$A$1:$B$100,J80,2),\"\")","v":""},null,{"$f":"IF(L80>0,INDEX(Poeng!$A$1:$B$100,L80,2),\"\")","v":""},null,{"$f":"IF(N80>0,INDEX(Poeng!$A$1:$B$100,N80,2),\"\")","v":""},null,{"$f":"IF(P80>0,INDEX(Poeng!$A$1:$B$100,P80,2),\"\")","v":""},0,0,0,0,0,0,{"$f":"IF(#REF!>0,#REF!,0)","v":{"$error":"#REF!"}},0,0,0,0,0,0,0,""]
["",null,null,""," ",null,null,null,{"$f":"IF(H81>0,INDEX(Poeng!$A$1:$B$100,H81,2),\"\")","v":""},null,{"$f":"IF(J81>0,INDEX(Poeng!$A$1:$B$100,J81,2),\"\")","v":""},null,{"$f":"IF(L81>0,INDEX(Poeng!$A$1:$B$100,L81,2),\"\")","v":""},null,{"$f":"IF(N81>0,INDEX(Poeng!$A$1:$B$100,N81,2),\"\")","v":""},null,{"$f":"IF(P81>0,INDEX(Poeng!$A$1:$B$100,P81,2),\"\")","v":""},0,0,0,0,0,0,{"$f":"IF(#REF!>0,#REF!,0)","v":{"$error":"#REF!"}},0,0,0,0,0,0,0,""]
["",null,null,""," ",null,null,null,{"$f":"IF(H82>0,INDEX(Poeng!$A$1:$B$100,H82,2),\"\")","v":""},null,{"$f":"IF(J82>0,INDEX(Poeng!$A$1:$B$100,J82,2),\"\")","v":""},null,{"$f":"IF(L82>0,INDEX(Poeng!$A$1:$B$100,L82,2),\"\")","v":""},null,{"$f":"IF(N82>0,INDEX(Poeng!$A$1:$B$100,N82,2),\"\")","v":""},null,{"$f":"IF(P82>0,INDEX(Poeng!$A$1:$B$100,P82,2),\"\")","v":""},0,0,0,0,0,0,{"$f":"IF(#REF!>0,#REF!,0)","v":{"$error":"#REF!"}},0,0,0,0,0,0,0,""]
["",null,null,""," ",null,null,null,{"$f":"IF(H83>0,INDEX(Poeng!$A$1:$B$100,H83,2),\"\")","v":""},null,{"$f":"IF(J83>0,INDEX(Poeng!$A$1:$B$100,J83,2),\"\")","v":""},null,{"$f":"IF(L83>0,INDEX(Poeng!$A$1:$B$100,L83,2),\"\")","v":""},null,{"$f":"IF(N83>0,INDEX(Poeng!$A$1:$B$100,N83,2),\"\")","v":""},null,{"$f":"IF(P83>0,INDEX(Poeng!$A$1:$B$100,P83,2),\"\")","v":""},0,0,0,0,0,0,{"$f":"IF(#REF!>0,#REF!,0)","v":{"$error":"#REF!"}},0,0,0,0,0,0,0,""]
["",null,null,""," ",null,null,null,{"$f":"IF(H84>0,INDEX(Poeng!$A$1:$B$100,H84,2),\"\")","v":""},null,{"$f":"IF(J84>0,INDEX(Poeng!$A$1:$B$100,J84,2),\"\")","v":""},null,{"$f":"IF(L84>0,INDEX(Poeng!$A$1:$B$100,L84,2),\"\")","v":""},null,{"$f":"IF(N84>0,INDEX(Poeng!$A$1:$B$100,N84,2),\"\")","v":""},null,{"$f":"IF(P84>0,INDEX(Poeng!$A$1:$B$100,P84,2),\"\")","v":""},0,0,0,0,0,0,{"$f":"IF(#REF!>0,#REF!,0)","v":{"$error":"#REF!"}},0,0,0,0,0,0,0,""]
["",null,null,""," ",null,null,null,{"$f":"IF(H85>0,INDEX(Poeng!$A$1:$B$100,H85,2),\"\")","v":""},null,{"$f":"IF(J85>0,INDEX(Poeng!$A$1:$B$100,J85,2),\"\")","v":""},null,{"$f":"IF(L85>0,INDEX(Poeng!$A$1:$B$100,L85,2),\"\")","v":""},null,{"$f":"IF(N85>0,INDEX(Poeng!$A$1:$B$100,N85,2),\"\")","v":""},null,{"$f":"IF(P85>0,INDEX(Poeng!$A$1:$B$100,P85,2),\"\")","v":""},0,0,0,0,0,0,{"$f":"IF(#REF!>0,#REF!,0)","v":{"$error":"#REF!"}},0,0,0,0,0,0,0,""]
["",null,null,""," ",null,null,null,{"$f":"IF(H86>0,INDEX(Poeng!$A$1:$B$100,H86,2),\"\")","v":""},null,{"$f":"IF(J86>0,INDEX(Poeng!$A$1:$B$100,J86,2),\"\")","v":""},null,{"$f":"IF(L86>0,INDEX(Poeng!$A$1:$B$100,L86,2),\"\")","v":""},null,{"$f":"IF(N86>0,INDEX(Poeng!$A$1:$B$100,N86,2),\"\")","v":""},null,{"$f":"IF(P86>0,INDEX(Poeng!$A$1:$B$100,P86,2),\"\")","v":""},0,0,0,0,0,0,{"$f":"IF(#REF!>0,#REF!,0)","v":{"$error":"#REF!"}},0,0,0,0,0,0,0,""]
["",null,null,""," ",null,null,null,{"$f":"IF(H87>0,INDEX(Poeng!$A$1:$B$100,H87,2),\"\")","v":""},null,{"$f":"IF(J87>0,INDEX(Poeng!$A$1:$B$100,J87,2),\"\")","v":""},null,{"$f":"IF(L87>0,INDEX(Poeng!$A$1:$B$100,L87,2),\"\")","v":""},null,{"$f":"IF(N87>0,INDEX(Poeng!$A$1:$B$100,N87,2),\"\")","v":""},null,{"$f":"IF(P87>0,INDEX(Poeng!$A$1:$B$100,P87,2),\"\")","v":""},0,0,0,0,0,0,{"$f":"IF(#REF!>0,#REF!,0)","v":{"$error":"#REF!"}},0,0,0,0,0,0,0,""]
["",null,null,""," ",null,null,null,{"$f":"IF(H88>0,INDEX(Poeng!$A$1:$B$100,H88,2),\"\")","v":""},null,{"$f":"IF(J88>0,INDEX(Poeng!$A$1:$B$100,J88,2),\"\")","v":""},null,{"$f":"IF(L88>0,INDEX(Poeng!$A$1:$B$100,L88,2),\"\")","v":""},null,{"$f":"IF(N88>0,INDEX(Poeng!$A$1:$B$100,N88,2),\"\")","v":""},null,{"$f":"IF(P88>0,INDEX(Poeng!$A$1:$B$100,P88,2),\"\")","v":""},0,0,0,0,0,0,{"$f":"IF(#REF!>0,#REF!,0)","v":{"$error":"#REF!"}},0,0,0,0,0,0,0,""]
["",null,null,""," ",null,null,null,{"$f":"IF(H89>0,INDEX(Poeng!$A$1:$B$100,H89,2),\"\")","v":""},null,{"$f":"IF(J89>0,INDEX(Poeng!$A$1:$B$100,J89,2),\"\")","v":""},null,{"$f":"IF(L89>0,INDEX(Poeng!$A$1:$B$100,L89,2),\"\")","v":""},null,{"$f":"IF(N89>0,INDEX(Poeng!$A$1:$B$100,N89,2),\"\")","v":""},null,{"$f":"IF(P89>0,INDEX(Poeng!$A$1:$B$100,P89,2),\"\")","v":""},0,0,0,0,0,0,{"$f":"IF(#REF!>0,#REF!,0)","v":{"$error":"#REF!"}},0,0,0,0,0,0,0,""]
["",null,null,""," ",null,null,null,{"$f":"IF(H90>0,INDEX(Poeng!$A$1:$B$100,H90,2),\"\")","v":""},null,{"$f":"IF(J90>0,INDEX(Poeng!$A$1:$B$100,J90,2),\"\")","v":""},null,{"$f":"IF(L90>0,INDEX(Poeng!$A$1:$B$100,L90,2),\"\")","v":""},null,{"$f":"IF(N90>0,INDEX(Poeng!$A$1:$B$100,N90,2),\"\")","v":""},null,{"$f":"IF(P90>0,INDEX(Poeng!$A$1:$B$100,P90,2),\"\")","v":""},0,0,0,0,0,0,{"$f":"IF(#REF!>0,#REF!,0)","v":{"$error":"#REF!"}},0,0,0,0,0,0,0,""]
["",null,null,""," ",null,null,null,{"$f":"IF(H91>0,INDEX(Poeng!$A$1:$B$100,H91,2),\"\")","v":""},null,{"$f":"IF(J91>0,INDEX(Poeng!$A$1:$B$100,J91,2),\"\")","v":""},null,{"$f":"IF(L91>0,INDEX(Poeng!$A$1:$B$100,L91,2),\"\")","v":""},null,{"$f":"IF(N91>0,INDEX(Poeng!$A$1:$B$100,N91,2),\"\")","v":""},null,{"$f":"IF(P91>0,INDEX(Poeng!$A$1:$B$100,P91,2),\"\")","v":""},0,0,0,0,0,0,{"$f":"IF(#REF!>0,#REF!,0)","v":{"$error":"#REF!"}},0,0,0,0,0,0,0,""]
["",null,null,""," ",null,null,null,{"$f":"IF(H92>0,INDEX(Poeng!$A$1:$B$100,H92,2),\"\")","v":""},null,{"$f":"IF(J92>0,INDEX(Poeng!$A$1:$B$100,J92,2),\"\")","v":""},null,{"$f":"IF(L92>0,INDEX(Poeng!$A$1:$B$100,L92,2),\"\")","v":""},null,{"$f":"IF(N92>0,INDEX(Poeng!$A$1:$B$100,N92,2),\"\")","v":""},null,{"$f":"IF(P92>0,INDEX(Poeng!$A$1:$B$100,P92,2),\"\")","v":""},0,0,0,0,0,0,{"$f":"IF(#REF!>0,#REF!,0)","v":{"$error":"#REF!"}},0,0,0,0,0,0,0,""]
["",null,null,""," ",null,null,null,{"$f":"IF(H93>0,INDEX(Poeng!$A$1:$B$100,H93,2),\"\")","v":""},null,{"$f":"IF(J93>0,INDEX(Poeng!$A$1:$B$100,J93,2),\"\")","v":""},null,{"$f":"IF(L93>0,INDEX(Poeng!$A$1:$B$100,L93,2),\"\")","v":""},null,{"$f":"IF(N93>0,INDEX(Poeng!$A$1:$B$100,N93,2),\"\")","v":""},null,{"$f":"IF(P93>0,INDEX(Poeng!$A$1:$B$100,P93,2),\"\")","v":""},0,0,0,0,0,0,{"$f":"IF(#REF!>0,#REF!,0)","v":{"$error":"#REF!"}},0,0,0,0,0,0,0,""]
["",null,null,""," ",null,null,null,{"$f":"IF(H94>0,INDEX(Poeng!$A$1:$B$100,H94,2),\"\")","v":""},null,{"$f":"IF(J94>0,INDEX(Poeng!$A$1:$B$100,J94,2),\"\")","v":""},null,{"$f":"IF(L94>0,INDEX(Poeng!$A$1:$B$100,L94,2),\"\")","v":""},null,{"$f":"IF(N94>0,INDEX(Poeng!$A$1:$B$100,N94,2),\"\")","v":""},null,{"$f":"IF(P94>0,INDEX(Poeng!$A$1:$B$100,P94,2),\"\")","v":""},0,0,0,0,0,0,{"$f":"IF(#REF!>0,#REF!,0)","v":{"$error":"#REF!"}},0,0,0,0,0,0,0,""]

{"sheet":"G13","index":4,"n_rows":66,"n_cols":32,"rows_kept":66,"cut":false,"hidden":false,"merged":[[0,2,0,16],[1,5,1,6],[1,7,1,8],[1,9,1,10],[1,11,1,12],[1,13,1,14],[1,15,1,16],[2,15,2,16],[2,5,2,6],[2,7,2,8],[2,9,2,10],[2,11,2,12],[2,13,2,14]]}
["Gutter 13",null,"  Sparebank1-CUP 2021"]
[null,null,null,null,null,"SP1- CUP 1 ",null,"SP1- CUP 2 ",null,"SP1- CUP 3",null,"SP1- CUP 4",null,"SP1- CUP 5",null,"SP1- CUP 6",null,"Poeng",null,null,null,null,null,null,"Fire beste",null,null,null,"Sum"]
["Nr","NAVN","KLUBB","POENG","Fullført","Nr.  Poeng ",null,"Nr.  Poeng ",null,"Nr.   Poeng ",null,"Nr.  Poeng ",null,"Nr.  Poeng ",null,"Nr. Poeng ",null,1,2,3,4,5,6,7,1,2,3,4]
[{"$f":"AF4","v":1},"Halvor Sellesbakk","Byåsen IL",{"$f":"IF(B4<>\"\",AC4,\"\")","v":400},{"$f":"IF(AD4<4,\" \",\"F\")","v":"F"},1,{"$f":"IF(F4>0,INDEX(Poeng!$A$1:$B$100,F4,2),\"\")","v":100},1,{"$f":"IF(H4>0,INDEX(Poeng!$A$1:$B$100,H4,2),\"\")","v":100},1,{"$f":"IF(J4>0,INDEX(Poeng!$A$1:$B$100,J4,2),\"\")","v":100},1,{"$f":"IF(L4>0,INDEX(Poeng!$A$1:$B$100,L4,2),\"\")","v":100},1,{"$f":"IF(N4>0,INDEX(Poeng!$A$1:$B$100,N4,2),\"\")","v":100},1,{"$f":"IF(P4>0,INDEX(Poeng!$A$1:$B$100,P4,2),\"\")","v":100},{"$f":"IF(F4>0,G4,0)","v":100},{"$f":"IF(H4>0,I4,0)","v":100},{"$f":"IF(J4>0,K4,0)","v":100},{"$f":"IF(L4>0,M4,0)","v":100},{"$f":"IF(N4>0,O4,0)","v":100},{"$f":"IF(P4>0,Q4,0)","v":100},{"$f":"IF(#REF!>0,#REF!,0)","v":{"$error":"#REF!"}},{"$f":"LARGE(R4:W4,1)","v":100},{"$f":"LARGE(R4:W4,2)","v":100},{"$f":"LARGE(R4:W4,3)","v":100},{"$f":"LARGE(R4:W4,4)","v":100},{"$f":"SUM(Y4:AB4)","v":400},{"$f":"COUNT(F4:Q4)/2","v":6},{"$f":"AC4*10^8+Y4*10^6/2+Z4*10^4/2+AA4*10^2/2+AB4/2","v":40050505050},{"$f":"IF(B4<>\"\",RANK(AE4,AE$4:AE$41,0),\"\")","v":1}]
[2,"Torarin Osland","Byåsen IL",290,"F",2,{"$f":"IF(F5>0,INDEX(Poeng!$A$1:$B$100,F5,2),\"\")","v":80},2,{"$f":"IF(H5>0,INDEX(Poeng!$A$1:$B$100,H5,2),\"\")","v":80},null,{"$f":"IF(J5>0,INDEX(Poeng!$A$1:$B$100,J5,2),\"\")","v":""},null,{"$f":"IF(L5>0,INDEX(Poeng!$A$1:$B$100,L5,2),\"\")","v":""},2,{"$f":"IF(N5>0,INDEX(Poeng!$A$1:$B$100,N5,2),\"\")","v":80},4,{"$f":"IF(P5>0,INDEX(Poeng!$A$1:$B$100,P5,2),\"\")","v":50},80,80,0,0,80,50,{"$f":"IF(#REF!>0,#REF!,0)","v":{"$error":"#REF!"}},80,80,80,50,290,4,29040404025,2]
[3,"Markus Rekstad","Byåsen IL",280,"F",2,{"$f":"IF(F6>0,INDEX(Poeng!$A$1:$B$100,F6,2),\"\")","v":80},5,{"$f":"IF(H6>0,INDEX(Poeng!$A$1:$B$100,H6,2),\"\")","v":45},2,{"$f":"IF(J6>0,INDEX(Poeng!$A$1:$B$100,J6,2),\"\")","v":80},3,{"$f":"IF(L6>0,INDEX(Poeng!$A$1:$B$100,L6,2),\"\")","v":60},3,{"$f":"IF(N6>0,INDEX(Poeng!$A$1:$B$100,N6,2),\"\")","v":60},3,{"$f":"IF(P6>0,INDEX(Poeng!$A$1:$B$100,P6,2),\"\")","v":60},80,45,80,60,60,60,{"$f":"IF(#REF!>0,#REF!,0)","v":{"$error":"#REF!"}},80,80,60,60,280,6,28040403030,3]
[4,"Oskar Lunde","Byåsen IL",270,"F",5,{"$f":"IF(F7>0,INDEX(Poeng!$A$1:$B$100,F7,2),\"\")","v":45},4,{"$f":"IF(H7>0,INDEX(Poeng!$A$1:$B$100,H7,2),\"\")","v":50},3,{"$f":"IF(J7>0,INDEX(Poeng!$A$1:$B$100,J7,2),\"\")","v":60},2,{"$f":"IF(L7>0,INDEX(Poeng!$A$1:$B$100,L7,2),\"\")","v":80},5,{"$f":"IF(N7>0,INDEX(Poeng!$A$1:$B$100,N7,2),\"\")","v":45},2,{"$f":"IF(P7>0,INDEX(Poeng!$A$1:$B$100,P7,2),\"\")","v":80},45,50,60,80,45,80,{"$f":"IF(#REF!>0,#REF!,0)","v":{"$error":"#REF!"}},80,80,60,50,270,6,27040403025,4]
[5,"Jacob Sæther Myrland","Byåsen IL",205,"F",11,{"$f":"IF(F8>0,INDEX(Poeng!$A$1:$B$100,F8,2),\"\")","v":24},3,{"$f":"IF(H8>0,INDEX(Poeng!$A$1:$B$100,H8,2),\"\")","v":60},4,{"$f":"IF(J8>0,INDEX(Poeng!$A$1:$B$100,J8,2),\"\")","v":50},6,{"$f":"IF(L8>0,INDEX(Poeng!$A$1:$B$100,L8,2),\"\")","v":40},4,{"$f":"IF(N8>0,INDEX(Poeng!$A$1:$B$100,N8,2),\"\")","v":50},5,{"$f":"IF(P8>0,INDEX(Poeng!$A$1:$B$100,P8,2),\"\")","v":45},24,60,50,40,50,45,{"$f":"IF(#REF!>0,#REF!,0)","v":{"$error":"#REF!"}},60,50,50,45,205,6,20530252522.5,5]
[6,"Filip Bjørgen Leinslie","Lundamo IL",176,"F",6,{"$f":"IF(F9>0,INDEX(Poeng!$A$1:$B$100,F9,2),\"\")","v":40},null,{"$f":"IF(H9>0,INDEX(Poeng!$A$1:$B$100,H9,2),\"\")","v":""},null,{"$f":"IF(J9>0,INDEX(Poeng!$A$1:$B$100,J9,2),\"\")","v":""},3,{"$f":"IF(L9>0,INDEX(Poeng!$A$1:$B$100,L9,2),\"\")","v":60},7,{"$f":"IF(N9>0,INDEX(Poeng!$A$1:$B$100,N9,2),\"\")","v":36},6,{"$f":"IF(P9>0,INDEX(Poeng!$A$1:$B$100,P9,2),\"\")","v":40},40,0,0,60,36,40,{"$f":"IF(#REF!>0,#REF!,0)","v":{"$error":"#REF!"}},60,40,40,36,176,4,17630202018,6]
[7,"Linus Stjern Strand","Byåsen IL",176,"F",4,{"$f":"IF(F10>0,INDEX(Poeng!$A$1:$B$100,F10,2),\"\")","v":50},5,{"$f":"IF(H10>0,INDEX(Poeng!$A$1:$B$100,H10,2),\"\")","v":45},7,{"$f":"IF(J10>0,INDEX(Poeng!$A$1:$B$100,J10,2),\"\")","v":36},5,{"$f":"IF(L10>0,INDEX(Poeng!$A$1:$B$100,L10,2),\"\")","v":45},null,{"$f":"IF(N10>0,INDEX(Poeng!$A$1:$B$100,N10,2),\"\")","v":""},null,{"$f":"IF(P10>0,INDEX(Poeng!$A$1:$B$100,P10,2),\"\")","v":""},50,45,36,45,0,0,{"$f":"IF(#REF!>0,#REF!,0)","v":{"$error":"#REF!"}},50,45,45,36,176,4,17625227268,7]
[8,"Fredrik Aune Aakerli","Heimdal Ski",153,"F",8,{"$f":"IF(F11>0,INDEX(Poeng!$A$1:$B$100,F11,2),\"\")","v":32},7,{"$f":"IF(H11>0,INDEX(Poeng!$A$1:$B$100,H11,2),\"\")","v":36},5,{"$f":"IF(J11>0,INDEX(Poeng!$A$1:$B$100,J11,2),\"\")","v":45},12,{"$f":"IF(L11>0,INDEX(Poeng!$A$1:$B$100,L11,2),\"\")","v":22},6,{"$f":"IF(N11>0,INDEX(Poeng!$A$1:$B$100,N11,2),\"\")","v":40},8,{"$f":"IF(P11>0,INDEX(Poeng!$A$1:$B$100,P11,2),\"\")","v":32},32,36,45,22,40,32,{"$f":"IF(#REF!>0,#REF!,0)","v":{"$error":"#REF!"}},45,40,36,32,153,6,15322701816,8]
[9,"Ole Christopher Gaddass Sand","Strindheim IL ",120,"F",7,{"$f":"IF(F12>0,INDEX(Poeng!$A$1:$B$100,F12,2),\"\")","v":36},11,{"$f":"IF(H12>0,INDEX(Poeng!$A$1:$B$100,H12,2),\"\")","v":24},10,{"$f":"IF(J12>0,INDEX(Poeng!$A$1:$B$100,J12,2),\"\")","v":26},8,{"$f":"IF(L12>0,INDEX(Poeng!$A$1:$B$100,L12,2),\"\")","v":32},12,{"$f":"IF(N12>0,INDEX(Poeng!$A$1:$B$100,N12,2),\"\")","v":22},10,{"$f":"IF(P12>0,INDEX(Poeng!$A$1:$B$100,P12,2),\"\")","v":26},36,24,26,32,22,26,{"$f":"IF(#REF!>0,#REF!,0)","v":{"$error":"#REF!"}},36,32,26,26,120,6,12018161313,9]
[10,"Markus Almås","Byåsen IL",119,"F",10,{"$f":"IF(F13>0,INDEX(Poeng!$A$1:$B$100,F13,2),\"\")","v":26},8,{"$f":"IF(H13>0,INDEX(Poeng!$A$1:$B$100,H13,2),\"\")","v":32},8,{"$f":"IF(J13>0,INDEX(Poeng!$A$1:$B$100,J13,2),\"\")","v":32},10,{"$f":"IF(L13>0,INDEX(Poeng!$A$1:$B$100,L13,2),\"\")","v":26},10,{"$f":"IF(N13>0,INDEX(Poeng!$A$1:$B$100,N13,2),\"\")","v":26},9,{"$f":"IF(P13>0,INDEX(Poeng!$A$1:$B$100,P13,2),\"\")","v":29},26,32,32,26,26,29,{"$f":"IF(#REF!>0,#REF!,0)","v":{"$error":"#REF!"}},32,32,29,26,119,6,11916161463,10]
[11,"Henrik Sæterbø Nielsen","Strindheim IL ",109,"F",12,{"$f":"IF(F14>0,INDEX(Poeng!$A$1:$B$100,F14,2),\"\")","v":22},9,{"$f":"IF(H14>0,INDEX(Poeng!$A$1:$B$100,H14,2),\"\")","v":29},12,{"$f":"IF(J14>0,INDEX(Poeng!$A$1:$B$100,J14,2),\"\")","v":22},7,{"$f":"IF(L14>0,INDEX(Poeng!$A$1:$B$100,L14,2),\"\")","v":36},16,{"$f":"IF(N14>0,INDEX(Poeng!$A$1:$B$100,N14,2),\"\")","v":15},12,{"$f":"IF(P14>0,INDEX(Poeng!$A$1:$B$100,P14,2),\"\")","v":22},22,29,22,36,15,22,{"$f":"IF(#REF!>0,#REF!,0)","v":{"$error":"#REF!"}},36,29,22,22,109,6,10918146111,11]
[12,"Vegard Sundal","Byåsen IL",105,"F",null,{"$f":"IF(F15>0,INDEX(Poeng!$A$1:$B$100,F15,2),\"\")","v":""},13,{"$f":"IF(H15>0,INDEX(Poeng!$A$1:$B$100,H15,2),\"\")","v":20},9,{"$f":"IF(J15>0,INDEX(Poeng!$A$1:$B$100,J15,2),\"\")","v":29},14,{"$f":"IF(L15>0,INDEX(Poeng!$A$1:$B$100,L15,2),\"\")","v":18},8,{"$f":"IF(N15>0,INDEX(Poeng!$A$1:$B$100,N15,2),\"\")","v":32},11,{"$f":"IF(P15>0,INDEX(Poeng!$A$1:$B$100,P15,2),\"\")","v":24},0,20,29,18,32,24,{"$f":"IF(#REF!>0,#REF!,0)","v":{"$error":"#REF!"}},32,29,24,20,105,5,10516146210,12]
[13,"Magnus Lande","Byåsen IL",102,"F",14,{"$f":"IF(F16>0,INDEX(Poeng!$A$1:$B$100,F16,2),\"\")","v":18},10,{"$f":"IF(H16>0,INDEX(Poeng!$A$1:$B$100,H16,2),\"\")","v":26},13,{"$f":"IF(J16>0,INDEX(Poeng!$A$1:$B$100,J16,2),\"\")","v":20},11,{"$f":"IF(L16>0,INDEX(Poeng!$A$1:$B$100,L16,2),\"\")","v":24},8,{"$f":"IF(N16>0,INDEX(Poeng!$A$1:$B$100,N16,2),\"\")","v":32},13,{"$f":"IF(P16>0,INDEX(Poeng!$A$1:$B$100,P16,2),\"\")","v":20},18,26,20,24,32,20,{"$f":"IF(#REF!>0,#REF!,0)","v":{"$error":"#REF!"}},32,26,24,20,102,6,10216131210,13]
[14,"Benjamin Finanger","Leik, IL",97,"F",13,{"$f":"IF(F17>0,INDEX(Poeng!$A$1:$B$100,F17,2),\"\")","v":20},11,{"$f":"IF(H17>0,INDEX(Poeng!$A$1:$B$100,H17,2),\"\")","v":24},11,{"$f":"IF(J17>0,INDEX(Poeng!$A$1:$B$100,J17,2),\"\")","v":24},9,{"$f":"IF(L17>0,INDEX(Poeng!$A$1:$B$100,L17,2),\"\")","v":29},null,{"$f":"IF(N17>0,INDEX(Poeng!$A$1:$B$100,N17,2),\"\")","v":""},null,{"$f":"IF(P17>0,INDEX(Poeng!$A$1:$B$100,P17,2),\"\")","v":""},20,24,24,29,0,0,{"$f":"IF(#REF!>0,#REF!,0)","v":{"$error":"#REF!"}},29,24,24,20,97,4,9714621210,14]
[15,"Tobias Bergquist Reitan","Byåsen IL",76," ",null,{"$f":"IF(F18>0,INDEX(Poeng!$A$1:$B$100,F18,2),\"\")","v":""},null,{"$f":"IF(H18>0,INDEX(Poeng!$A$1:$B$100,H18,2),\"\")","v":""},6,{"$f":"IF(J18>0,INDEX(Poeng!$A$1:$B$100,J18,2),\"\")","v":40},null,{"$f":"IF(L18>0,INDEX(Poeng!$A$1:$B$100,L18,2),\"\")","v":""},null,{"$f":"IF(N18>0,INDEX(Poeng!$A$1:$B$100,N18,2),\"\")","v":""},7,{"$f":"IF(P18>0,INDEX(Poeng!$A$1:$B$100,P18,2),\"\")","v":36},0,0,40,0,0,36,{"$f":"IF(#REF!>0,#REF!,0)","v":{"$error":"#REF!"}},40,36,0,0,76,2,7620180000,15]
[16,"Ola Slind","Selbu IL",68,"F",22,{"$f":"IF(F19>0,INDEX(Poeng!$A$1:$B$100,F19,2),\"\")","v":9},15,{"$f":"IF(H19>0,INDEX(Poeng!$A$1:$B$100,H19,2),\"\")","v":16},17,{"$f":"IF(J19>0,INDEX(Poeng!$A$1:$B$100,J19,2),\"\")","v":14},null,{"$f":"IF(L19>0,INDEX(Poeng!$A$1:$B$100,L19,2),\"\")","v":""},11,{"$f":"IF(N19>0,INDEX(Poeng!$A$1:$B$100,N19,2),\"\")","v":24},17,{"$f":"IF(P19>0,INDEX(Poeng!$A$1:$B$100,P19,2),\"\")","v":14},9,16,14,0,24,14,{"$f":"IF(#REF!>0,#REF!,0)","v":{"$error":"#REF!"}},24,16,14,14,68,5,6812080707,16]
[17,"Teodor Thorsø","Heimdal Ski",68,"F",16,{"$f":"IF(F20>0,INDEX(Poeng!$A$1:$B$100,F20,2),\"\")","v":15},16,{"$f":"IF(H20>0,INDEX(Poeng!$A$1:$B$100,H20,2),\"\")","v":15},15,{"$f":"IF(J20>0,INDEX(Poeng!$A$1:$B$100,J20,2),\"\")","v":16},15,{"$f":"IF(L20>0,INDEX(Poeng!$A$1:$B$100,L20,2),\"\")","v":16},14,{"$f":"IF(N20>0,INDEX(Poeng!$A$1:$B$100,N20,2),\"\")","v":18},14,{"$f":"IF(P20>0,INDEX(Poeng!$A$1:$B$100,P20,2),\"\")","v":18},15,15,16,16,18,18,{"$f":"IF(#REF!>0,#REF!,0)","v":{"$error":"#REF!"}},18,18,16,16,68,6,6809090808,17]
[18,"Oliver Vatterholm Jernberg","Byaasen Skiklub",55,"F",21,{"$f":"IF(F21>0,INDEX(Poeng!$A$1:$B$100,F21,2),\"\")","v":10},18,{"$f":"IF(H21>0,INDEX(Poeng!$A$1:$B$100,H21,2),\"\")","v":13},19,{"$f":"IF(J21>0,INDEX(Poeng!$A$1:$B$100,J21,2),\"\")","v":12},17,{"$f":"IF(L21>0,INDEX(Poeng!$A$1:$B$100,L21,2),\"\")","v":14},15,{"$f":"IF(N21>0,INDEX(Poeng!$A$1:$B$100,N21,2),\"\")","v":16},20,{"$f":"IF(P21>0,INDEX(Poeng!$A$1:$B$100,P21,2),\"\")","v":11},10,13,12,14,16,11,{"$f":"IF(#REF!>0,#REF!,0)","v":{"$error":"#REF!"}},16,14,13,12,55,6,5508070656,18]
[19,"Vegard Aasbø","Surnadal IL",51," ",null,{"$f":"IF(F22>0,INDEX(Poeng!$A$1:$B$100,F22,2),\"\")","v":""},14,{"$f":"IF(H22>0,INDEX(Poeng!$A$1:$B$100,H22,2),\"\")","v":18},null,{"$f":"IF(J22>0,INDEX(Poeng!$A$1:$B$100,J22,2),\"\")","v":""},13,{"$f":"IF(L22>0,INDEX(Poeng!$A$1:$B$100,L22,2),\"\")","v":20},null,{"$f":"IF(N22>0,INDEX(Poeng!$A$1:$B$100,N22,2),\"\")","v":""},18,{"$f":"IF(P22>0,INDEX(Poeng!$A$1:$B$100,P22,2),\"\")","v":13},0,18,0,20,0,13,{"$f":"IF(#REF!>0,#REF!,0)","v":{"$error":"#REF!"}},20,18,13,0,51,3,5110090650,19]
[20,"William Holsing Kottum","Heimdal Ski",49,"F",24,{"$f":"IF(F23>0,INDEX(Poeng!$A$1:$B$100,F23,2),\"\")","v":7},19,{"$f":"IF(H23>0,INDEX(Poeng!$A$1:$B$100,H23,2),\"\")","v":12},20,{"$f":"IF(J23>0,INDEX(Poeng!$A$1:$B$100,J23,2),\"\")","v":11},18,{"$f":"IF(L23>0,INDEX(Poeng!$A$1:$B$100,L23,2),\"\")","v":13},18,{"$f":"IF(N23>0,INDEX(Poeng!$A$1:$B$100,N23,2),\"\")","v":13},25,{"$f":"IF(P23>0,INDEX(Poeng!$A$1:$B$100,P23,2),\"\")","v":6},7,12,11,13,13,6,{"$f":"IF(#REF!>0,#REF!,0)","v":{"$error":"#REF!"}},13,13,12,11,49,6,4906565605.5,20]
[21,"Torstein Aam","Byåsen IL",36," ",null,{"$f":"IF(F24>0,INDEX(Poeng!$A$1:$B$100,F24,2),\"\")","v":""},null,{"$f":"IF(H24>0,INDEX(Poeng!$A$1:$B$100,H24,2),\"\")","v":""},null,{"$f":"IF(J24>0,INDEX(Poeng!$A$1:$B$100,J24,2),\"\")","v":""},null,{"$f":"IF(L24>0,INDEX(Poeng!$A$1:$B$100,L24,2),\"\")","v":""},13,{"$f":"IF(N24>0,INDEX(Poeng!$A$1:$B$100,N24,2),\"\")","v":20},15,{"$f":"IF(P24>0,INDEX(Poeng!$A$1:$B$100,P24,2),\"\")","v":16},0,0,0,0,20,16,{"$f":"IF(#REF!>0,#REF!,0)","v":{"$error":"#REF!"}},20,16,0,0,36,2,3610080000,21]
[22,"Nikolai Fosli","Hommelvik IL",30," ",null,{"$f":"IF(F25>0,INDEX(Poeng!$A$1:$B$100,F25,2),\"\")","v":""},null,{"$f":"IF(H25>0,INDEX(Poeng!$A$1:$B$100,H25,2),\"\")","v":""},14,{"$f":"IF(J25>0,INDEX(Poeng!$A$1:$B$100,J25,2),\"\")","v":18},null,{"$f":"IF(L25>0,INDEX(Poeng!$A$1:$B$100,L25,2),\"\")","v":""},null,{"$f":"IF(N25>0,INDEX(Poeng!$A$1:$B$100,N25,2),\"\")","v":""},19,{"$f":"IF(P25>0,INDEX(Poeng!$A$1:$B$100,P25,2),\"\")","v":12},0,0,18,0,0,12,{"$f":"IF(#REF!>0,#REF!,0)","v":{"$error":"#REF!"}},18,12,0,0,30,2,3009060000,22]
[23,"Mathias Reinertsen Leroyer","Byaasen Skiklub",29," ",9,{"$f":"IF(F26>0,INDEX(Poeng!$A$1:$B$100,F26,2),\"\")","v":29},null,{"$f":"IF(H26>0,INDEX(Poeng!$A$1:$B$100,H26,2),\"\")","v":""},null,{"$f":"IF(J26>0,INDEX(Poeng!$A$1:$B$100,J26,2),\"\")","v":""},null,{"$f":"IF(L26>0,INDEX(Poeng!$A$1:$B$100,L26,2),\"\")","v":""},null,{"$f":"IF(N26>0,INDEX(Poeng!$A$1:$B$100,N26,2),\"\")","v":""},null,{"$f":"IF(P26>0,INDEX(Poeng!$A$1:$B$100,P26,2),\"\")","v":""},29,0,0,0,0,0,{"$f":"IF(#REF!>0,#REF!,0)","v":{"$error":"#REF!"}},29,0,0,0,29,1,2914500000,23]
[24,"Aksel Vetlesen","Strindheim IL ",28," ",18,{"$f":"IF(F27>0,INDEX(Poeng!$A$1:$B$100,F27,2),\"\")","v":13},null,{"$f":"IF(H27>0,INDEX(Poeng!$A$1:$B$100,H27,2),\"\")","v":""},null,{"$f":"IF(J27>0,INDEX(Poeng!$A$1:$B$100,J27,2),\"\")","v":""},null,{"$f":"IF(L27>0,INDEX(Poeng!$A$1:$B$100,L27,2),\"\")","v":""},null,{"$f":"IF(N27>0,INDEX(Poeng!$A$1:$B$100,N27,2),\"\")","v":""},16,{"$f":"IF(P27>0,INDEX(Poeng!$A$1:$B$100,P27,2),\"\")","v":15},13,0,0,0,0,15,{"$f":"IF(#REF!>0,#REF!,0)","v":{"$error":"#REF!"}},15,13,0,0,28,2,2807565000,24]
[25,"Mats Nergård","Orkdal IL",26," ",20,{"$f":"IF(F28>0,INDEX(Poeng!$A$1:$B$100,F28,2),\"\")","v":11},null,{"$f":"IF(H28>0,INDEX(Poeng!$A$1:$B$100,H28,2),\"\")","v":""},null,{"$f":"IF(J28>0,INDEX(Poeng!$A$1:$B$100,J28,2),\"\")","v":""},16,{"$f":"IF(L28>0,INDEX(Poeng!$A$1:$B$100,L28,2),\"\")","v":15},null,{"$f":"IF(N28>0,INDEX(Poeng!$A$1:$B$100,N28,2),\"\")","v":""},null,{"$f":"IF(P28>0,INDEX(Poeng!$A$1:$B$100,P28,2),\"\")","v":""},11,0,0,15,0,0,{"$f":"IF(#REF!>0,#REF!,0)","v":{"$error":"#REF!"}},15,11,0,0,26,2,2607555000,25]
[26,"Lasse Elvebakk","Byåsen Skiklubb",24," ",null,{"$f":"IF(F29>0,INDEX(Poeng!$A$1:$B$100,F29,2),\"\")","v":""},null,{"$f":"IF(H29>0,INDEX(Poeng!$A$1:$B$100,H29,2),\"\")","v":""},null,{"$f":"IF(J29>0,INDEX(Poeng!$A$1:$B$100,J29,2),\"\")","v":""},null,{"$f":"IF(L29>0,INDEX(Poeng!$A$1:$B$100,L29,2),\"\")","v":""},17,{"$f":"IF(N29>0,INDEX(Poeng!$A$1:$B$100,N29,2),\"\")","v":14},21,{"$f":"IF(P29>0,INDEX(Poeng!$A$1:$B$100,P29,2),\"\")","v":10},0,0,0,0,14,10,{"$f":"IF(#REF!>0,#REF!,0)","v":{"$error":"#REF!"}},14,10,0,0,24,2,2407050000,26]
[27,"Iver-Martin Kjørsvik Fossen","Hommelvik IL",18," ",null,{"$f":"IF(F30>0,INDEX(Poeng!$A$1:$B$100,F30,2),\"\")","v":""},null,{"$f":"IF(H30>0,INDEX(Poeng!$A$1:$B$100,H30,2),\"\")","v":""},18,{"$f":"IF(J30>0,INDEX(Poeng!$A$1:$B$100,J30,2),\"\")","v":13},null,{"$f":"IF(L30>0,INDEX(Poeng!$A$1:$B$100,L30,2),\"\")","v":""},null,{"$f":"IF(N30>0,INDEX(Poeng!$A$1:$B$100,N30,2),\"\")","v":""},26,{"$f":"IF(P30>0,INDEX(Poeng!$A$1:$B$100,P30,2),\"\")","v":5},0,0,13,0,0,5,{"$f":"IF(#REF!>0,#REF!,0)","v":{"$error":"#REF!"}},13,5,0,0,18,2,1806525000,27]
[28,"Ola Øvstedal Brenna","Byaasen Skiklub",16," ",15,{"$f":"IF(F31>0,INDEX(Poeng!$A$1:$B$100,F31,2),\"\")","v":16},null,{"$f":"IF(H31>0,INDEX(Poeng!$A$1:$B$100,H31,2),\"\")","v":""},null,{"$f":"IF(J31>0,INDEX(Poeng!$A$1:$B$100,J31,2),\"\")","v":""},null,{"$f":"IF(L31>0,INDEX(Poeng!$A$1:$B$100,L31,2),\"\")","v":""},null,{"$f":"IF(N31>0,INDEX(Poeng!$A$1:$B$100,N31,2),\"\")","v":""},null,{"$f":"IF(P31>0,INDEX(Poeng!$A$1:$B$100,P31,2),\"\")","v":""},16,0,0,0,0,0,{"$f":"IF(#REF!>0,#REF!,0)","v":{"$error":"#REF!"}},16,0,0,0,16,1,1608000000,28]
[29,"Andreas Sørnes","Hommelvik IL",15," ",null,{"$f":"IF(F32>0,INDEX(Poeng!$A$1:$B$100,F32,2),\"\")","v":""},null,{"$f":"IF(H32>0,INDEX(Poeng!$A$1:$B$100,H32,2),\"\")","v":""},16,{"$f":"IF(J32>0,INDEX(Poeng!$A$1:$B$100,J32,2),\"\")","v":15},null,{"$f":"IF(L32>0,INDEX(Poeng!$A$1:$B$100,L32,2),\"\")","v":""},null,{"$f":"IF(N32>0,INDEX(Poeng!$A$1:$B$100,N32,2),\"\")","v":""},null,{"$f":"IF(P32>0,INDEX(Poeng!$A$1:$B$100,P32,2),\"\")","v":""},0,0,15,0,0,0,{"$f":"IF(#REF!>0,#REF!,0)","v":{"$error":"#REF!"}},15,0,0,0,15,1,1507500000,29]
[30,"Eivind Ekle-Danielsen","Strindheim IL ",15," ",23,{"$f":"IF(F33>0,INDEX(Poeng!$A$1:$B$100,F33,2),\"\")","v":8},null,{"$f":"IF(H33>0,INDEX(Poeng!$A$1:$B$100,H33,2),\"\")","v":""},null,{"$f":"IF(J33>0,INDEX(Poeng!$A$1:$B$100,J33,2),\"\")","v":""},null,{"$f":"IF(L33>0,INDEX(Poeng!$A$1:$B$100,L33,2),\"\")","v":""},null,{"$f":"IF(N33>0,INDEX(Poeng!$A$1:$B$100,N33,2),\"\")","v":""},24,{"$f":"IF(P33>0,INDEX(Poeng!$A$1:$B$100,P33,2),\"\")","v":7},8,0,0,0,0,7,{"$f":"IF(#REF!>0,#REF!,0)","v":{"$error":"#REF!"}},8,7,0,0,15,2,1504035000,30]
[31,"Alvin Le","Byåsen IL",14," ",null,{"$f":"IF(F34>0,INDEX(Poeng!$A$1:$B$100,F34,2),\"\")","v":""},17,{"$f":"IF(H34>0,INDEX(Poeng!$A$1:$B$100,H34,2),\"\")","v":14},null,{"$f":"IF(J34>0,INDEX(Poeng!$A$1:$B$100,J34,2),\"\")","v":""},null,{"$f":"IF(L34>0,INDEX(Poeng!$A$1:$B$100,L34,2),\"\")","v":""},null,{"$f":"IF(N34>0,INDEX(Poeng!$A$1:$B$100,N34,2),\"\")","v":""},null,{"$f":"IF(P34>0,INDEX(Poeng!$A$1:$B$100,P34,2),\"\")","v":""},{"$f":"IF(F34>0,G34,0)","v":0},{"$f":"IF(H34>0,I34,0)","v":14},{"$f":"IF(J34>0,K34,0)","v":0},{"$f":"IF(L34>0,M34,0)","v":0},{"$f":"IF(N34>0,O34,0)","v":0},{"$f":"IF(P34>0,Q34,0)","v":0},{"$f":"IF(#REF!>0,#REF!,0)","v":{"$error":"#REF!"}},{"$f":"LARGE(R34:W34,1)","v":14},{"$f":"LARGE(R34:W34,2)","v":0},{"$f":"LARGE(R34:W34,3)","v":0},{"$f":"LARGE(R34:W34,4)","v":0},{"$f":"SUM(Y34:AB34)","v":14},{"$f":"COUNT(F34:Q34)/2","v":1},{"$f":"AC34*10^8+Y34*10^6/2+Z34*10^4/2+AA34*10^2/2+AB34/2","v":1407000000},31]
[31,"Dagfinn Stenvik","Byåsen IL",14," ",17,{"$f":"IF(F35>0,INDEX(Poeng!$A$1:$B$100,F35,2),\"\")","v":14},null,{"$f":"IF(H35>0,INDEX(Poeng!$A$1:$B$100,H35,2),\"\")","v":""},null,{"$f":"IF(J35>0,INDEX(Poeng!$A$1:$B$100,J35,2),\"\")","v":""},null,{"$f":"IF(L35>0,INDEX(Poeng!$A$1:$B$100,L35,2),\"\")","v":""},null,{"$f":"IF(N35>0,INDEX(Poeng!$A$1:$B$100,N35,2),\"\")","v":""},null,{"$f":"IF(P35>0,INDEX(Poeng!$A$1:$B$100,P35,2),\"\")","v":""},14,0,0,0,0,0,{"$f":"IF(#REF!>0,#REF!,0)","v":{"$error":"#REF!"}},14,0,0,0,14,1,1407000000,31]
[33,"Konrad Rottem Henriksen","Sjetne IL",14," ",25,{"$f":"IF(F36>0,INDEX(Poeng!$A$1:$B$100,F36,2),\"\")","v":6},null,{"$f":"IF(H36>0,INDEX(Poeng!$A$1:$B$100,H36,2),\"\")","v":""},null,{"$f":"IF(J36>0,INDEX(Poeng!$A$1:$B$100,J36,2),\"\")","v":""},null,{"$f":"IF(L36>0,INDEX(Poeng!$A$1:$B$100,L36,2),\"\")","v":""},null,{"$f":"IF(N36>0,INDEX(Poeng!$A$1:$B$100,N36,2),\"\")","v":""},23,{"$f":"IF(P36>0,INDEX(Poeng!$A$1:$B$100,P36,2),\"\")","v":8},6,0,0,0,0,8,{"$f":"IF(#REF!>0,#REF!,0)","v":{"$error":"#REF!"}},8,6,0,0,14,2,1404030000,{"$f":"IF(B36<>\"\",RANK(AE36,AE$4:AE$41,0),\"\")","v":33}]
[34,"Adrian Hepsøe","Strindheim IL ",12," ",19,{"$f":"IF(F37>0,INDEX(Poeng!$A$1:$B$100,F37,2),\"\")","v":12},null,{"$f":"IF(H37>0,INDEX(Poeng!$A$1:$B$100,H37,2),\"\")","v":""},null,{"$f":"IF(J37>0,INDEX(Poeng!$A$1:$B$100,J37,2),\"\")","v":""},null,{"$f":"IF(L37>0,INDEX(Poeng!$A$1:$B$100,L37,2),\"\")","v":""},null,{"$f":"IF(N37>0,INDEX(Poeng!$A$1:$B$100,N37,2),\"\")","v":""},null,{"$f":"IF(P37>0,INDEX(Poeng!$A$1:$B$100,P37,2),\"\")","v":""},12,0,0,0,0,0,{"$f":"IF(#REF!>0,#REF!,0)","v":{"$error":"#REF!"}},12,0,0,0,12,1,1206000000,34]
[35,"Eirik Owesen Eidem","Melhus IL",11," ",null,{"$f":"IF(F38>0,INDEX(Poeng!$A$1:$B$100,F38,2),\"\")","v":""},20,{"$f":"IF(H38>0,INDEX(Poeng!$A$1:$B$100,H38,2),\"\")","v":11},null,{"$f":"IF(J38>0,INDEX(Poeng!$A$1:$B$100,J38,2),\"\")","v":""},null,{"$f":"IF(L38>0,INDEX(Poeng!$A$1:$B$100,L38,2),\"\")","v":""},null,{"$f":"IF(N38>0,INDEX(Poeng!$A$1:$B$100,N38,2),\"\")","v":""},null,{"$f":"IF(P38>0,INDEX(Poeng!$A$1:$B$100,P38,2),\"\")","v":""},0,11,0,0,0,0,{"$f":"IF(#REF!>0,#REF!,0)","v":{"$error":"#REF!"}},11,0,0,0,11,1,1105500000,35]
[36,"Gabriel Piotrowski Svane","Hommelvik IL",10," ",null,{"$f":"IF(F39>0,INDEX(Poeng!$A$1:$B$100,F39,2),\"\")","v":""},null,{"$f":"IF(H39>0,INDEX(Poeng!$A$1:$B$100,H39,2),\"\")","v":""},21,{"$f":"IF(J39>0,INDEX(Poeng!$A$1:$B$100,J39,2),\"\")","v":10},null,{"$f":"IF(L39>0,INDEX(Poeng!$A$1:$B$100,L39,2),\"\")","v":""},null,{"$f":"IF(N39>0,INDEX(Poeng!$A$1:$B$100,N39,2),\"\")","v":""},null,{"$f":"IF(P39>0,INDEX(Poeng!$A$1:$B$100,P39,2),\"\")","v":""},0,0,10,0,0,0,{"$f":"IF(#REF!>0,#REF!,0)","v":{"$error":"#REF!"}},10,0,0,0,10,1,1005000000,36]
[37,"Magnus Berg Evjen","Hommelvik IL",9," ",null,{"$f":"IF(F40>0,INDEX(Poeng!$A$1:$B$100,F40,2),\"\")","v":""},null,{"$f":"IF(H40>0,INDEX(Poeng!$A$1:$B$100,H40,2),\"\")","v":""},22,{"$f":"IF(J40>0,INDEX(Poeng!$A$1:$B$100,J40,2),\"\")","v":9},null,{"$f":"IF(L40>0,INDEX(Poeng!$A$1:$B$100,L40,2),\"\")","v":""},null,{"$f":"IF(N40>0,INDEX(Poeng!$A$1:$B$100,N40,2),\"\")","v":""},null,{"$f":"IF(P40>0,INDEX(Poeng!$A$1:$B$100,P40,2),\"\")","v":""},0,0,9,0,0,0,{"$f":"IF(#REF!>0,#REF!,0)","v":{"$error":"#REF!"}},9,0,0,0,9,1,904500000,37]
[37,"Leander Østmo Dalheim","Byaasen Skiklub",9," ",null,{"$f":"IF(F41>0,INDEX(Poeng!$A$1:$B$100,F41,2),\"\")","v":""},null,{"$f":"IF(H41>0,INDEX(Poeng!$A$1:$B$100,H41,2),\"\")","v":""},null,{"$f":"IF(J41>0,INDEX(Poeng!$A$1:$B$100,J41,2),\"\")","v":""},null,{"$f":"IF(L41>0,INDEX(Poeng!$A$1:$B$100,L41,2),\"\")","v":""},null,{"$f":"IF(N41>0,INDEX(Poeng!$A$1:$B$100,N41,2),\"\")","v":""},22,{"$f":"IF(P41>0,INDEX(Poeng!$A$1:$B$100,P41,2),\"\")","v":9},0,0,0,0,0,9,{"$f":"IF(#REF!>0,#REF!,0)","v":{"$error":"#REF!"}},9,0,0,0,9,1,904500000,37]
[39,"Magnus Helland Grønningsæter","Sjetne IL",9," ",26,{"$f":"IF(F42>0,INDEX(Poeng!$A$1:$B$100,F42,2),\"\")","v":5},null,{"$f":"IF(H42>0,INDEX(Poeng!$A$1:$B$100,H42,2),\"\")","v":""},null,{"$f":"IF(J42>0,INDEX(Poeng!$A$1:$B$100,J42,2),\"\")","v":""},null,{"$f":"IF(L42>0,INDEX(Poeng!$A$1:$B$100,L42,2),\"\")","v":""},null,{"$f":"IF(N42>0,INDEX(Poeng!$A$1:$B$100,N42,2),\"\")","v":""},27,{"$f":"IF(P42>0,INDEX(Poeng!$A$1:$B$100,P42,2),\"\")","v":4},5,0,0,0,0,4,{"$f":"IF(#REF!>0,#REF!,0)","v":{"$error":"#REF!"}},5,4,0,0,9,2,902520000,{"$f":"IF(B42<>\"\",RANK(AE42,AE$4:AE$47,0),\"\")","v":39}]
[{"$f":"AF43","v":""},null,null,{"$f":"IF(B43<>\"\",AC43,\"\")","v":""},{"$f":"IF(AD43<4,\" \",\"F\")","v":" "},null,{"$f":"IF(F43>0,INDEX(Poeng!$A$1:$B$100,F43,2),\"\")","v":""},null,{"$f":"IF(H43>0,INDEX(Poeng!$A$1:$B$100,H43,2),\"\")","v":""},null,{"$f":"IF(J43>0,INDEX(Poeng!$A$1:$B$100,J43,2),\"\")","v":""},null,{"$f":"IF(L43>0,INDEX(Poeng!$A$1:$B$100,L43,2),\"\")","v":""},null,{"$f":"IF(N43>0,INDEX(Poeng!$A$1:$B$100,N43,2),\"\")","v":""},null,{"$f":"IF(P43>0,INDEX(Poeng!$A$1:$B$100,P43,2),\"\")","v":""},0,0,0,0,0,0,{"$f":"IF(#REF!>0,#REF!,0)","v":{"$error":"#REF!"}},0,0,0,0,0,0,0,""]
["",null,null,""," ",null,{"$f":"IF(F44>0,INDEX(Poeng!$A$1:$B$100,F44,2),\"\")","v":""},null,{"$f":"IF(H44>0,INDEX(Poeng!$A$1:$B$100,H44,2),\"\")","v":""},null,{"$f":"IF(J44>0,INDEX(Poeng!$A$1:$B$100,J44,2),\"\")","v":""},null,{"$f":"IF(L44>0,INDEX(Poeng!$A$1:$B$100,L44,2),\"\")","v":""},null,{"$f":"IF(N44>0,INDEX(Poeng!$A$1:$B$100,N44,2),\"\")","v":""},null,{"$f":"IF(P44>0,INDEX(Poeng!$A$1:$B$100,P44,2),\"\")","v":""},0,0,0,0,0,0,{"$f":"IF(#REF!>0,#REF!,0)","v":{"$error":"#REF!"}},0,0,0,0,0,0,0,""]
["",null,null,""," ",null,{"$f":"IF(F45>0,INDEX(Poeng!$A$1:$B$100,F45,2),\"\")","v":""},null,{"$f":"IF(H45>0,INDEX(Poeng!$A$1:$B$100,H45,2),\"\")","v":""},null,{"$f":"IF(J45>0,INDEX(Poeng!$A$1:$B$100,J45,2),\"\")","v":""},null,{"$f":"IF(L45>0,INDEX(Poeng!$A$1:$B$100,L45,2),\"\")","v":""},null,{"$f":"IF(N45>0,INDEX(Poeng!$A$1:$B$100,N45,2),\"\")","v":""},null,{"$f":"IF(P45>0,INDEX(Poeng!$A$1:$B$100,P45,2),\"\")","v":""},0,0,0,0,0,0,{"$f":"IF(#REF!>0,#REF!,0)","v":{"$error":"#REF!"}},0,0,0,0,0,0,0,""]
[{"$f":"AF46","v":""},null,null,{"$f":"IF(B46<>\"\",AC46,\"\")","v":""},{"$f":"IF(AD46<4,\" \",\"F\")","v":" "},null,{"$f":"IF(F46>0,INDEX(Poeng!$A$1:$B$100,F46,2),\"\")","v":""},null,{"$f":"IF(H46>0,INDEX(Poeng!$A$1:$B$100,H46,2),\"\")","v":""},null,{"$f":"IF(J46>0,INDEX(Poeng!$A$1:$B$100,J46,2),\"\")","v":""},null,{"$f":"IF(L46>0,INDEX(Poeng!$A$1:$B$100,L46,2),\"\")","v":""},null,{"$f":"IF(N46>0,INDEX(Poeng!$A$1:$B$100,N46,2),\"\")","v":""},null,{"$f":"IF(P46>0,INDEX(Poeng!$A$1:$B$100,P46,2),\"\")","v":""},0,0,0,0,0,0,{"$f":"IF(#REF!>0,#REF!,0)","v":{"$error":"#REF!"}},0,0,0,0,0,0,0,""]
["",null,null,""," ",null,{"$f":"IF(F47>0,INDEX(Poeng!$A$1:$B$100,F47,2),\"\")","v":""},null,{"$f":"IF(H47>0,INDEX(Poeng!$A$1:$B$100,H47,2),\"\")","v":""},null,{"$f":"IF(J47>0,INDEX(Poeng!$A$1:$B$100,J47,2),\"\")","v":""},null,{"$f":"IF(L47>0,INDEX(Poeng!$A$1:$B$100,L47,2),\"\")","v":""},null,{"$f":"IF(N47>0,INDEX(Poeng!$A$1:$B$100,N47,2),\"\")","v":""},null,{"$f":"IF(P47>0,INDEX(Poeng!$A$1:$B$100,P47,2),\"\")","v":""},0,0,0,0,0,0,{"$f":"IF(#REF!>0,#REF!,0)","v":{"$error":"#REF!"}},0,0,0,0,0,0,0,""]
["",null,null,""," ",null,{"$f":"IF(F48>0,INDEX(Poeng!$A$1:$B$100,F48,2),\"\")","v":""},null,{"$f":"IF(H48>0,INDEX(Poeng!$A$1:$B$100,H48,2),\"\")","v":""},null,{"$f":"IF(J48>0,INDEX(Poeng!$A$1:$B$100,J48,2),\"\")","v":""},null,{"$f":"IF(L48>0,INDEX(Poeng!$A$1:$B$100,L48,2),\"\")","v":""},null,{"$f":"IF(N48>0,INDEX(Poeng!$A$1:$B$100,N48,2),\"\")","v":""},null,{"$f":"IF(P48>0,INDEX(Poeng!$A$1:$B$100,P48,2),\"\")","v":""},0,0,0,0,0,0,{"$f":"IF(#REF!>0,#REF!,0)","v":{"$error":"#REF!"}},0,0,0,0,0,0,0,""]
["",null,null,""," ",null,{"$f":"IF(F49>0,INDEX(Poeng!$A$1:$B$100,F49,2),\"\")","v":""},null,{"$f":"IF(H49>0,INDEX(Poeng!$A$1:$B$100,H49,2),\"\")","v":""},null,{"$f":"IF(J49>0,INDEX(Poeng!$A$1:$B$100,J49,2),\"\")","v":""},null,{"$f":"IF(L49>0,INDEX(Poeng!$A$1:$B$100,L49,2),\"\")","v":""},null,{"$f":"IF(N49>0,INDEX(Poeng!$A$1:$B$100,N49,2),\"\")","v":""},null,{"$f":"IF(P49>0,INDEX(Poeng!$A$1:$B$100,P49,2),\"\")","v":""},0,0,0,0,0,0,{"$f":"IF(#REF!>0,#REF!,0)","v":{"$error":"#REF!"}},0,0,0,0,0,0,0,""]
["",null,null,""," ",null,{"$f":"IF(F50>0,INDEX(Poeng!$A$1:$B$100,F50,2),\"\")","v":""},null,{"$f":"IF(H50>0,INDEX(Poeng!$A$1:$B$100,H50,2),\"\")","v":""},null,{"$f":"IF(J50>0,INDEX(Poeng!$A$1:$B$100,J50,2),\"\")","v":""},null,{"$f":"IF(L50>0,INDEX(Poeng!$A$1:$B$100,L50,2),\"\")","v":""},null,{"$f":"IF(N50>0,INDEX(Poeng!$A$1:$B$100,N50,2),\"\")","v":""},null,{"$f":"IF(P50>0,INDEX(Poeng!$A$1:$B$100,P50,2),\"\")","v":""},0,0,0,0,0,0,{"$f":"IF(#REF!>0,#REF!,0)","v":{"$error":"#REF!"}},0,0,0,0,0,0,0,""]
["",null,null,""," ",null,{"$f":"IF(F51>0,INDEX(Poeng!$A$1:$B$100,F51,2),\"\")","v":""},null,{"$f":"IF(H51>0,INDEX(Poeng!$A$1:$B$100,H51,2),\"\")","v":""},null,{"$f":"IF(J51>0,INDEX(Poeng!$A$1:$B$100,J51,2),\"\")","v":""},null,{"$f":"IF(L51>0,INDEX(Poeng!$A$1:$B$100,L51,2),\"\")","v":""},null,{"$f":"IF(N51>0,INDEX(Poeng!$A$1:$B$100,N51,2),\"\")","v":""},null,{"$f":"IF(P51>0,INDEX(Poeng!$A$1:$B$100,P51,2),\"\")","v":""},0,0,0,0,0,0,{"$f":"IF(#REF!>0,#REF!,0)","v":{"$error":"#REF!"}},0,0,0,0,0,0,0,""]
[{"$f":"AF52","v":""},null,null,""," ",null,{"$f":"IF(F52>0,INDEX(Poeng!$A$1:$B$100,F52,2),\"\")","v":""},null,{"$f":"IF(H52>0,INDEX(Poeng!$A$1:$B$100,H52,2),\"\")","v":""},null,{"$f":"IF(J52>0,INDEX(Poeng!$A$1:$B$100,J52,2),\"\")","v":""},null,{"$f":"IF(L52>0,INDEX(Poeng!$A$1:$B$100,L52,2),\"\")","v":""},null,{"$f":"IF(N52>0,INDEX(Poeng!$A$1:$B$100,N52,2),\"\")","v":""},null,{"$f":"IF(P52>0,INDEX(Poeng!$A$1:$B$100,P52,2),\"\")","v":""},0,0,0,0,0,0,{"$f":"IF(#REF!>0,#REF!,0)","v":{"$error":"#REF!"}},0,0,0,0,0,0,0,""]
["",null,null,""," ",null,null,null,{"$f":"IF(H53>0,INDEX(Poeng!$A$1:$B$100,H53,2),\"\")","v":""},null,{"$f":"IF(J53>0,INDEX(Poeng!$A$1:$B$100,J53,2),\"\")","v":""},null,{"$f":"IF(L53>0,INDEX(Poeng!$A$1:$B$100,L53,2),\"\")","v":""},null,{"$f":"IF(N53>0,INDEX(Poeng!$A$1:$B$100,N53,2),\"\")","v":""},null,{"$f":"IF(P53>0,INDEX(Poeng!$A$1:$B$100,P53,2),\"\")","v":""},0,0,0,0,0,0,{"$f":"IF(#REF!>0,#REF!,0)","v":{"$error":"#REF!"}},0,0,0,0,0,0,0,""]
["",null,null,""," ",null,null,null,{"$f":"IF(H54>0,INDEX(Poeng!$A$1:$B$100,H54,2),\"\")","v":""},null,{"$f":"IF(J54>0,INDEX(Poeng!$A$1:$B$100,J54,2),\"\")","v":""},null,{"$f":"IF(L54>0,INDEX(Poeng!$A$1:$B$100,L54,2),\"\")","v":""},null,{"$f":"IF(N54>0,INDEX(Poeng!$A$1:$B$100,N54,2),\"\")","v":""},null,{"$f":"IF(P54>0,INDEX(Poeng!$A$1:$B$100,P54,2),\"\")","v":""},0,0,0,0,0,0,{"$f":"IF(#REF!>0,#REF!,0)","v":{"$error":"#REF!"}},0,0,0,0,0,0,0,""]
["",null,null,""," ",null,null,null,{"$f":"IF(H55>0,INDEX(Poeng!$A$1:$B$100,H55,2),\"\")","v":""},null,{"$f":"IF(J55>0,INDEX(Poeng!$A$1:$B$100,J55,2),\"\")","v":""},null,{"$f":"IF(L55>0,INDEX(Poeng!$A$1:$B$100,L55,2),\"\")","v":""},null,{"$f":"IF(N55>0,INDEX(Poeng!$A$1:$B$100,N55,2),\"\")","v":""},null,{"$f":"IF(P55>0,INDEX(Poeng!$A$1:$B$100,P55,2),\"\")","v":""},0,0,0,0,0,0,{"$f":"IF(#REF!>0,#REF!,0)","v":{"$error":"#REF!"}},0,0,0,0,0,0,0,""]
["",null,null,""," ",null,null,null,{"$f":"IF(H56>0,INDEX(Poeng!$A$1:$B$100,H56,2),\"\")","v":""},null,{"$f":"IF(J56>0,INDEX(Poeng!$A$1:$B$100,J56,2),\"\")","v":""},null,{"$f":"IF(L56>0,INDEX(Poeng!$A$1:$B$100,L56,2),\"\")","v":""},null,{"$f":"IF(N56>0,INDEX(Poeng!$A$1:$B$100,N56,2),\"\")","v":""},null,{"$f":"IF(P56>0,INDEX(Poeng!$A$1:$B$100,P56,2),\"\")","v":""},0,0,0,0,0,0,{"$f":"IF(#REF!>0,#REF!,0)","v":{"$error":"#REF!"}},0,0,0,0,0,0,0,""]
["",null,null,""," ",null,null,null,{"$f":"IF(H57>0,INDEX(Poeng!$A$1:$B$100,H57,2),\"\")","v":""},null,{"$f":"IF(J57>0,INDEX(Poeng!$A$1:$B$100,J57,2),\"\")","v":""},null,{"$f":"IF(L57>0,INDEX(Poeng!$A$1:$B$100,L57,2),\"\")","v":""},null,{"$f":"IF(N57>0,INDEX(Poeng!$A$1:$B$100,N57,2),\"\")","v":""},null,{"$f":"IF(P57>0,INDEX(Poeng!$A$1:$B$100,P57,2),\"\")","v":""},0,0,0,0,0,0,{"$f":"IF(#REF!>0,#REF!,0)","v":{"$error":"#REF!"}},0,0,0,0,0,0,0,""]
["",null,null,""," ",null,null,null,{"$f":"IF(H58>0,INDEX(Poeng!$A$1:$B$100,H58,2),\"\")","v":""},null,{"$f":"IF(J58>0,INDEX(Poeng!$A$1:$B$100,J58,2),\"\")","v":""},null,{"$f":"IF(L58>0,INDEX(Poeng!$A$1:$B$100,L58,2),\"\")","v":""},null,{"$f":"IF(N58>0,INDEX(Poeng!$A$1:$B$100,N58,2),\"\")","v":""},null,{"$f":"IF(P58>0,INDEX(Poeng!$A$1:$B$100,P58,2),\"\")","v":""},0,0,0,0,0,0,{"$f":"IF(#REF!>0,#REF!,0)","v":{"$error":"#REF!"}},0,0,0,0,0,0,0,""]
["",null,null,""," ",null,null,null,{"$f":"IF(H59>0,INDEX(Poeng!$A$1:$B$100,H59,2),\"\")","v":""},null,{"$f":"IF(J59>0,INDEX(Poeng!$A$1:$B$100,J59,2),\"\")","v":""},null,{"$f":"IF(L59>0,INDEX(Poeng!$A$1:$B$100,L59,2),\"\")","v":""},null,{"$f":"IF(N59>0,INDEX(Poeng!$A$1:$B$100,N59,2),\"\")","v":""},null,{"$f":"IF(P59>0,INDEX(Poeng!$A$1:$B$100,P59,2),\"\")","v":""},0,0,0,0,0,0,{"$f":"IF(#REF!>0,#REF!,0)","v":{"$error":"#REF!"}},0,0,0,0,0,0,0,""]
["",null,null,""," ",null,null,null,{"$f":"IF(H60>0,INDEX(Poeng!$A$1:$B$100,H60,2),\"\")","v":""},null,{"$f":"IF(J60>0,INDEX(Poeng!$A$1:$B$100,J60,2),\"\")","v":""},null,{"$f":"IF(L60>0,INDEX(Poeng!$A$1:$B$100,L60,2),\"\")","v":""},null,{"$f":"IF(N60>0,INDEX(Poeng!$A$1:$B$100,N60,2),\"\")","v":""},null,{"$f":"IF(P60>0,INDEX(Poeng!$A$1:$B$100,P60,2),\"\")","v":""},0,0,0,0,0,0,{"$f":"IF(#REF!>0,#REF!,0)","v":{"$error":"#REF!"}},0,0,0,0,0,0,0,""]
["",null,null,""," ",null,null,null,{"$f":"IF(H61>0,INDEX(Poeng!$A$1:$B$100,H61,2),\"\")","v":""},null,{"$f":"IF(J61>0,INDEX(Poeng!$A$1:$B$100,J61,2),\"\")","v":""},null,{"$f":"IF(L61>0,INDEX(Poeng!$A$1:$B$100,L61,2),\"\")","v":""},null,{"$f":"IF(N61>0,INDEX(Poeng!$A$1:$B$100,N61,2),\"\")","v":""},null,{"$f":"IF(P61>0,INDEX(Poeng!$A$1:$B$100,P61,2),\"\")","v":""},0,0,0,0,0,0,{"$f":"IF(#REF!>0,#REF!,0)","v":{"$error":"#REF!"}},0,0,0,0,0,0,0,""]
["",null,null,""," ",null,null,null,{"$f":"IF(H62>0,INDEX(Poeng!$A$1:$B$100,H62,2),\"\")","v":""},null,{"$f":"IF(J62>0,INDEX(Poeng!$A$1:$B$100,J62,2),\"\")","v":""},null,{"$f":"IF(L62>0,INDEX(Poeng!$A$1:$B$100,L62,2),\"\")","v":""},null,{"$f":"IF(N62>0,INDEX(Poeng!$A$1:$B$100,N62,2),\"\")","v":""},null,{"$f":"IF(P62>0,INDEX(Poeng!$A$1:$B$100,P62,2),\"\")","v":""},0,0,0,0,0,0,{"$f":"IF(#REF!>0,#REF!,0)","v":{"$error":"#REF!"}},0,0,0,0,0,0,0,""]
["",null,null,""," ",null,null,null,{"$f":"IF(H63>0,INDEX(Poeng!$A$1:$B$100,H63,2),\"\")","v":""},null,{"$f":"IF(J63>0,INDEX(Poeng!$A$1:$B$100,J63,2),\"\")","v":""},null,{"$f":"IF(L63>0,INDEX(Poeng!$A$1:$B$100,L63,2),\"\")","v":""},null,{"$f":"IF(N63>0,INDEX(Poeng!$A$1:$B$100,N63,2),\"\")","v":""},null,{"$f":"IF(P63>0,INDEX(Poeng!$A$1:$B$100,P63,2),\"\")","v":""},0,0,0,0,0,0,{"$f":"IF(#REF!>0,#REF!,0)","v":{"$error":"#REF!"}},0,0,0,0,0,0,0,""]
["",null,null,""," ",null,null,null,{"$f":"IF(H64>0,INDEX(Poeng!$A$1:$B$100,H64,2),\"\")","v":""},null,{"$f":"IF(J64>0,INDEX(Poeng!$A$1:$B$100,J64,2),\"\")","v":""},null,{"$f":"IF(L64>0,INDEX(Poeng!$A$1:$B$100,L64,2),\"\")","v":""},null,{"$f":"IF(N64>0,INDEX(Poeng!$A$1:$B$100,N64,2),\"\")","v":""},null,{"$f":"IF(P64>0,INDEX(Poeng!$A$1:$B$100,P64,2),\"\")","v":""},0,0,0,0,0,0,{"$f":"IF(#REF!>0,#REF!,0)","v":{"$error":"#REF!"}},0,0,0,0,0,0,0,""]
["",null,null,""," ",null,null,null,{"$f":"IF(H65>0,INDEX(Poeng!$A$1:$B$100,H65,2),\"\")","v":""},null,{"$f":"IF(J65>0,INDEX(Poeng!$A$1:$B$100,J65,2),\"\")","v":""},null,{"$f":"IF(L65>0,INDEX(Poeng!$A$1:$B$100,L65,2),\"\")","v":""},null,{"$f":"IF(N65>0,INDEX(Poeng!$A$1:$B$100,N65,2),\"\")","v":""},null,{"$f":"IF(P65>0,INDEX(Poeng!$A$1:$B$100,P65,2),\"\")","v":""},0,0,0,0,0,0,{"$f":"IF(#REF!>0,#REF!,0)","v":{"$error":"#REF!"}},0,0,0,0,0,0,0,""]
["",null,null,""," ",null,null,null,{"$f":"IF(H66>0,INDEX(Poeng!$A$1:$B$100,H66,2),\"\")","v":""},null,{"$f":"IF(J66>0,INDEX(Poeng!$A$1:$B$100,J66,2),\"\")","v":""},null,{"$f":"IF(L66>0,INDEX(Poeng!$A$1:$B$100,L66,2),\"\")","v":""},null,{"$f":"IF(N66>0,INDEX(Poeng!$A$1:$B$100,N66,2),\"\")","v":""},null,{"$f":"IF(P66>0,INDEX(Poeng!$A$1:$B$100,P66,2),\"\")","v":""},0,0,0,0,0,0,{"$f":"IF(#REF!>0,#REF!,0)","v":{"$error":"#REF!"}},0,0,0,0,{"$f":"SUM(Y66:AB66)","v":0},0,0,""]

{"sheet":"G14","index":5,"n_rows":80,"n_cols":31,"rows_kept":80,"cut":false,"hidden":false,"merged":[[0,2,0,16],[1,5,1,6],[1,7,1,8],[1,9,1,10],[1,11,1,12],[1,13,1,14],[1,15,1,16],[2,15,2,16],[2,5,2,6],[2,7,2,8],[2,9,2,10],[2,11,2,12],[2,13,2,14]]}
["Gutter 14",null,"  Sparebank1-CUP 2021"]
[null,null,null,null,null,"SP1- CUP 1 ",null,"SP1- CUP 2 ",null,"SP1- CUP 3",null,"SP1- CUP 4",null,"SP1- CUP 5",null,"SP1- CUP 6",null,"Poeng",null,null,null,null,null,"Fire beste",null,null,null,"Sum"]
["Nr","NAVN","KLUBB","POENG","Fullført","Nr.  Poeng ",null,"Nr.  Poeng ",null,"Nr.   Poeng ",null,"Nr.  Poeng ",null,"Nr.  Poeng ",null,"Nr. Poeng "]
[{"$f":"AE4","v":1},"Henrik Garmo Hov","Byåsen IL",{"$f":"IF(B4<>\"\",AB4,\"\")","v":380},{"$f":"IF(AC4<4,\" \",\"F\")","v":"F"},1,{"$f":"IF(F4>0,INDEX(Poeng!$A$1:$B$100,F4,2),\"\")","v":100},1,{"$f":"IF(H4>0,INDEX(Poeng!$A$1:$B$100,H4,2),\"\")","v":100},1,{"$f":"IF(J4>0,INDEX(Poeng!$A$1:$B$100,J4,2),\"\")","v":100},3,{"$f":"IF(L4>0,INDEX(Poeng!$A$1:$B$100,L4,2),\"\")","v":60},2,{"$f":"IF(N4>0,INDEX(Poeng!$A$1:$B$100,N4,2),\"\")","v":80},2,{"$f":"IF(P4>0,INDEX(Poeng!$A$1:$B$100,P4,2),\"\")","v":80},{"$f":"IF(F4>0,G4,0)","v":100},{"$f":"IF(H4>0,I4,0)","v":100},{"$f":"IF(J4>0,K4,0)","v":100},{"$f":"IF(L4>0,M4,0)","v":60},{"$f":"IF(N4>0,O4,0)","v":80},{"$f":"IF(P4>0,Q4,0)","v":80},{"$f":"LARGE(R4:W4,1)","v":100},{"$f":"LARGE(R4:W4,2)","v":100},{"$f":"LARGE(R4:W4,3)","v":100},{"$f":"LARGE(R4:W4,4)","v":80},{"$f":"SUM(X4:AA4)","v":380},{"$f":"COUNT(F4:Q4)/2","v":6},{"$f":"AB4*10^8+X4*10^6/2+Y4*10^4/2+Z4*10^2/2+AA4/2","v":38050505040},{"$f":"IF(B4<>\"\",RANK(AD4,AD$4:AD$55,0),\"\")","v":1}]
[1,"Iver Lund Gjerde","Byåsen IL",380,"F",2,{"$f":"IF(F5>0,INDEX(Poeng!$A$1:$B$100,F5,2),\"\")","v":80},1,{"$f":"IF(H5>0,INDEX(Poeng!$A$1:$B$100,H5,2),\"\")","v":100},5,{"$f":"IF(J5>0,INDEX(Poeng!$A$1:$B$100,J5,2),\"\")","v":45},1,{"$f":"IF(L5>0,INDEX(Poeng!$A$1:$B$100,L5,2),\"\")","v":100},1,{"$f":"IF(N5>0,INDEX(Poeng!$A$1:$B$100,N5,2),\"\")","v":100},3,{"$f":"IF(P5>0,INDEX(Poeng!$A$1:$B$100,P5,2),\"\")","v":60},80,100,45,100,100,60,100,100,100,80,380,6,38050505040,1]
[3,"Håkon Bøklep","Surnadal IL",300,"F",3,{"$f":"IF(F6>0,INDEX(Poeng!$A$1:$B$100,F6,2),\"\")","v":60},3,{"$f":"IF(H6>0,INDEX(Poeng!$A$1:$B$100,H6,2),\"\")","v":60},3,{"$f":"IF(J6>0,INDEX(Poeng!$A$1:$B$100,J6,2),\"\")","v":60},2,{"$f":"IF(L6>0,INDEX(Poeng!$A$1:$B$100,L6,2),\"\")","v":80},4,{"$f":"IF(N6>0,INDEX(Poeng!$A$1:$B$100,N6,2),\"\")","v":50},1,{"$f":"IF(P6>0,INDEX(Poeng!$A$1:$B$100,P6,2),\"\")","v":100},60,60,60,80,50,100,100,80,60,60,300,6,30050403030,3]
[4,"Jon Sæter","Byåsen IL",220,"F",8,{"$f":"IF(F7>0,INDEX(Poeng!$A$1:$B$100,F7,2),\"\")","v":32},4,{"$f":"IF(H7>0,INDEX(Poeng!$A$1:$B$100,H7,2),\"\")","v":50},2,{"$f":"IF(J7>0,INDEX(Poeng!$A$1:$B$100,J7,2),\"\")","v":80},6,{"$f":"IF(L7>0,INDEX(Poeng!$A$1:$B$100,L7,2),\"\")","v":40},5,{"$f":"IF(N7>0,INDEX(Poeng!$A$1:$B$100,N7,2),\"\")","v":45},5,{"$f":"IF(P7>0,INDEX(Poeng!$A$1:$B$100,P7,2),\"\")","v":45},32,50,80,40,45,45,80,50,45,45,220,6,22040252272.5,4]
[5,"Sondre Mæhlum Krüger","Byaasen Skiklub",200,"F",5,{"$f":"IF(F8>0,INDEX(Poeng!$A$1:$B$100,F8,2),\"\")","v":45},null,{"$f":"IF(H8>0,INDEX(Poeng!$A$1:$B$100,H8,2),\"\")","v":""},4,{"$f":"IF(J8>0,INDEX(Poeng!$A$1:$B$100,J8,2),\"\")","v":50},5,{"$f":"IF(L8>0,INDEX(Poeng!$A$1:$B$100,L8,2),\"\")","v":45},3,{"$f":"IF(N8>0,INDEX(Poeng!$A$1:$B$100,N8,2),\"\")","v":60},6,{"$f":"IF(P8>0,INDEX(Poeng!$A$1:$B$100,P8,2),\"\")","v":40},45,0,50,45,60,40,60,50,45,45,200,5,20030252272.5,5]
[6,"Andreas Sundal","Byåsen IL",176,"F",4,{"$f":"IF(F9>0,INDEX(Poeng!$A$1:$B$100,F9,2),\"\")","v":50},6,{"$f":"IF(H9>0,INDEX(Poeng!$A$1:$B$100,H9,2),\"\")","v":40},7,{"$f":"IF(J9>0,INDEX(Poeng!$A$1:$B$100,J9,2),\"\")","v":36},7,{"$f":"IF(L9>0,INDEX(Poeng!$A$1:$B$100,L9,2),\"\")","v":36},8,{"$f":"IF(N9>0,INDEX(Poeng!$A$1:$B$100,N9,2),\"\")","v":32},4,{"$f":"IF(P9>0,INDEX(Poeng!$A$1:$B$100,P9,2),\"\")","v":50},50,40,36,36,32,50,50,50,40,36,176,6,17625252018,6]
[7,"Sivert Sverklie Andreassen","Byåsen IL",161,"F",6,{"$f":"IF(F10>0,INDEX(Poeng!$A$1:$B$100,F10,2),\"\")","v":40},5,{"$f":"IF(H10>0,INDEX(Poeng!$A$1:$B$100,H10,2),\"\")","v":45},9,{"$f":"IF(J10>0,INDEX(Poeng!$A$1:$B$100,J10,2),\"\")","v":29},12,{"$f":"IF(L10>0,INDEX(Poeng!$A$1:$B$100,L10,2),\"\")","v":22},6,{"$f":"IF(N10>0,INDEX(Poeng!$A$1:$B$100,N10,2),\"\")","v":40},7,{"$f":"IF(P10>0,INDEX(Poeng!$A$1:$B$100,P10,2),\"\")","v":36},40,45,29,22,40,36,45,40,40,36,161,6,16122702018,7]
[8,"Haakon Oddebug","Kyrksæterøra IL",150,"F",9,{"$f":"IF(F11>0,INDEX(Poeng!$A$1:$B$100,F11,2),\"\")","v":29},8,{"$f":"IF(H11>0,INDEX(Poeng!$A$1:$B$100,H11,2),\"\")","v":32},null,{"$f":"IF(J11>0,INDEX(Poeng!$A$1:$B$100,J11,2),\"\")","v":""},4,{"$f":"IF(L11>0,INDEX(Poeng!$A$1:$B$100,L11,2),\"\")","v":50},7,{"$f":"IF(N11>0,INDEX(Poeng!$A$1:$B$100,N11,2),\"\")","v":36},8,{"$f":"IF(P11>0,INDEX(Poeng!$A$1:$B$100,P11,2),\"\")","v":32},29,32,0,50,36,32,50,36,32,32,150,5,15025181616,8]
[9,"Sondre Holås Sødring","Heimdal Ski",141,"F",6,{"$f":"IF(F12>0,INDEX(Poeng!$A$1:$B$100,F12,2),\"\")","v":40},9,{"$f":"IF(H12>0,INDEX(Poeng!$A$1:$B$100,H12,2),\"\")","v":29},6,{"$f":"IF(J12>0,INDEX(Poeng!$A$1:$B$100,J12,2),\"\")","v":40},8,{"$f":"IF(L12>0,INDEX(Poeng!$A$1:$B$100,L12,2),\"\")","v":32},10,{"$f":"IF(N12>0,INDEX(Poeng!$A$1:$B$100,N12,2),\"\")","v":26},10,{"$f":"IF(P12>0,INDEX(Poeng!$A$1:$B$100,P12,2),\"\")","v":26},40,29,40,32,26,26,40,40,32,29,141,6,14120201614.5,9]
[10,"Oscar Skjetlein","Byåsen IL",92,"F",11,{"$f":"IF(F13>0,INDEX(Poeng!$A$1:$B$100,F13,2),\"\")","v":24},null,{"$f":"IF(H13>0,INDEX(Poeng!$A$1:$B$100,H13,2),\"\")","v":""},null,{"$f":"IF(J13>0,INDEX(Poeng!$A$1:$B$100,J13,2),\"\")","v":""},10,{"$f":"IF(L13>0,INDEX(Poeng!$A$1:$B$100,L13,2),\"\")","v":26},11,{"$f":"IF(N13>0,INDEX(Poeng!$A$1:$B$100,N13,2),\"\")","v":24},14,{"$f":"IF(P13>0,INDEX(Poeng!$A$1:$B$100,P13,2),\"\")","v":18},24,0,0,26,24,18,26,24,24,18,92,4,9213121209,10]
[11,"Sverre Lohne- Nilsen","Hommelvik IL",91," ",null,{"$f":"IF(F14>0,INDEX(Poeng!$A$1:$B$100,F14,2),\"\")","v":""},7,{"$f":"IF(H14>0,INDEX(Poeng!$A$1:$B$100,H14,2),\"\")","v":36},10,{"$f":"IF(J14>0,INDEX(Poeng!$A$1:$B$100,J14,2),\"\")","v":26},null,{"$f":"IF(L14>0,INDEX(Poeng!$A$1:$B$100,L14,2),\"\")","v":""},9,{"$f":"IF(N14>0,INDEX(Poeng!$A$1:$B$100,N14,2),\"\")","v":29},null,{"$f":"IF(P14>0,INDEX(Poeng!$A$1:$B$100,P14,2),\"\")","v":""},0,36,26,0,29,0,36,29,26,0,91,3,9118146300,11]
[12,"Lars Skarsbakk","Malvik IL",84,"F",null,{"$f":"IF(F15>0,INDEX(Poeng!$A$1:$B$100,F15,2),\"\")","v":""},11,{"$f":"IF(H15>0,INDEX(Poeng!$A$1:$B$100,H15,2),\"\")","v":24},11,{"$f":"IF(J15>0,INDEX(Poeng!$A$1:$B$100,J15,2),\"\")","v":24},null,{"$f":"IF(L15>0,INDEX(Poeng!$A$1:$B$100,L15,2),\"\")","v":""},12,{"$f":"IF(N15>0,INDEX(Poeng!$A$1:$B$100,N15,2),\"\")","v":22},17,{"$f":"IF(P15>0,INDEX(Poeng!$A$1:$B$100,P15,2),\"\")","v":14},0,24,24,0,22,14,24,24,22,14,84,4,8412121107,12]
[13,"Jon Ingstad","Dalguten IL",77,"F",15,{"$f":"IF(F16>0,INDEX(Poeng!$A$1:$B$100,F16,2),\"\")","v":16},10,{"$f":"IF(H16>0,INDEX(Poeng!$A$1:$B$100,H16,2),\"\")","v":26},null,{"$f":"IF(J16>0,INDEX(Poeng!$A$1:$B$100,J16,2),\"\")","v":""},null,{"$f":"IF(L16>0,INDEX(Poeng!$A$1:$B$100,L16,2),\"\")","v":""},13,{"$f":"IF(N16>0,INDEX(Poeng!$A$1:$B$100,N16,2),\"\")","v":20},16,{"$f":"IF(P16>0,INDEX(Poeng!$A$1:$B$100,P16,2),\"\")","v":15},16,26,0,0,20,15,26,20,16,15,77,4,7713100807.5,13]
[14,"Sebastian Børset","Rindal IL",63," ",14,{"$f":"IF(F17>0,INDEX(Poeng!$A$1:$B$100,F17,2),\"\")","v":18},null,{"$f":"IF(H17>0,INDEX(Poeng!$A$1:$B$100,H17,2),\"\")","v":""},null,{"$f":"IF(J17>0,INDEX(Poeng!$A$1:$B$100,J17,2),\"\")","v":""},9,{"$f":"IF(L17>0,INDEX(Poeng!$A$1:$B$100,L17,2),\"\")","v":29},null,{"$f":"IF(N17>0,INDEX(Poeng!$A$1:$B$100,N17,2),\"\")","v":""},15,{"$f":"IF(P17>0,INDEX(Poeng!$A$1:$B$100,P17,2),\"\")","v":16},18,0,0,29,0,16,29,18,16,0,63,3,6314590800,14]
[15,"Ludvik Giæver-Engesmo","Byaasen Skiklub",54," ",null,{"$f":"IF(F18>0,INDEX(Poeng!$A$1:$B$100,F18,2),\"\")","v":""},null,{"$f":"IF(H18>0,INDEX(Poeng!$A$1:$B$100,H18,2),\"\")","v":""},8,{"$f":"IF(J18>0,INDEX(Poeng!$A$1:$B$100,J18,2),\"\")","v":32},null,{"$f":"IF(L18>0,INDEX(Poeng!$A$1:$B$100,L18,2),\"\")","v":""},null,{"$f":"IF(N18>0,INDEX(Poeng!$A$1:$B$100,N18,2),\"\")","v":""},12,{"$f":"IF(P18>0,INDEX(Poeng!$A$1:$B$100,P18,2),\"\")","v":22},0,0,32,0,0,22,32,22,0,0,54,2,5416110000,15]
[16,"Lukas Stilson Arstad","Strindheim IL",44," ",null,{"$f":"IF(F19>0,INDEX(Poeng!$A$1:$B$100,F19,2),\"\")","v":""},null,{"$f":"IF(H19>0,INDEX(Poeng!$A$1:$B$100,H19,2),\"\")","v":""},null,{"$f":"IF(J19>0,INDEX(Poeng!$A$1:$B$100,J19,2),\"\")","v":""},11,{"$f":"IF(L19>0,INDEX(Poeng!$A$1:$B$100,L19,2),\"\")","v":24},null,{"$f":"IF(N19>0,INDEX(Poeng!$A$1:$B$100,N19,2),\"\")","v":""},13,{"$f":"IF(P19>0,INDEX(Poeng!$A$1:$B$100,P19,2),\"\")","v":20},0,0,0,24,0,20,24,20,0,0,44,2,4412100000,16]
[17,"Jonas Hamnes Øye","Surnadal IL",34," ",null,null,null,{"$f":"IF(H20>0,INDEX(Poeng!$A$1:$B$100,H20,2),\"\")","v":""},12,{"$f":"IF(J20>0,INDEX(Poeng!$A$1:$B$100,J20,2),\"\")","v":22},null,{"$f":"IF(L20>0,INDEX(Poeng!$A$1:$B$100,L20,2),\"\")","v":""},null,{"$f":"IF(N20>0,INDEX(Poeng!$A$1:$B$100,N20,2),\"\")","v":""},19,{"$f":"IF(P20>0,INDEX(Poeng!$A$1:$B$100,P20,2),\"\")","v":12},0,0,22,0,0,12,22,12,0,0,34,2,3411060000,17]
[18,"Gustav Skei Nilsen","Trønder-Lyn IL",33," ",null,{"$f":"IF(F21>0,INDEX(Poeng!$A$1:$B$100,F21,2),\"\")","v":""},12,{"$f":"IF(H21>0,INDEX(Poeng!$A$1:$B$100,H21,2),\"\")","v":22},null,{"$f":"IF(J21>0,INDEX(Poeng!$A$1:$B$100,J21,2),\"\")","v":""},null,{"$f":"IF(L21>0,INDEX(Poeng!$A$1:$B$100,L21,2),\"\")","v":""},null,{"$f":"IF(N21>0,INDEX(Poeng!$A$1:$B$100,N21,2),\"\")","v":""},20,{"$f":"IF(P21>0,INDEX(Poeng!$A$1:$B$100,P21,2),\"\")","v":11},0,22,0,0,0,11,22,11,0,0,33,2,3311055000,18]
[19,"Markus Tørum","Selbu IL",31," ",null,{"$f":"IF(F22>0,INDEX(Poeng!$A$1:$B$100,F22,2),\"\")","v":""},null,{"$f":"IF(H22>0,INDEX(Poeng!$A$1:$B$100,H22,2),\"\")","v":""},null,{"$f":"IF(J22>0,INDEX(Poeng!$A$1:$B$100,J22,2),\"\")","v":""},null,{"$f":"IF(L22>0,INDEX(Poeng!$A$1:$B$100,L22,2),\"\")","v":""},14,{"$f":"IF(N22>0,INDEX(Poeng!$A$1:$B$100,N22,2),\"\")","v":18},18,{"$f":"IF(P22>0,INDEX(Poeng!$A$1:$B$100,P22,2),\"\")","v":13},0,0,0,0,18,13,18,13,0,0,31,2,3109065000,19]
[20,"Sven William Nevin","Byaasen Skiklub",29," ",null,{"$f":"IF(F23>0,INDEX(Poeng!$A$1:$B$100,F23,2),\"\")","v":""},null,{"$f":"IF(H23>0,INDEX(Poeng!$A$1:$B$100,H23,2),\"\")","v":""},null,{"$f":"IF(J23>0,INDEX(Poeng!$A$1:$B$100,J23,2),\"\")","v":""},null,{"$f":"IF(L23>0,INDEX(Poeng!$A$1:$B$100,L23,2),\"\")","v":""},null,{"$f":"IF(N23>0,INDEX(Poeng!$A$1:$B$100,N23,2),\"\")","v":""},9,{"$f":"IF(P23>0,INDEX(Poeng!$A$1:$B$100,P23,2),\"\")","v":29},0,0,0,0,0,29,29,0,0,0,29,1,2914500000,20]
[21,"Magnus Øyen","Rindal IL",26," ",10,{"$f":"IF(F24>0,INDEX(Poeng!$A$1:$B$100,F24,2),\"\")","v":26},null,{"$f":"IF(H24>0,INDEX(Poeng!$A$1:$B$100,H24,2),\"\")","v":""},null,{"$f":"IF(J24>0,INDEX(Poeng!$A$1:$B$100,J24,2),\"\")","v":""},null,{"$f":"IF(L24>0,INDEX(Poeng!$A$1:$B$100,L24,2),\"\")","v":""},null,{"$f":"IF(N24>0,INDEX(Poeng!$A$1:$B$100,N24,2),\"\")","v":""},null,{"$f":"IF(P24>0,INDEX(Poeng!$A$1:$B$100,P24,2),\"\")","v":""},26,0,0,0,0,0,26,0,0,0,26,1,2613000000,21]
[22,"Erlend Wirum Evensen",null,24," ",null,{"$f":"IF(F25>0,INDEX(Poeng!$A$1:$B$100,F25,2),\"\")","v":""},null,{"$f":"IF(H25>0,INDEX(Poeng!$A$1:$B$100,H25,2),\"\")","v":""},null,{"$f":"IF(J25>0,INDEX(Poeng!$A$1:$B$100,J25,2),\"\")","v":""},null,{"$f":"IF(L25>0,INDEX(Poeng!$A$1:$B$100,L25,2),\"\")","v":""},null,{"$f":"IF(N25>0,INDEX(Poeng!$A$1:$B$100,N25,2),\"\")","v":""},11,{"$f":"IF(P25>0,INDEX(Poeng!$A$1:$B$100,P25,2),\"\")","v":24},0,0,0,0,0,24,24,0,0,0,24,1,2412000000,22]
[23,"Lars Wangen","Orkdal IL",22," ",12,{"$f":"IF(F26>0,INDEX(Poeng!$A$1:$B$100,F26,2),\"\")","v":22},null,{"$f":"IF(H26>0,INDEX(Poeng!$A$1:$B$100,H26,2),\"\")","v":""},null,{"$f":"IF(J26>0,INDEX(Poeng!$A$1:$B$100,J26,2),\"\")","v":""},null,{"$f":"IF(L26>0,INDEX(Poeng!$A$1:$B$100,L26,2),\"\")","v":""},null,{"$f":"IF(N26>0,INDEX(Poeng!$A$1:$B$100,N26,2),\"\")","v":""},null,{"$f":"IF(P26>0,INDEX(Poeng!$A$1:$B$100,P26,2),\"\")","v":""},22,0,0,0,0,0,22,0,0,0,22,1,2211000000,23]
[23,"Einar Meland","Oppdal IL ",22," ",12,{"$f":"IF(F27>0,INDEX(Poeng!$A$1:$B$100,F27,2),\"\")","v":22},null,{"$f":"IF(H27>0,INDEX(Poeng!$A$1:$B$100,H27,2),\"\")","v":""},null,{"$f":"IF(J27>0,INDEX(Poeng!$A$1:$B$100,J27,2),\"\")","v":""},null,{"$f":"IF(L27>0,INDEX(Poeng!$A$1:$B$100,L27,2),\"\")","v":""},null,{"$f":"IF(N27>0,INDEX(Poeng!$A$1:$B$100,N27,2),\"\")","v":""},null,{"$f":"IF(P27>0,INDEX(Poeng!$A$1:$B$100,P27,2),\"\")","v":""},22,0,0,0,0,0,22,0,0,0,22,1,2211000000,23]
[{"$f":"AE28","v":""},null,null,{"$f":"IF(B28<>\"\",AB28,\"\")","v":""},{"$f":"IF(AC28<4,\" \",\"F\")","v":" "},null,{"$f":"IF(F28>0,INDEX(Poeng!$A$1:$B$100,F28,2),\"\")","v":""},null,{"$f":"IF(H28>0,INDEX(Poeng!$A$1:$B$100,H28,2),\"\")","v":""},null,{"$f":"IF(J28>0,INDEX(Poeng!$A$1:$B$100,J28,2),\"\")","v":""},null,{"$f":"IF(L28>0,INDEX(Poeng!$A$1:$B$100,L28,2),\"\")","v":""},null,{"$f":"IF(N28>0,INDEX(Poeng!$A$1:$B$100,N28,2),\"\")","v":""},null,{"$f":"IF(P28>0,INDEX(Poeng!$A$1:$B$100,P28,2),\"\")","v":""},0,0,0,0,0,0,0,0,0,0,0,0,0,""]
["",null,null,""," ",null,{"$f":"IF(F29>0,INDEX(Poeng!$A$1:$B$100,F29,2),\"\")","v":""},null,{"$f":"IF(H29>0,INDEX(Poeng!$A$1:$B$100,H29,2),\"\")","v":""},null,{"$f":"IF(J29>0,INDEX(Poeng!$A$1:$B$100,J29,2),\"\")","v":""},null,{"$f":"IF(L29>0,INDEX(Poeng!$A$1:$B$100,L29,2),\"\")","v":""},null,{"$f":"IF(N29>0,INDEX(Poeng!$A$1:$B$100,N29,2),\"\")","v":""},null,{"$f":"IF(P29>0,INDEX(Poeng!$A$1:$B$100,P29,2),\"\")","v":""},0,0,0,0,0,0,0,0,0,0,0,0,0,""]
["",null,null,""," ",null,{"$f":"IF(F30>0,INDEX(Poeng!$A$1:$B$100,F30,2),\"\")","v":""},null,{"$f":"IF(H30>0,INDEX(Poeng!$A$1:$B$100,H30,2),\"\")","v":""},null,{"$f":"IF(J30>0,INDEX(Poeng!$A$1:$B$100,J30,2),\"\")","v":""},null,{"$f":"IF(L30>0,INDEX(Poeng!$A$1:$B$100,L30,2),\"\")","v":""},null,{"$f":"IF(N30>0,INDEX(Poeng!$A$1:$B$100,N30,2),\"\")","v":""},null,{"$f":"IF(P30>0,INDEX(Poeng!$A$1:$B$100,P30,2),\"\")","v":""},{"$f":"IF(F30>0,G30,0)","v":0},{"$f":"IF(H30>0,I30,0)","v":0},{"$f":"IF(J30>0,K30,0)","v":0},{"$f":"IF(L30>0,M30,0)","v":0},{"$f":"IF(N30>0,O30,0)","v":0},{"$f":"IF(P30>0,Q30,0)","v":0},{"$f":"LARGE(R30:W30,1)","v":0},{"$f":"LARGE(R30:W30,2)","v":0},{"$f":"LARGE(R30:W30,3)","v":0},{"$f":"LARGE(R30:W30,4)","v":0},{"$f":"SUM(X30:AA30)","v":0},{"$f":"COUNT(F30:Q30)/2","v":0},{"$f":"AB30*10^8+X30*10^6/2+Y30*10^4/2+Z30*10^2/2+AA30/2","v":0},""]
["",null,null,""," ",null,null,null,{"$f":"IF(H31>0,INDEX(Poeng!$A$1:$B$100,H31,2),\"\")","v":""},null,{"$f":"IF(J31>0,INDEX(Poeng!$A$1:$B$100,J31,2),\"\")","v":""},null,{"$f":"IF(L31>0,INDEX(Poeng!$A$1:$B$100,L31,2),\"\")","v":""},null,{"$f":"IF(N31>0,INDEX(Poeng!$A$1:$B$100,N31,2),\"\")","v":""},null,{"$f":"IF(P31>0,INDEX(Poeng!$A$1:$B$100,P31,2),\"\")","v":""},0,0,0,0,0,0,0,0,0,0,0,0,0,""]
["",null,null,""," ",null,null,null,{"$f":"IF(H32>0,INDEX(Poeng!$A$1:$B$100,H32,2),\"\")","v":""},null,{"$f":"IF(J32>0,INDEX(Poeng!$A$1:$B$100,J32,2),\"\")","v":""},null,{"$f":"IF(L32>0,INDEX(Poeng!$A$1:$B$100,L32,2),\"\")","v":""},null,{"$f":"IF(N32>0,INDEX(Poeng!$A$1:$B$100,N32,2),\"\")","v":""},null,{"$f":"IF(P32>0,INDEX(Poeng!$A$1:$B$100,P32,2),\"\")","v":""},0,0,0,0,0,0,0,0,0,0,0,0,0,""]
["",null,null,""," ",null,null,null,{"$f":"IF(H33>0,INDEX(Poeng!$A$1:$B$100,H33,2),\"\")","v":""},null,{"$f":"IF(J33>0,INDEX(Poeng!$A$1:$B$100,J33,2),\"\")","v":""},null,{"$f":"IF(L33>0,INDEX(Poeng!$A$1:$B$100,L33,2),\"\")","v":""},null,{"$f":"IF(N33>0,INDEX(Poeng!$A$1:$B$100,N33,2),\"\")","v":""},null,{"$f":"IF(P33>0,INDEX(Poeng!$A$1:$B$100,P33,2),\"\")","v":""},0,0,0,0,0,0,0,0,0,0,0,0,0,""]
["",null,null,""," ",null,null,null,{"$f":"IF(H34>0,INDEX(Poeng!$A$1:$B$100,H34,2),\"\")","v":""},null,{"$f":"IF(J34>0,INDEX(Poeng!$A$1:$B$100,J34,2),\"\")","v":""},null,{"$f":"IF(L34>0,INDEX(Poeng!$A$1:$B$100,L34,2),\"\")","v":""},null,{"$f":"IF(N34>0,INDEX(Poeng!$A$1:$B$100,N34,2),\"\")","v":""},null,{"$f":"IF(P34>0,INDEX(Poeng!$A$1:$B$100,P34,2),\"\")","v":""},0,0,0,0,0,0,0,0,0,0,0,0,0,""]
["",null,null,""," ",null,null,null,{"$f":"IF(H35>0,INDEX(Poeng!$A$1:$B$100,H35,2),\"\")","v":""},null,{"$f":"IF(J35>0,INDEX(Poeng!$A$1:$B$100,J35,2),\"\")","v":""},null,{"$f":"IF(L35>0,INDEX(Poeng!$A$1:$B$100,L35,2),\"\")","v":""},null,{"$f":"IF(N35>0,INDEX(Poeng!$A$1:$B$100,N35,2),\"\")","v":""},null,{"$f":"IF(P35>0,INDEX(Poeng!$A$1:$B$100,P35,2),\"\")","v":""},0,0,0,0,0,0,0,0,0,0,0,0,0,""]
["",null,null,""," ",null,{"$f":"IF(F36>0,INDEX(Poeng!$A$1:$B$100,F36,2),\"\")","v":""},null,{"$f":"IF(H36>0,INDEX(Poeng!$A$1:$B$100,H36,2),\"\")","v":""},null,{"$f":"IF(J36>0,INDEX(Poeng!$A$1:$B$100,J36,2),\"\")","v":""},null,{"$f":"IF(L36>0,INDEX(Poeng!$A$1:$B$100,L36,2),\"\")","v":""},null,{"$f":"IF(N36>0,INDEX(Poeng!$A$1:$B$100,N36,2),\"\")","v":""},null,{"$f":"IF(P36>0,INDEX(Poeng!$A$1:$B$100,P36,2),\"\")","v":""},0,0,0,0,0,0,0,0,0,0,0,0,0,{"$f":"IF(B36<>\"\",RANK(AD36,AD$4:AD$55,0),\"\")","v":""}]
["",null,null,""," ",null,{"$f":"IF(F37>0,INDEX(Poeng!$A$1:$B$100,F37,2),\"\")","v":""},null,{"$f":"IF(H37>0,INDEX(Poeng!$A$1:$B$100,H37,2),\"\")","v":""},null,{"$f":"IF(J37>0,INDEX(Poeng!$A$1:$B$100,J37,2),\"\")","v":""},null,{"$f":"IF(L37>0,INDEX(Poeng!$A$1:$B$100,L37,2),\"\")","v":""},null,{"$f":"IF(N37>0,INDEX(Poeng!$A$1:$B$100,N37,2),\"\")","v":""},null,{"$f":"IF(P37>0,INDEX(Poeng!$A$1:$B$100,P37,2),\"\")","v":""},0,0,0,0,0,0,0,0,0,0,0,0,0,""]
["",null,null,""," ",null,null,null,{"$f":"IF(H38>0,INDEX(Poeng!$A$1:$B$100,H38,2),\"\")","v":""},null,{"$f":"IF(J38>0,INDEX(Poeng!$A$1:$B$100,J38,2),\"\")","v":""},null,{"$f":"IF(L38>0,INDEX(Poeng!$A$1:$B$100,L38,2),\"\")","v":""},null,{"$f":"IF(N38>0,INDEX(Poeng!$A$1:$B$100,N38,2),\"\")","v":""},null,{"$f":"IF(P38>0,INDEX(Poeng!$A$1:$B$100,P38,2),\"\")","v":""},0,0,0,0,0,0,0,0,0,0,0,0,0,""]
["",null,null,""," ",null,{"$f":"IF(F39>0,INDEX(Poeng!$A$1:$B$100,F39,2),\"\")","v":""},null,{"$f":"IF(H39>0,INDEX(Poeng!$A$1:$B$100,H39,2),\"\")","v":""},null,{"$f":"IF(J39>0,INDEX(Poeng!$A$1:$B$100,J39,2),\"\")","v":""},null,{"$f":"IF(L39>0,INDEX(Poeng!$A$1:$B$100,L39,2),\"\")","v":""},null,{"$f":"IF(N39>0,INDEX(Poeng!$A$1:$B$100,N39,2),\"\")","v":""},null,{"$f":"IF(P39>0,INDEX(Poeng!$A$1:$B$100,P39,2),\"\")","v":""},0,0,0,0,0,0,0,0,0,0,{"$f":"SUM(X39:AA39)","v":0},0,{"$f":"AB39*10^8+X39*10^6/2+Y39*10^4/2+Z39*10^2/2+AA39/2","v":0},""]
["",null,null,""," ",null,null,null,{"$f":"IF(H40>0,INDEX(Poeng!$A$1:$B$100,H40,2),\"\")","v":""},null,{"$f":"IF(J40>0,INDEX(Poeng!$A$1:$B$100,J40,2),\"\")","v":""},null,{"$f":"IF(L40>0,INDEX(Poeng!$A$1:$B$100,L40,2),\"\")","v":""},null,{"$f":"IF(N40>0,INDEX(Poeng!$A$1:$B$100,N40,2),\"\")","v":""},null,{"$f":"IF(P40>0,INDEX(Poeng!$A$1:$B$100,P40,2),\"\")","v":""},0,0,0,0,0,0,0,0,0,0,0,0,0,""]
["",null,null,""," ",null,{"$f":"IF(F41>0,INDEX(Poeng!$A$1:$B$100,F41,2),\"\")","v":""},null,{"$f":"IF(H41>0,INDEX(Poeng!$A$1:$B$100,H41,2),\"\")","v":""},null,{"$f":"IF(J41>0,INDEX(Poeng!$A$1:$B$100,J41,2),\"\")","v":""},null,{"$f":"IF(L41>0,INDEX(Poeng!$A$1:$B$100,L41,2),\"\")","v":""},null,{"$f":"IF(N41>0,INDEX(Poeng!$A$1:$B$100,N41,2),\"\")","v":""},null,{"$f":"IF(P41>0,INDEX(Poeng!$A$1:$B$100,P41,2),\"\")","v":""},0,0,0,0,0,0,0,0,0,0,0,0,0,""]
["",null,null,""," ",null,{"$f":"IF(F42>0,INDEX(Poeng!$A$1:$B$100,F42,2),\"\")","v":""},null,{"$f":"IF(H42>0,INDEX(Poeng!$A$1:$B$100,H42,2),\"\")","v":""},null,{"$f":"IF(J42>0,INDEX(Poeng!$A$1:$B$100,J42,2),\"\")","v":""},null,{"$f":"IF(L42>0,INDEX(Poeng!$A$1:$B$100,L42,2),\"\")","v":""},null,{"$f":"IF(N42>0,INDEX(Poeng!$A$1:$B$100,N42,2),\"\")","v":""},null,{"$f":"IF(P42>0,INDEX(Poeng!$A$1:$B$100,P42,2),\"\")","v":""},0,0,0,0,0,0,0,0,0,0,0,0,0,""]
["",null,null,""," ",null,null,null,{"$f":"IF(H43>0,INDEX(Poeng!$A$1:$B$100,H43,2),\"\")","v":""},null,{"$f":"IF(J43>0,INDEX(Poeng!$A$1:$B$100,J43,2),\"\")","v":""},null,{"$f":"IF(L43>0,INDEX(Poeng!$A$1:$B$100,L43,2),\"\")","v":""},null,{"$f":"IF(N43>0,INDEX(Poeng!$A$1:$B$100,N43,2),\"\")","v":""},null,{"$f":"IF(P43>0,INDEX(Poeng!$A$1:$B$100,P43,2),\"\")","v":""},0,0,0,0,0,0,0,0,0,0,0,0,0,""]
[{"$f":"AE44","v":""},null,null,{"$f":"IF(B44<>\"\",AB44,\"\")","v":""},{"$f":"IF(AC44<4,\" \",\"F\")","v":" "},null,null,null,{"$f":"IF(H44>0,INDEX(Poeng!$A$1:$B$100,H44,2),\"\")","v":""},null,{"$f":"IF(J44>0,INDEX(Poeng!$A$1:$B$100,J44,2),\"\")","v":""},null,{"$f":"IF(L44>0,INDEX(Poeng!$A$1:$B$100,L44,2),\"\")","v":""},null,{"$f":"IF(N44>0,INDEX(Poeng!$A$1:$B$100,N44,2),\"\")","v":""},null,{"$f":"IF(P44>0,INDEX(Poeng!$A$1:$B$100,P44,2),\"\")","v":""},0,0,0,0,0,0,0,0,0,0,0,0,0,""]
["",null,null,""," ",null,null,null,{"$f":"IF(H45>0,INDEX(Poeng!$A$1:$B$100,H45,2),\"\")","v":""},null,{"$f":"IF(J45>0,INDEX(Poeng!$A$1:$B$100,J45,2),\"\")","v":""},null,{"$f":"IF(L45>0,INDEX(Poeng!$A$1:$B$100,L45,2),\"\")","v":""},null,{"$f":"IF(N45>0,INDEX(Poeng!$A$1:$B$100,N45,2),\"\")","v":""},null,{"$f":"IF(P45>0,INDEX(Poeng!$A$1:$B$100,P45,2),\"\")","v":""},0,0,0,0,0,0,0,0,0,0,0,0,0,""]
["",null,null,""," ",null,null,null,{"$f":"IF(H46>0,INDEX(Poeng!$A$1:$B$100,H46,2),\"\")","v":""},null,{"$f":"IF(J46>0,INDEX(Poeng!$A$1:$B$100,J46,2),\"\")","v":""},null,{"$f":"IF(L46>0,INDEX(Poeng!$A$1:$B$100,L46,2),\"\")","v":""},null,{"$f":"IF(N46>0,INDEX(Poeng!$A$1:$B$100,N46,2),\"\")","v":""},null,{"$f":"IF(P46>0,INDEX(Poeng!$A$1:$B$100,P46,2),\"\")","v":""},0,0,0,0,0,0,0,0,0,0,0,0,0,""]
["",null,null,""," ",null,null,null,{"$f":"IF(H47>0,INDEX(Poeng!$A$1:$B$100,H47,2),\"\")","v":""},null,{"$f":"IF(J47>0,INDEX(Poeng!$A$1:$B$100,J47,2),\"\")","v":""},null,{"$f":"IF(L47>0,INDEX(Poeng!$A$1:$B$100,L47,2),\"\")","v":""},null,{"$f":"IF(N47>0,INDEX(Poeng!$A$1:$B$100,N47,2),\"\")","v":""},null,{"$f":"IF(P47>0,INDEX(Poeng!$A$1:$B$100,P47,2),\"\")","v":""},0,0,0,0,0,0,0,0,0,0,0,0,0,""]
["",null,null,""," ",null,null,null,{"$f":"IF(H48>0,INDEX(Poeng!$A$1:$B$100,H48,2),\"\")","v":""},null,{"$f":"IF(J48>0,INDEX(Poeng!$A$1:$B$100,J48,2),\"\")","v":""},null,{"$f":"IF(L48>0,INDEX(Poeng!$A$1:$B$100,L48,2),\"\")","v":""},null,{"$f":"IF(N48>0,INDEX(Poeng!$A$1:$B$100,N48,2),\"\")","v":""},null,{"$f":"IF(P48>0,INDEX(Poeng!$A$1:$B$100,P48,2),\"\")","v":""},0,0,0,0,0,0,0,0,0,0,0,0,0,""]
["",null,null,""," ",null,null,null,{"$f":"IF(H49>0,INDEX(Poeng!$A$1:$B$100,H49,2),\"\")","v":""},null,{"$f":"IF(J49>0,INDEX(Poeng!$A$1:$B$100,J49,2),\"\")","v":""},null,{"$f":"IF(L49>0,INDEX(Poeng!$A$1:$B$100,L49,2),\"\")","v":""},null,{"$f":"IF(N49>0,INDEX(Poeng!$A$1:$B$100,N49,2),\"\")","v":""},null,{"$f":"IF(P49>0,INDEX(Poeng!$A$1:$B$100,P49,2),\"\")","v":""},0,0,0,0,0,0,0,0,0,0,{"$f":"SUM(X49:AA49)","v":0},0,{"$f":"AB49*10^8+X49*10^6/2+Y49*10^4/2+Z49*10^2/2+AA49/2","v":0},""]
["",null,null,""," ",null,null,null,{"$f":"IF(H50>0,INDEX(Poeng!$A$1:$B$100,H50,2),\"\")","v":""},null,{"$f":"IF(J50>0,INDEX(Poeng!$A$1:$B$100,J50,2),\"\")","v":""},null,{"$f":"IF(L50>0,INDEX(Poeng!$A$1:$B$100,L50,2),\"\")","v":""},null,{"$f":"IF(N50>0,INDEX(Poeng!$A$1:$B$100,N50,2),\"\")","v":""},null,{"$f":"IF(P50>0,INDEX(Poeng!$A$1:$B$100,P50,2),\"\")","v":""},0,0,0,0,0,0,0,0,0,0,0,0,0,""]
["",null,null,""," ",null,null,null,{"$f":"IF(H51>0,INDEX(Poeng!$A$1:$B$100,H51,2),\"\")","v":""},null,{"$f":"IF(J51>0,INDEX(Poeng!$A$1:$B$100,J51,2),\"\")","v":""},null,{"$f":"IF(L51>0,INDEX(Poeng!$A$1:$B$100,L51,2),\"\")","v":""},null,{"$f":"IF(N51>0,INDEX(Poeng!$A$1:$B$100,N51,2),\"\")","v":""},null,{"$f":"IF(P51>0,INDEX(Poeng!$A$1:$B$100,P51,2),\"\")","v":""},0,0,0,0,0,0,0,0,0,0,0,0,0,""]
[{"$f":"AE52","v":""},null,null,""," ",null,null,null,{"$f":"IF(H52>0,INDEX(Poeng!$A$1:$B$100,H52,2),\"\")","v":""},null,{"$f":"IF(J52>0,INDEX(Poeng!$A$1:$B$100,J52,2),\"\")","v":""},null,{"$f":"IF(L52>0,INDEX(Poeng!$A$1:$B$100,L52,2),\"\")","v":""},null,{"$f":"IF(N52>0,INDEX(Poeng!$A$1:$B$100,N52,2),\"\")","v":""},null,{"$f":"IF(P52>0,INDEX(Poeng!$A$1:$B$100,P52,2),\"\")","v":""},0,0,0,0,0,0,0,0,0,0,0,0,0,""]
["",null,null,"",{"$f":"IF(AC53<4,\" \",\"F\")","v":" "},null,null,null,{"$f":"IF(H53>0,INDEX(Poeng!$A$1:$B$100,H53,2),\"\")","v":""},null,{"$f":"IF(J53>0,INDEX(Poeng!$A$1:$B$100,J53,2),\"\")","v":""},null,{"$f":"IF(L53>0,INDEX(Poeng!$A$1:$B$100,L53,2),\"\")","v":""},null,{"$f":"IF(N53>0,INDEX(Poeng!$A$1:$B$100,N53,2),\"\")","v":""},null,{"$f":"IF(P53>0,INDEX(Poeng!$A$1:$B$100,P53,2),\"\")","v":""},0,0,0,0,0,0,0,0,0,0,0,0,0,""]
["",null,null,{"$f":"IF(B54<>\"\",AB54,\"\")","v":""}," ",null,null,null,{"$f":"IF(H54>0,INDEX(Poeng!$A$1:$B$100,H54,2),\"\")","v":""},null,{"$f":"IF(J54>0,INDEX(Poeng!$A$1:$B$100,J54,2),\"\")","v":""},null,{"$f":"IF(L54>0,INDEX(Poeng!$A$1:$B$100,L54,2),\"\")","v":""},null,{"$f":"IF(N54>0,INDEX(Poeng!$A$1:$B$100,N54,2),\"\")","v":""},null,{"$f":"IF(P54>0,INDEX(Poeng!$A$1:$B$100,P54,2),\"\")","v":""},{"$f":"IF(F54>0,G54,0)","v":0},{"$f":"IF(H54>0,I54,0)","v":0},{"$f":"IF(J54>0,K54,0)","v":0},{"$f":"IF(L54>0,M54,0)","v":0},{"$f":"IF(N54>0,O54,0)","v":0},{"$f":"IF(P54>0,Q54,0)","v":0},{"$f":"LARGE(R54:W54,1)","v":0},{"$f":"LARGE(R54:W54,2)","v":0},{"$f":"LARGE(R54:W54,3)","v":0},{"$f":"LARGE(R54:W54,4)","v":0},0,{"$f":"COUNT(F54:Q54)/2","v":0},0,""]
["",null,null,""," ",null,null,null,{"$f":"IF(H55>0,INDEX(Poeng!$A$1:$B$100,H55,2),\"\")","v":""},null,{"$f":"IF(J55>0,INDEX(Poeng!$A$1:$B$100,J55,2),\"\")","v":""},null,{"$f":"IF(L55>0,INDEX(Poeng!$A$1:$B$100,L55,2),\"\")","v":""},null,{"$f":"IF(N55>0,INDEX(Poeng!$A$1:$B$100,N55,2),\"\")","v":""},null,{"$f":"IF(P55>0,INDEX(Poeng!$A$1:$B$100,P55,2),\"\")","v":""},0,0,0,0,0,0,0,0,0,0,0,0,0,""]
["",null,null,""," ",null,null,null,{"$f":"IF(H56>0,INDEX(Poeng!$A$1:$B$100,H56,2),\"\")","v":""},null,{"$f":"IF(J56>0,INDEX(Poeng!$A$1:$B$100,J56,2),\"\")","v":""},null,{"$f":"IF(L56>0,INDEX(Poeng!$A$1:$B$100,L56,2),\"\")","v":""},null,{"$f":"IF(N56>0,INDEX(Poeng!$A$1:$B$100,N56,2),\"\")","v":""},null,{"$f":"IF(P56>0,INDEX(Poeng!$A$1:$B$100,P56,2),\"\")","v":""},0,0,0,0,0,0,0,0,0,0,0,0,0,""]
["",null,null,""," ",null,null,null,{"$f":"IF(H57>0,INDEX(Poeng!$A$1:$B$100,H57,2),\"\")","v":""},null,{"$f":"IF(J57>0,INDEX(Poeng!$A$1:$B$100,J57,2),\"\")","v":""},null,{"$f":"IF(L57>0,INDEX(Poeng!$A$1:$B$100,L57,2),\"\")","v":""},null,{"$f":"IF(N57>0,INDEX(Poeng!$A$1:$B$100,N57,2),\"\")","v":""},null,{"$f":"IF(P57>0,INDEX(Poeng!$A$1:$B$100,P57,2),\"\")","v":""},0,0,0,0,0,0,0,0,0,0,0,0,0,""]
["",null,null,""," ",null,null,null,{"$f":"IF(H58>0,INDEX(Poeng!$A$1:$B$100,H58,2),\"\")","v":""},null,{"$f":"IF(J58>0,INDEX(Poeng!$A$1:$B$100,J58,2),\"\")","v":""},null,{"$f":"IF(L58>0,INDEX(Poeng!$A$1:$B$100,L58,2),\"\")","v":""},null,{"$f":"IF(N58>0,INDEX(Poeng!$A$1:$B$100,N58,2),\"\")","v":""},null,{"$f":"IF(P58>0,INDEX(Poeng!$A$1:$B$100,P58,2),\"\")","v":""},0,0,0,0,0,0,0,0,0,0,0,0,0,""]
["",null,null,""," ",null,null,null,{"$f":"IF(H59>0,INDEX(Poeng!$A$1:$B$100,H59,2),\"\")","v":""},null,{"$f":"IF(J59>0,INDEX(Poeng!$A$1:$B$100,J59,2),\"\")","v":""},null,{"$f":"IF(L59>0,INDEX(Poeng!$A$1:$B$100,L59,2),\"\")","v":""},null,{"$f":"IF(N59>0,INDEX(Poeng!$A$1:$B$100,N59,2),\"\")","v":""},null,{"$f":"IF(P59>0,INDEX(Poeng!$A$1:$B$100,P59,2),\"\")","v":""},0,0,0,0,0,0,0,0,0,0,0,0,0,""]
["",null,null,""," ",null,null,null,{"$f":"IF(H60>0,INDEX(Poeng!$A$1:$B$100,H60,2),\"\")","v":""},null,{"$f":"IF(J60>0,INDEX(Poeng!$A$1:$B$100,J60,2),\"\")","v":""},null,{"$f":"IF(L60>0,INDEX(Poeng!$A$1:$B$100,L60,2),\"\")","v":""},null,{"$f":"IF(N60>0,INDEX(Poeng!$A$1:$B$100,N60,2),\"\")","v":""},null,{"$f":"IF(P60>0,INDEX(Poeng!$A$1:$B$100,P60,2),\"\")","v":""},0,0,0,0,0,0,0,0,0,0,0,0,0,""]
["",null,null,""," ",null,null,null,{"$f":"IF(H61>0,INDEX(Poeng!$A$1:$B$100,H61,2),\"\")","v":""},null,{"$f":"IF(J61>0,INDEX(Poeng!$A$1:$B$100,J61,2),\"\")","v":""},null,{"$f":"IF(L61>0,INDEX(Poeng!$A$1:$B$100,L61,2),\"\")","v":""},null,{"$f":"IF(N61>0,INDEX(Poeng!$A$1:$B$100,N61,2),\"\")","v":""},null,{"$f":"IF(P61>0,INDEX(Poeng!$A$1:$B$100,P61,2),\"\")","v":""},0,0,0,0,0,0,0,0,0,0,0,0,0,""]
["",null,null,""," ",null,null,null,{"$f":"IF(H62>0,INDEX(Poeng!$A$1:$B$100,H62,2),\"\")","v":""},null,{"$f":"IF(J62>0,INDEX(Poeng!$A$1:$B$100,J62,2),\"\")","v":""},null,{"$f":"IF(L62>0,INDEX(Poeng!$A$1:$B$100,L62,2),\"\")","v":""},null,{"$f":"IF(N62>0,INDEX(Poeng!$A$1:$B$100,N62,2),\"\")","v":""},null,{"$f":"IF(P62>0,INDEX(Poeng!$A$1:$B$100,P62,2),\"\")","v":""},0,0,0,0,0,0,0,0,0,0,0,0,0,""]
["",null,null,""," ",null,null,null,{"$f":"IF(H63>0,INDEX(Poeng!$A$1:$B$100,H63,2),\"\")","v":""},null,{"$f":"IF(J63>0,INDEX(Poeng!$A$1:$B$100,J63,2),\"\")","v":""},null,{"$f":"IF(L63>0,INDEX(Poeng!$A$1:$B$100,L63,2),\"\")","v":""},null,{"$f":"IF(N63>0,INDEX(Poeng!$A$1:$B$100,N63,2),\"\")","v":""},null,{"$f":"IF(P63>0,INDEX(Poeng!$A$1:$B$100,P63,2),\"\")","v":""},0,0,0,0,0,0,0,0,0,0,0,0,0,""]
["",null,null,""," ",null,null,null,{"$f":"IF(H64>0,INDEX(Poeng!$A$1:$B$100,H64,2),\"\")","v":""},null,{"$f":"IF(J64>0,INDEX(Poeng!$A$1:$B$100,J64,2),\"\")","v":""},null,{"$f":"IF(L64>0,INDEX(Poeng!$A$1:$B$100,L64,2),\"\")","v":""},null,{"$f":"IF(N64>0,INDEX(Poeng!$A$1:$B$100,N64,2),\"\")","v":""},null,{"$f":"IF(P64>0,INDEX(Poeng!$A$1:$B$100,P64,2),\"\")","v":""},0,0,0,0,0,0,0,0,0,0,0,0,0,""]
["",null,null,""," ",null,null,null,{"$f":"IF(H65>0,INDEX(Poeng!$A$1:$B$100,H65,2),\"\")","v":""},null,{"$f":"IF(J65>0,INDEX(Poeng!$A$1:$B$100,J65,2),\"\")","v":""},null,{"$f":"IF(L65>0,INDEX(Poeng!$A$1:$B$100,L65,2),\"\")","v":""},null,{"$f":"IF(N65>0,INDEX(Poeng!$A$1:$B$100,N65,2),\"\")","v":""},null,{"$f":"IF(P65>0,INDEX(Poeng!$A$1:$B$100,P65,2),\"\")","v":""},0,0,0,0,0,0,0,0,0,0,0,0,0,""]
["",null,null,""," ",null,null,null,{"$f":"IF(H66>0,INDEX(Poeng!$A$1:$B$100,H66,2),\"\")","v":""},null,{"$f":"IF(J66>0,INDEX(Poeng!$A$1:$B$100,J66,2),\"\")","v":""},null,{"$f":"IF(L66>0,INDEX(Poeng!$A$1:$B$100,L66,2),\"\")","v":""},null,{"$f":"IF(N66>0,INDEX(Poeng!$A$1:$B$100,N66,2),\"\")","v":""},null,{"$f":"IF(P66>0,INDEX(Poeng!$A$1:$B$100,P66,2),\"\")","v":""},0,0,0,0,0,0,0,0,0,0,0,0,0,""]
["",null,null,""," ",null,null,null,{"$f":"IF(H67>0,INDEX(Poeng!$A$1:$B$100,H67,2),\"\")","v":""},null,{"$f":"IF(J67>0,INDEX(Poeng!$A$1:$B$100,J67,2),\"\")","v":""},null,{"$f":"IF(L67>0,INDEX(Poeng!$A$1:$B$100,L67,2),\"\")","v":""},null,{"$f":"IF(N67>0,INDEX(Poeng!$A$1:$B$100,N67,2),\"\")","v":""},null,{"$f":"IF(P67>0,INDEX(Poeng!$A$1:$B$100,P67,2),\"\")","v":""},0,0,0,0,0,0,0,0,0,0,0,0,0,""]
["",null,null,""," ",null,null,null,{"$f":"IF(H68>0,INDEX(Poeng!$A$1:$B$100,H68,2),\"\")","v":""},null,{"$f":"IF(J68>0,INDEX(Poeng!$A$1:$B$100,J68,2),\"\")","v":""},null,{"$f":"IF(L68>0,INDEX(Poeng!$A$1:$B$100,L68,2),\"\")","v":""},null,{"$f":"IF(N68>0,INDEX(Poeng!$A$1:$B$100,N68,2),\"\")","v":""},null,{"$f":"IF(P68>0,INDEX(Poeng!$A$1:$B$100,P68,2),\"\")","v":""},0,0,0,0,0,0,0,0,0,0,0,0,0,{"$f":"IF(B68<>\"\",RANK(AD68,AD$4:AD$55,0),\"\")","v":""}]
["",null,null,""," ",null,null,null,{"$f":"IF(H69>0,INDEX(Poeng!$A$1:$B$100,H69,2),\"\")","v":""},null,{"$f":"IF(J69>0,INDEX(Poeng!$A$1:$B$100,J69,2),\"\")","v":""},null,{"$f":"IF(L69>0,INDEX(Poeng!$A$1:$B$100,L69,2),\"\")","v":""},null,{"$f":"IF(N69>0,INDEX(Poeng!$A$1:$B$100,N69,2),\"\")","v":""},null,{"$f":"IF(P69>0,INDEX(Poeng!$A$1:$B$100,P69,2),\"\")","v":""},0,0,0,0,0,0,0,0,0,0,0,0,0,""]
["",null,null,""," ",null,null,null,{"$f":"IF(H70>0,INDEX(Poeng!$A$1:$B$100,H70,2),\"\")","v":""},null,{"$f":"IF(J70>0,INDEX(Poeng!$A$1:$B$100,J70,2),\"\")","v":""},null,{"$f":"IF(L70>0,INDEX(Poeng!$A$1:$B$100,L70,2),\"\")","v":""},null,{"$f":"IF(N70>0,INDEX(Poeng!$A$1:$B$100,N70,2),\"\")","v":""},null,{"$f":"IF(P70>0,INDEX(Poeng!$A$1:$B$100,P70,2),\"\")","v":""},0,0,0,0,0,0,0,0,0,0,0,0,0,""]
["",null,null,""," ",null,null,null,{"$f":"IF(H71>0,INDEX(Poeng!$A$1:$B$100,H71,2),\"\")","v":""},null,{"$f":"IF(J71>0,INDEX(Poeng!$A$1:$B$100,J71,2),\"\")","v":""},null,{"$f":"IF(L71>0,INDEX(Poeng!$A$1:$B$100,L71,2),\"\")","v":""},null,{"$f":"IF(N71>0,INDEX(Poeng!$A$1:$B$100,N71,2),\"\")","v":""},null,{"$f":"IF(P71>0,INDEX(Poeng!$A$1:$B$100,P71,2),\"\")","v":""},0,0,0,0,0,0,0,0,0,0,0,0,0,""]
["",null,null,""," ",null,null,null,{"$f":"IF(H72>0,INDEX(Poeng!$A$1:$B$100,H72,2),\"\")","v":""},null,{"$f":"IF(J72>0,INDEX(Poeng!$A$1:$B$100,J72,2),\"\")","v":""},null,{"$f":"IF(L72>0,INDEX(Poeng!$A$1:$B$100,L72,2),\"\")","v":""},null,{"$f":"IF(N72>0,INDEX(Poeng!$A$1:$B$100,N72,2),\"\")","v":""},null,{"$f":"IF(P72>0,INDEX(Poeng!$A$1:$B$100,P72,2),\"\")","v":""},0,0,0,0,0,0,0,0,0,0,0,0,0,""]
["",null,null,""," ",null,null,null,{"$f":"IF(H73>0,INDEX(Poeng!$A$1:$B$100,H73,2),\"\")","v":""},null,{"$f":"IF(J73>0,INDEX(Poeng!$A$1:$B$100,J73,2),\"\")","v":""},null,{"$f":"IF(L73>0,INDEX(Poeng!$A$1:$B$100,L73,2),\"\")","v":""},null,{"$f":"IF(N73>0,INDEX(Poeng!$A$1:$B$100,N73,2),\"\")","v":""},null,{"$f":"IF(P73>0,INDEX(Poeng!$A$1:$B$100,P73,2),\"\")","v":""},0,0,0,0,0,0,0,0,0,0,0,0,0,""]
["",null,null,""," ",null,null,null,{"$f":"IF(H74>0,INDEX(Poeng!$A$1:$B$100,H74,2),\"\")","v":""},null,{"$f":"IF(J74>0,INDEX(Poeng!$A$1:$B$100,J74,2),\"\")","v":""},null,{"$f":"IF(L74>0,INDEX(Poeng!$A$1:$B$100,L74,2),\"\")","v":""},null,{"$f":"IF(N74>0,INDEX(Poeng!$A$1:$B$100,N74,2),\"\")","v":""},null,{"$f":"IF(P74>0,INDEX(Poeng!$A$1:$B$100,P74,2),\"\")","v":""},0,0,0,0,0,0,0,0,0,0,0,0,0,""]
["",null,null,""," ",null,null,null,{"$f":"IF(H75>0,INDEX(Poeng!$A$1:$B$100,H75,2),\"\")","v":""},null,{"$f":"IF(J75>0,INDEX(Poeng!$A$1:$B$100,J75,2),\"\")","v":""},null,{"$f":"IF(L75>0,INDEX(Poeng!$A$1:$B$100,L75,2),\"\")","v":""},null,{"$f":"IF(N75>0,INDEX(Poeng!$A$1:$B$100,N75,2),\"\")","v":""},null,{"$f":"IF(P75>0,INDEX(Poeng!$A$1:$B$100,P75,2),\"\")","v":""},0,0,0,0,0,0,0,0,0,0,0,0,0,""]
["",null,null,""," ",null,null,null,{"$f":"IF(H76>0,INDEX(Poeng!$A$1:$B$100,H76,2),\"\")","v":""},null,{"$f":"IF(J76>0,INDEX(Poeng!$A$1:$B$100,J76,2),\"\")","v":""},null,{"$f":"IF(L76>0,INDEX(Poeng!$A$1:$B$100,L76,2),\"\")","v":""},null,{"$f":"IF(N76>0,INDEX(Poeng!$A$1:$B$100,N76,2),\"\")","v":""},null,{"$f":"IF(P76>0,INDEX(Poeng!$A$1:$B$100,P76,2),\"\")","v":""},0,0,0,0,0,0,0,0,0,0,0,0,0,""]
["",null,null,""," ",null,null,null,{"$f":"IF(H77>0,INDEX(Poeng!$A$1:$B$100,H77,2),\"\")","v":""},null,{"$f":"IF(J77>0,INDEX(Poeng!$A$1:$B$100,J77,2),\"\")","v":""},null,{"$f":"IF(L77>0,INDEX(Poeng!$A$1:$B$100,L77,2),\"\")","v":""},null,{"$f":"IF(N77>0,INDEX(Poeng!$A$1:$B$100,N77,2),\"\")","v":""},null,{"$f":"IF(P77>0,INDEX(Poeng!$A$1:$B$100,P77,2),\"\")","v":""},0,0,0,0,0,0,0,0,0,0,0,0,0,""]
["",null,null,""," ",null,null,null,{"$f":"IF(H78>0,INDEX(Poeng!$A$1:$B$100,H78,2),\"\")","v":""},null,{"$f":"IF(J78>0,INDEX(Poeng!$A$1:$B$100,J78,2),\"\")","v":""},null,{"$f":"IF(L78>0,INDEX(Poeng!$A$1:$B$100,L78,2),\"\")","v":""},null,{"$f":"IF(N78>0,INDEX(Poeng!$A$1:$B$100,N78,2),\"\")","v":""},null,{"$f":"IF(P78>0,INDEX(Poeng!$A$1:$B$100,P78,2),\"\")","v":""},0,0,0,0,0,0,0,0,0,0,0,0,0,""]
["",null,null,""," ",null,null,null,{"$f":"IF(H79>0,INDEX(Poeng!$A$1:$B$100,H79,2),\"\")","v":""},null,{"$f":"IF(J79>0,INDEX(Poeng!$A$1:$B$100,J79,2),\"\")","v":""},null,{"$f":"IF(L79>0,INDEX(Poeng!$A$1:$B$100,L79,2),\"\")","v":""},null,{"$f":"IF(N79>0,INDEX(Poeng!$A$1:$B$100,N79,2),\"\")","v":""},null,{"$f":"IF(P79>0,INDEX(Poeng!$A$1:$B$100,P79,2),\"\")","v":""},0,0,0,0,0,0,0,0,0,0,0,0,0,""]
["",null,null,""," ",null,null,null,{"$f":"IF(H80>0,INDEX(Poeng!$A$1:$B$100,H80,2),\"\")","v":""},null,{"$f":"IF(J80>0,INDEX(Poeng!$A$1:$B$100,J80,2),\"\")","v":""},null,{"$f":"IF(L80>0,INDEX(Poeng!$A$1:$B$100,L80,2),\"\")","v":""},null,{"$f":"IF(N80>0,INDEX(Poeng!$A$1:$B$100,N80,2),\"\")","v":""},null,{"$f":"IF(P80>0,INDEX(Poeng!$A$1:$B$100,P80,2),\"\")","v":""},0,0,0,0,0,0,0,0,0,0,0,0,0,""]

{"sheet":"G15","index":6,"n_rows":76,"n_cols":31,"rows_kept":76,"cut":false,"hidden":false,"merged":[[0,2,0,16],[1,5,1,6],[1,7,1,8],[1,9,1,10],[1,11,1,12],[1,13,1,14],[1,15,1,16],[2,15,2,16],[2,5,2,6],[2,7,2,8],[2,9,2,10],[2,11,2,12],[2,13,2,14]]}
["Gutter 15",null,"  Sparebank1-CUP 2021"]
[null,null,null,null,null,"SP1- CUP 1 ",null,"SP1- CUP 2 ",null,"SP1- CUP 3",null,"SP1- CUP 4",null,"SP1- CUP 5",null,"SP1- CUP 6",null,"Poeng",null,null,null,null,null,"Fire beste",null,null,null,"Sum"]
["Nr","NAVN","KLUBB","POENG","Fullført","Nr.  Poeng ",null,"Nr.  Poeng ",null,"Nr.   Poeng ",null,"Nr.  Poeng ",null,"Nr.  Poeng ",null,"Nr. Poeng ",null,1,2,3,4,5,6,1,2,3,4]
[{"$f":"AE4","v":1},"Halvor Kvennås","Byåsen IL",{"$f":"IF(B4<>\"\",AB4,\"\")","v":360},{"$f":"IF(AC4<4,\" \",\"F\")","v":"F"},5,{"$f":"IF(F4>0,INDEX(Poeng!$A$1:$B$100,F4,2),\"\")","v":45},1,{"$f":"IF(H4>0,INDEX(Poeng!$A$1:$B$100,H4,2),\"\")","v":100},3,{"$f":"IF(J4>0,INDEX(Poeng!$A$1:$B$100,J4,2),\"\")","v":60},1,{"$f":"IF(L4>0,INDEX(Poeng!$A$1:$B$100,L4,2),\"\")","v":100},1,{"$f":"IF(N4>0,INDEX(Poeng!$A$1:$B$100,N4,2),\"\")","v":100},4,{"$f":"IF(P4>0,INDEX(Poeng!$A$1:$B$100,P4,2),\"\")","v":50},{"$f":"IF(F4>0,G4,0)","v":45},{"$f":"IF(H4>0,I4,0)","v":100},{"$f":"IF(J4>0,K4,0)","v":60},{"$f":"IF(L4>0,M4,0)","v":100},{"$f":"IF(N4>0,O4,0)","v":100},{"$f":"IF(P4>0,Q4,0)","v":50},{"$f":"LARGE(R4:W4,1)","v":100},{"$f":"LARGE(R4:W4,2)","v":100},{"$f":"LARGE(R4:W4,3)","v":100},{"$f":"LARGE(R4:W4,4)","v":60},{"$f":"SUM(X4:AA4)","v":360},{"$f":"COUNT(F4:Q4)/2","v":6},{"$f":"AB4*10^8+X4*10^6/2+Y4*10^4/2+Z4*10^2/2+AA4/2","v":36050505030},{"$f":"IF(B4<>\"\",RANK(AD4,AD$4:AD$51,0),\"\")","v":1}]
[2,"Olav Fugelsøy","Surnadal IL",340,"F",4,{"$f":"IF(F5>0,INDEX(Poeng!$A$1:$B$100,F5,2),\"\")","v":50},1,{"$f":"IF(H5>0,INDEX(Poeng!$A$1:$B$100,H5,2),\"\")","v":100},13,{"$f":"IF(J5>0,INDEX(Poeng!$A$1:$B$100,J5,2),\"\")","v":20},3,{"$f":"IF(L5>0,INDEX(Poeng!$A$1:$B$100,L5,2),\"\")","v":60},2,{"$f":"IF(N5>0,INDEX(Poeng!$A$1:$B$100,N5,2),\"\")","v":80},1,{"$f":"IF(P5>0,INDEX(Poeng!$A$1:$B$100,P5,2),\"\")","v":100},50,100,20,60,80,100,100,100,80,60,340,6,34050504030,2]
[3,"Benjamin Kulsetås","Strindheim IL ",245,"F",3,{"$f":"IF(F6>0,INDEX(Poeng!$A$1:$B$100,F6,2),\"\")","v":60},5,{"$f":"IF(H6>0,INDEX(Poeng!$A$1:$B$100,H6,2),\"\")","v":45},1,{"$f":"IF(J6>0,INDEX(Poeng!$A$1:$B$100,J6,2),\"\")","v":100},6,{"$f":"IF(L6>0,INDEX(Poeng!$A$1:$B$100,L6,2),\"\")","v":40},null,{"$f":"IF(N6>0,INDEX(Poeng!$A$1:$B$100,N6,2),\"\")","v":""},null,{"$f":"IF(P6>0,INDEX(Poeng!$A$1:$B$100,P6,2),\"\")","v":""},60,45,100,40,0,0,100,60,45,40,245,4,24550302270,3]
[4,"Abel Sæterbø Raaen","Surnadal IL",245,"F",6,{"$f":"IF(F7>0,INDEX(Poeng!$A$1:$B$100,F7,2),\"\")","v":40},3,{"$f":"IF(H7>0,INDEX(Poeng!$A$1:$B$100,H7,2),\"\")","v":60},5,{"$f":"IF(J7>0,INDEX(Poeng!$A$1:$B$100,J7,2),\"\")","v":45},2,{"$f":"IF(L7>0,INDEX(Poeng!$A$1:$B$100,L7,2),\"\")","v":80},3,{"$f":"IF(N7>0,INDEX(Poeng!$A$1:$B$100,N7,2),\"\")","v":60},5,{"$f":"IF(P7>0,INDEX(Poeng!$A$1:$B$100,P7,2),\"\")","v":45},40,60,45,80,60,45,80,60,60,45,245,6,24540303022.5,4]
[5,"Ottar Rekstad","Byåsen IL",240,"F",2,{"$f":"IF(F8>0,INDEX(Poeng!$A$1:$B$100,F8,2),\"\")","v":80},4,{"$f":"IF(H8>0,INDEX(Poeng!$A$1:$B$100,H8,2),\"\")","v":50},9,{"$f":"IF(J8>0,INDEX(Poeng!$A$1:$B$100,J8,2),\"\")","v":29},4,{"$f":"IF(L8>0,INDEX(Poeng!$A$1:$B$100,L8,2),\"\")","v":50},4,{"$f":"IF(N8>0,INDEX(Poeng!$A$1:$B$100,N8,2),\"\")","v":50},3,{"$f":"IF(P8>0,INDEX(Poeng!$A$1:$B$100,P8,2),\"\")","v":60},80,50,29,50,50,60,80,60,50,50,240,6,24040302525,5]
[6,"Sverre Smistad","Byåsen IL",215,"F",9,{"$f":"IF(F9>0,INDEX(Poeng!$A$1:$B$100,F9,2),\"\")","v":29},6,{"$f":"IF(H9>0,INDEX(Poeng!$A$1:$B$100,H9,2),\"\")","v":40},4,{"$f":"IF(J9>0,INDEX(Poeng!$A$1:$B$100,J9,2),\"\")","v":50},5,{"$f":"IF(L9>0,INDEX(Poeng!$A$1:$B$100,L9,2),\"\")","v":45},6,{"$f":"IF(N9>0,INDEX(Poeng!$A$1:$B$100,N9,2),\"\")","v":40},2,{"$f":"IF(P9>0,INDEX(Poeng!$A$1:$B$100,P9,2),\"\")","v":80},29,40,50,45,40,80,80,50,45,40,215,6,21540252270,6]
[7,"Philip Lindkvist-Fløtten","Strindheim IL ",164," ",1,{"$f":"IF(F10>0,INDEX(Poeng!$A$1:$B$100,F10,2),\"\")","v":100},null,{"$f":"IF(H10>0,INDEX(Poeng!$A$1:$B$100,H10,2),\"\")","v":""},6,{"$f":"IF(J10>0,INDEX(Poeng!$A$1:$B$100,J10,2),\"\")","v":40},11,{"$f":"IF(L10>0,INDEX(Poeng!$A$1:$B$100,L10,2),\"\")","v":24},null,{"$f":"IF(N10>0,INDEX(Poeng!$A$1:$B$100,N10,2),\"\")","v":""},null,{"$f":"IF(P10>0,INDEX(Poeng!$A$1:$B$100,P10,2),\"\")","v":""},100,0,40,24,0,0,100,40,24,0,164,3,16450201200,7]
[8,"Erik Sjømo","Ranheim SK",162,"F",10,{"$f":"IF(F11>0,INDEX(Poeng!$A$1:$B$100,F11,2),\"\")","v":26},11,{"$f":"IF(H11>0,INDEX(Poeng!$A$1:$B$100,H11,2),\"\")","v":24},2,{"$f":"IF(J11>0,INDEX(Poeng!$A$1:$B$100,J11,2),\"\")","v":80},8,{"$f":"IF(L11>0,INDEX(Poeng!$A$1:$B$100,L11,2),\"\")","v":32},null,{"$f":"IF(N11>0,INDEX(Poeng!$A$1:$B$100,N11,2),\"\")","v":""},null,{"$f":"IF(P11>0,INDEX(Poeng!$A$1:$B$100,P11,2),\"\")","v":""},26,24,80,32,0,0,80,32,26,24,162,4,16240161312,8]
[9,"Jørgen Storli","Strindheim IL ",148,"F",7,{"$f":"IF(F12>0,INDEX(Poeng!$A$1:$B$100,F12,2),\"\")","v":36},9,{"$f":"IF(H12>0,INDEX(Poeng!$A$1:$B$100,H12,2),\"\")","v":29},7,{"$f":"IF(J12>0,INDEX(Poeng!$A$1:$B$100,J12,2),\"\")","v":36},7,{"$f":"IF(L12>0,INDEX(Poeng!$A$1:$B$100,L12,2),\"\")","v":36},16,{"$f":"IF(N12>0,INDEX(Poeng!$A$1:$B$100,N12,2),\"\")","v":15},6,{"$f":"IF(P12>0,INDEX(Poeng!$A$1:$B$100,P12,2),\"\")","v":40},36,29,36,36,15,40,40,36,36,36,148,6,14820181818,9]
[10,"Kristian Viken Strand","Byåsen IL",123,"F",8,{"$f":"IF(F13>0,INDEX(Poeng!$A$1:$B$100,F13,2),\"\")","v":32},7,{"$f":"IF(H13>0,INDEX(Poeng!$A$1:$B$100,H13,2),\"\")","v":36},12,{"$f":"IF(J13>0,INDEX(Poeng!$A$1:$B$100,J13,2),\"\")","v":22},12,{"$f":"IF(L13>0,INDEX(Poeng!$A$1:$B$100,L13,2),\"\")","v":22},9,{"$f":"IF(N13>0,INDEX(Poeng!$A$1:$B$100,N13,2),\"\")","v":29},10,{"$f":"IF(P13>0,INDEX(Poeng!$A$1:$B$100,P13,2),\"\")","v":26},32,36,22,22,29,26,36,32,29,26,123,6,12318161463,10]
[11,"Oliver Furuhaug","Byåsen IL",122,"F",11,{"$f":"IF(F14>0,INDEX(Poeng!$A$1:$B$100,F14,2),\"\")","v":24},13,{"$f":"IF(H14>0,INDEX(Poeng!$A$1:$B$100,H14,2),\"\")","v":20},8,{"$f":"IF(J14>0,INDEX(Poeng!$A$1:$B$100,J14,2),\"\")","v":32},9,{"$f":"IF(L14>0,INDEX(Poeng!$A$1:$B$100,L14,2),\"\")","v":29},8,{"$f":"IF(N14>0,INDEX(Poeng!$A$1:$B$100,N14,2),\"\")","v":32},9,{"$f":"IF(P14>0,INDEX(Poeng!$A$1:$B$100,P14,2),\"\")","v":29},24,20,32,29,32,29,32,32,29,29,122,6,12216161464.5,11]
[12,"Endre Sæterbø Nielsen","Strindheim IL ",118,"F",11,{"$f":"IF(F15>0,INDEX(Poeng!$A$1:$B$100,F15,2),\"\")","v":24},8,{"$f":"IF(H15>0,INDEX(Poeng!$A$1:$B$100,H15,2),\"\")","v":32},15,{"$f":"IF(J15>0,INDEX(Poeng!$A$1:$B$100,J15,2),\"\")","v":16},10,{"$f":"IF(L15>0,INDEX(Poeng!$A$1:$B$100,L15,2),\"\")","v":26},13,{"$f":"IF(N15>0,INDEX(Poeng!$A$1:$B$100,N15,2),\"\")","v":20},7,{"$f":"IF(P15>0,INDEX(Poeng!$A$1:$B$100,P15,2),\"\")","v":36},24,32,16,26,20,36,36,32,26,24,118,6,11818161312,12]
[13,"Håkon Moe Berg","Kyrksæterøra IL",112,"F",16,{"$f":"IF(F16>0,INDEX(Poeng!$A$1:$B$100,F16,2),\"\")","v":15},9,{"$f":"IF(H16>0,INDEX(Poeng!$A$1:$B$100,H16,2),\"\")","v":29},16,{"$f":"IF(J16>0,INDEX(Poeng!$A$1:$B$100,J16,2),\"\")","v":15},null,{"$f":"IF(L16>0,INDEX(Poeng!$A$1:$B$100,L16,2),\"\")","v":""},7,{"$f":"IF(N16>0,INDEX(Poeng!$A$1:$B$100,N16,2),\"\")","v":36},8,{"$f":"IF(P16>0,INDEX(Poeng!$A$1:$B$100,P16,2),\"\")","v":32},15,29,15,0,36,32,36,32,29,15,112,5,11218161457.5,13]
[14,"Jonas Bakken Berg","Leik, IL",93,"F",24,{"$f":"IF(F17>0,INDEX(Poeng!$A$1:$B$100,F17,2),\"\")","v":7},15,{"$f":"IF(H17>0,INDEX(Poeng!$A$1:$B$100,H17,2),\"\")","v":16},17,{"$f":"IF(J17>0,INDEX(Poeng!$A$1:$B$100,J17,2),\"\")","v":14},14,{"$f":"IF(L17>0,INDEX(Poeng!$A$1:$B$100,L17,2),\"\")","v":18},5,{"$f":"IF(N17>0,INDEX(Poeng!$A$1:$B$100,N17,2),\"\")","v":45},null,{"$f":"IF(P17>0,INDEX(Poeng!$A$1:$B$100,P17,2),\"\")","v":""},7,16,14,18,45,0,45,18,16,14,93,5,9322590807,14]
[15,"Milo Mathias Høve Ødegaard","Strindheim IL ",77,"F",19,{"$f":"IF(F18>0,INDEX(Poeng!$A$1:$B$100,F18,2),\"\")","v":12},14,{"$f":"IF(H18>0,INDEX(Poeng!$A$1:$B$100,H18,2),\"\")","v":18},18,{"$f":"IF(J18>0,INDEX(Poeng!$A$1:$B$100,J18,2),\"\")","v":13},26,{"$f":"IF(L18>0,INDEX(Poeng!$A$1:$B$100,L18,2),\"\")","v":5},12,{"$f":"IF(N18>0,INDEX(Poeng!$A$1:$B$100,N18,2),\"\")","v":22},11,{"$f":"IF(P18>0,INDEX(Poeng!$A$1:$B$100,P18,2),\"\")","v":24},12,18,13,5,22,24,24,22,18,13,77,6,7712110906.5,15]
[16,"Nichlas Storø","Hommelvik IL",75,"F",18,{"$f":"IF(F19>0,INDEX(Poeng!$A$1:$B$100,F19,2),\"\")","v":13},null,{"$f":"IF(H19>0,INDEX(Poeng!$A$1:$B$100,H19,2),\"\")","v":""},11,{"$f":"IF(J19>0,INDEX(Poeng!$A$1:$B$100,J19,2),\"\")","v":24},null,{"$f":"IF(L19>0,INDEX(Poeng!$A$1:$B$100,L19,2),\"\")","v":""},14,{"$f":"IF(N19>0,INDEX(Poeng!$A$1:$B$100,N19,2),\"\")","v":18},13,{"$f":"IF(P19>0,INDEX(Poeng!$A$1:$B$100,P19,2),\"\")","v":20},13,0,24,0,18,20,24,20,18,13,75,4,7512100906.5,16]
[17,"Even Jordet Ratøien","Meldal IL",66,"F",17,{"$f":"IF(F20>0,INDEX(Poeng!$A$1:$B$100,F20,2),\"\")","v":14},17,{"$f":"IF(H20>0,INDEX(Poeng!$A$1:$B$100,H20,2),\"\")","v":14},null,{"$f":"IF(J20>0,INDEX(Poeng!$A$1:$B$100,J20,2),\"\")","v":""},19,{"$f":"IF(L20>0,INDEX(Poeng!$A$1:$B$100,L20,2),\"\")","v":12},15,{"$f":"IF(N20>0,INDEX(Poeng!$A$1:$B$100,N20,2),\"\")","v":16},12,{"$f":"IF(P20>0,INDEX(Poeng!$A$1:$B$100,P20,2),\"\")","v":22},14,14,0,12,16,22,22,16,14,14,66,5,6611080707,17]
[18,"Jonathan Hovdal","Klæbu IL",52,"F",25,{"$f":"IF(F21>0,INDEX(Poeng!$A$1:$B$100,F21,2),\"\")","v":6},19,{"$f":"IF(H21>0,INDEX(Poeng!$A$1:$B$100,H21,2),\"\")","v":12},21,{"$f":"IF(J21>0,INDEX(Poeng!$A$1:$B$100,J21,2),\"\")","v":10},18,{"$f":"IF(L21>0,INDEX(Poeng!$A$1:$B$100,L21,2),\"\")","v":13},18,{"$f":"IF(N21>0,INDEX(Poeng!$A$1:$B$100,N21,2),\"\")","v":13},17,{"$f":"IF(P21>0,INDEX(Poeng!$A$1:$B$100,P21,2),\"\")","v":14},6,12,10,13,13,14,14,13,13,12,52,6,5207065656,18]
[19,"Arnulf Stefanussen","Ranheim SK",50," ",null,null,null,{"$f":"IF(H22>0,INDEX(Poeng!$A$1:$B$100,H22,2),\"\")","v":""},10,{"$f":"IF(J22>0,INDEX(Poeng!$A$1:$B$100,J22,2),\"\")","v":26},null,{"$f":"IF(L22>0,INDEX(Poeng!$A$1:$B$100,L22,2),\"\")","v":""},11,{"$f":"IF(N22>0,INDEX(Poeng!$A$1:$B$100,N22,2),\"\")","v":24},null,{"$f":"IF(P22>0,INDEX(Poeng!$A$1:$B$100,P22,2),\"\")","v":""},0,0,26,0,24,0,26,24,0,0,50,2,5013120000,19]
[20,"Gustav Bjørgen Sjøvold","Strindheim IL ",48,"F",26,{"$f":"IF(F23>0,INDEX(Poeng!$A$1:$B$100,F23,2),\"\")","v":5},21,{"$f":"IF(H23>0,INDEX(Poeng!$A$1:$B$100,H23,2),\"\")","v":10},20,{"$f":"IF(J23>0,INDEX(Poeng!$A$1:$B$100,J23,2),\"\")","v":11},22,{"$f":"IF(L23>0,INDEX(Poeng!$A$1:$B$100,L23,2),\"\")","v":9},19,{"$f":"IF(N23>0,INDEX(Poeng!$A$1:$B$100,N23,2),\"\")","v":12},16,{"$f":"IF(P23>0,INDEX(Poeng!$A$1:$B$100,P23,2),\"\")","v":15},5,10,11,9,12,15,15,12,11,10,48,6,4807560555,20]
[21,"Ask Holmvassdal","Ranheim SK",43,"F",23,{"$f":"IF(F24>0,INDEX(Poeng!$A$1:$B$100,F24,2),\"\")","v":8},16,{"$f":"IF(H24>0,INDEX(Poeng!$A$1:$B$100,H24,2),\"\")","v":15},19,{"$f":"IF(J24>0,INDEX(Poeng!$A$1:$B$100,J24,2),\"\")","v":12},23,{"$f":"IF(L24>0,INDEX(Poeng!$A$1:$B$100,L24,2),\"\")","v":8},null,{"$f":"IF(N24>0,INDEX(Poeng!$A$1:$B$100,N24,2),\"\")","v":""},null,{"$f":"IF(P24>0,INDEX(Poeng!$A$1:$B$100,P24,2),\"\")","v":""},8,15,12,8,0,0,15,12,8,8,43,4,4307560404,21]
[22,"Anders Spets Renå","Hommelvik IL",42," ",null,null,null,{"$f":"IF(H25>0,INDEX(Poeng!$A$1:$B$100,H25,2),\"\")","v":""},null,{"$f":"IF(J25>0,INDEX(Poeng!$A$1:$B$100,J25,2),\"\")","v":""},15,{"$f":"IF(L25>0,INDEX(Poeng!$A$1:$B$100,L25,2),\"\")","v":16},10,{"$f":"IF(N25>0,INDEX(Poeng!$A$1:$B$100,N25,2),\"\")","v":26},null,{"$f":"IF(P25>0,INDEX(Poeng!$A$1:$B$100,P25,2),\"\")","v":""},0,0,0,16,26,0,26,16,0,0,42,2,4213080000,22]
[23,"Sigurd Ekle-Danielsen","Strindheim IL ",42," ",21,{"$f":"IF(F26>0,INDEX(Poeng!$A$1:$B$100,F26,2),\"\")","v":10},null,{"$f":"IF(H26>0,INDEX(Poeng!$A$1:$B$100,H26,2),\"\")","v":""},null,{"$f":"IF(J26>0,INDEX(Poeng!$A$1:$B$100,J26,2),\"\")","v":""},null,{"$f":"IF(L26>0,INDEX(Poeng!$A$1:$B$100,L26,2),\"\")","v":""},17,{"$f":"IF(N26>0,INDEX(Poeng!$A$1:$B$100,N26,2),\"\")","v":14},14,{"$f":"IF(P26>0,INDEX(Poeng!$A$1:$B$100,P26,2),\"\")","v":18},10,0,0,0,14,18,18,14,10,0,42,3,4209070500,23]
[24,"Eirik Høgli","Byåsen IL",40," ",null,{"$f":"IF(F27>0,INDEX(Poeng!$A$1:$B$100,F27,2),\"\")","v":""},12,{"$f":"IF(H27>0,INDEX(Poeng!$A$1:$B$100,H27,2),\"\")","v":22},14,{"$f":"IF(J27>0,INDEX(Poeng!$A$1:$B$100,J27,2),\"\")","v":18},null,{"$f":"IF(L27>0,INDEX(Poeng!$A$1:$B$100,L27,2),\"\")","v":""},null,{"$f":"IF(N27>0,INDEX(Poeng!$A$1:$B$100,N27,2),\"\")","v":""},null,{"$f":"IF(P27>0,INDEX(Poeng!$A$1:$B$100,P27,2),\"\")","v":""},0,22,18,0,0,0,22,18,0,0,40,2,4011090000,24]
[25,"Alf Håvard Bråten Stensø","Flatås IL",40," ",13,{"$f":"IF(F28>0,INDEX(Poeng!$A$1:$B$100,F28,2),\"\")","v":20},null,{"$f":"IF(H28>0,INDEX(Poeng!$A$1:$B$100,H28,2),\"\")","v":""},null,{"$f":"IF(J28>0,INDEX(Poeng!$A$1:$B$100,J28,2),\"\")","v":""},13,{"$f":"IF(L28>0,INDEX(Poeng!$A$1:$B$100,L28,2),\"\")","v":20},null,{"$f":"IF(N28>0,INDEX(Poeng!$A$1:$B$100,N28,2),\"\")","v":""},null,{"$f":"IF(P28>0,INDEX(Poeng!$A$1:$B$100,P28,2),\"\")","v":""},20,0,0,20,0,0,20,20,0,0,40,2,4010100000,25]
[26,"Magnus Gravdal Brusveen","Strindheim IL ",39,"F",27,{"$f":"IF(F29>0,INDEX(Poeng!$A$1:$B$100,F29,2),\"\")","v":4},22,{"$f":"IF(H29>0,INDEX(Poeng!$A$1:$B$100,H29,2),\"\")","v":9},25,{"$f":"IF(J29>0,INDEX(Poeng!$A$1:$B$100,J29,2),\"\")","v":6},25,{"$f":"IF(L29>0,INDEX(Poeng!$A$1:$B$100,L29,2),\"\")","v":6},20,{"$f":"IF(N29>0,INDEX(Poeng!$A$1:$B$100,N29,2),\"\")","v":11},18,{"$f":"IF(P29>0,INDEX(Poeng!$A$1:$B$100,P29,2),\"\")","v":13},4,9,6,6,11,13,13,11,9,6,39,6,3906555453,26]
[27,"Ludvik Storler Snøfugl","Byaasen Skiklub",39,"F",22,{"$f":"IF(F30>0,INDEX(Poeng!$A$1:$B$100,F30,2),\"\")","v":9},20,{"$f":"IF(H30>0,INDEX(Poeng!$A$1:$B$100,H30,2),\"\")","v":11},24,{"$f":"IF(J30>0,INDEX(Poeng!$A$1:$B$100,J30,2),\"\")","v":7},null,{"$f":"IF(L30>0,INDEX(Poeng!$A$1:$B$100,L30,2),\"\")","v":""},null,{"$f":"IF(N30>0,INDEX(Poeng!$A$1:$B$100,N30,2),\"\")","v":""},19,{"$f":"IF(P30>0,INDEX(Poeng!$A$1:$B$100,P30,2),\"\")","v":12},9,11,7,0,0,12,12,11,9,7,39,4,3906055453.5,27]
[28,"Theodor Eikemo-Nilsen","Byåsen IL",36," ",null,{"$f":"IF(F31>0,INDEX(Poeng!$A$1:$B$100,F31,2),\"\")","v":""},18,{"$f":"IF(H31>0,INDEX(Poeng!$A$1:$B$100,H31,2),\"\")","v":13},22,{"$f":"IF(J31>0,INDEX(Poeng!$A$1:$B$100,J31,2),\"\")","v":9},17,{"$f":"IF(L31>0,INDEX(Poeng!$A$1:$B$100,L31,2),\"\")","v":14},null,{"$f":"IF(N31>0,INDEX(Poeng!$A$1:$B$100,N31,2),\"\")","v":""},null,{"$f":"IF(P31>0,INDEX(Poeng!$A$1:$B$100,P31,2),\"\")","v":""},{"$f":"IF(F31>0,G31,0)","v":0},{"$f":"IF(H31>0,I31,0)","v":13},{"$f":"IF(J31>0,K31,0)","v":9},{"$f":"IF(L31>0,M31,0)","v":14},{"$f":"IF(N31>0,O31,0)","v":0},{"$f":"IF(P31>0,Q31,0)","v":0},{"$f":"LARGE(R31:W31,1)","v":14},{"$f":"LARGE(R31:W31,2)","v":13},{"$f":"LARGE(R31:W31,3)","v":9},{"$f":"LARGE(R31:W31,4)","v":0},36,{"$f":"COUNT(F31:Q31)/2","v":3},3607065450,28]
[29,"Steinar Sugustad","Skaun IL",31," ",15,{"$f":"IF(F32>0,INDEX(Poeng!$A$1:$B$100,F32,2),\"\")","v":16},null,{"$f":"IF(H32>0,INDEX(Poeng!$A$1:$B$100,H32,2),\"\")","v":""},null,{"$f":"IF(J32>0,INDEX(Poeng!$A$1:$B$100,J32,2),\"\")","v":""},16,{"$f":"IF(L32>0,INDEX(Poeng!$A$1:$B$100,L32,2),\"\")","v":15},null,{"$f":"IF(N32>0,INDEX(Poeng!$A$1:$B$100,N32,2),\"\")","v":""},null,{"$f":"IF(P32>0,INDEX(Poeng!$A$1:$B$100,P32,2),\"\")","v":""},16,0,0,15,0,0,16,15,0,0,31,2,3108075000,29]
[30,"Linus Stilson Arstad","Strindheim IL ",27," ",null,null,null,{"$f":"IF(H33>0,INDEX(Poeng!$A$1:$B$100,H33,2),\"\")","v":""},null,{"$f":"IF(J33>0,INDEX(Poeng!$A$1:$B$100,J33,2),\"\")","v":""},20,{"$f":"IF(L33>0,INDEX(Poeng!$A$1:$B$100,L33,2),\"\")","v":11},null,{"$f":"IF(N33>0,INDEX(Poeng!$A$1:$B$100,N33,2),\"\")","v":""},15,{"$f":"IF(P33>0,INDEX(Poeng!$A$1:$B$100,P33,2),\"\")","v":16},0,0,0,11,0,16,16,11,0,0,{"$f":"SUM(X33:AA33)","v":27},2,{"$f":"AB33*10^8+X33*10^6/2+Y33*10^4/2+Z33*10^2/2+AA33/2","v":2708055000},30]
[31,"Martin Haabeth","IL Aasguten",18," ",14,{"$f":"IF(F34>0,INDEX(Poeng!$A$1:$B$100,F34,2),\"\")","v":18},null,{"$f":"IF(H34>0,INDEX(Poeng!$A$1:$B$100,H34,2),\"\")","v":""},null,{"$f":"IF(J34>0,INDEX(Poeng!$A$1:$B$100,J34,2),\"\")","v":""},null,{"$f":"IF(L34>0,INDEX(Poeng!$A$1:$B$100,L34,2),\"\")","v":""},null,{"$f":"IF(N34>0,INDEX(Poeng!$A$1:$B$100,N34,2),\"\")","v":""},null,{"$f":"IF(P34>0,INDEX(Poeng!$A$1:$B$100,P34,2),\"\")","v":""},18,0,0,0,0,0,18,0,0,0,18,1,1809000000,31]
[32,"Magnus Stormo Isaksen","Byaasen Skiklub",11," ",20,{"$f":"IF(F35>0,INDEX(Poeng!$A$1:$B$100,F35,2),\"\")","v":11},null,{"$f":"IF(H35>0,INDEX(Poeng!$A$1:$B$100,H35,2),\"\")","v":""},null,{"$f":"IF(J35>0,INDEX(Poeng!$A$1:$B$100,J35,2),\"\")","v":""},null,{"$f":"IF(L35>0,INDEX(Poeng!$A$1:$B$100,L35,2),\"\")","v":""},null,{"$f":"IF(N35>0,INDEX(Poeng!$A$1:$B$100,N35,2),\"\")","v":""},null,{"$f":"IF(P35>0,INDEX(Poeng!$A$1:$B$100,P35,2),\"\")","v":""},11,0,0,0,0,0,11,0,0,0,11,1,1105500000,32]
[33,"Remi Korsnes Andresen","Klæbu IL",10," ",null,null,null,{"$f":"IF(H36>0,INDEX(Poeng!$A$1:$B$100,H36,2),\"\")","v":""},null,{"$f":"IF(J36>0,INDEX(Poeng!$A$1:$B$100,J36,2),\"\")","v":""},21,{"$f":"IF(L36>0,INDEX(Poeng!$A$1:$B$100,L36,2),\"\")","v":10},null,{"$f":"IF(N36>0,INDEX(Poeng!$A$1:$B$100,N36,2),\"\")","v":""},null,{"$f":"IF(P36>0,INDEX(Poeng!$A$1:$B$100,P36,2),\"\")","v":""},0,0,0,10,0,0,10,0,0,0,10,1,1005000000,{"$f":"IF(B36<>\"\",RANK(AD36,AD$4:AD$51,0),\"\")","v":33}]
[34,"Simon Frøseth","Hommelvik IL",8," ",null,null,null,{"$f":"IF(H37>0,INDEX(Poeng!$A$1:$B$100,H37,2),\"\")","v":""},23,{"$f":"IF(J37>0,INDEX(Poeng!$A$1:$B$100,J37,2),\"\")","v":8},null,{"$f":"IF(L37>0,INDEX(Poeng!$A$1:$B$100,L37,2),\"\")","v":""},null,{"$f":"IF(N37>0,INDEX(Poeng!$A$1:$B$100,N37,2),\"\")","v":""},null,{"$f":"IF(P37>0,INDEX(Poeng!$A$1:$B$100,P37,2),\"\")","v":""},0,0,8,0,0,0,8,0,0,0,8,1,804000000,34]
[35,"Ola Uvaas","Skaun IL",7," ",null,null,null,{"$f":"IF(H38>0,INDEX(Poeng!$A$1:$B$100,H38,2),\"\")","v":""},null,{"$f":"IF(J38>0,INDEX(Poeng!$A$1:$B$100,J38,2),\"\")","v":""},24,{"$f":"IF(L38>0,INDEX(Poeng!$A$1:$B$100,L38,2),\"\")","v":7},null,{"$f":"IF(N38>0,INDEX(Poeng!$A$1:$B$100,N38,2),\"\")","v":""},null,{"$f":"IF(P38>0,INDEX(Poeng!$A$1:$B$100,P38,2),\"\")","v":""},0,0,0,7,0,0,7,0,0,0,7,1,703500000,35]
[36,"Sondre Aune","Strindheim IL ",4," ",27,{"$f":"IF(F39>0,INDEX(Poeng!$A$1:$B$100,F39,2),\"\")","v":4},null,{"$f":"IF(H39>0,INDEX(Poeng!$A$1:$B$100,H39,2),\"\")","v":""},null,{"$f":"IF(J39>0,INDEX(Poeng!$A$1:$B$100,J39,2),\"\")","v":""},null,{"$f":"IF(L39>0,INDEX(Poeng!$A$1:$B$100,L39,2),\"\")","v":""},null,{"$f":"IF(N39>0,INDEX(Poeng!$A$1:$B$100,N39,2),\"\")","v":""},null,{"$f":"IF(P39>0,INDEX(Poeng!$A$1:$B$100,P39,2),\"\")","v":""},4,0,0,0,0,0,4,0,0,0,4,1,402000000,36]
[{"$f":"AE40","v":""},null,null,{"$f":"IF(B40<>\"\",AB40,\"\")","v":""},{"$f":"IF(AC40<4,\" \",\"F\")","v":" "},null,null,null,{"$f":"IF(H40>0,INDEX(Poeng!$A$1:$B$100,H40,2),\"\")","v":""},null,{"$f":"IF(J40>0,INDEX(Poeng!$A$1:$B$100,J40,2),\"\")","v":""},null,{"$f":"IF(L40>0,INDEX(Poeng!$A$1:$B$100,L40,2),\"\")","v":""},null,{"$f":"IF(N40>0,INDEX(Poeng!$A$1:$B$100,N40,2),\"\")","v":""},null,{"$f":"IF(P40>0,INDEX(Poeng!$A$1:$B$100,P40,2),\"\")","v":""},0,0,0,0,0,0,0,0,0,0,0,0,0,""]
[{"$f":"AE41","v":""},null,null,{"$f":"IF(B41<>\"\",AB41,\"\")","v":""},{"$f":"IF(AC41<4,\" \",\"F\")","v":" "},null,null,null,{"$f":"IF(H41>0,INDEX(Poeng!$A$1:$B$100,H41,2),\"\")","v":""},null,{"$f":"IF(J41>0,INDEX(Poeng!$A$1:$B$100,J41,2),\"\")","v":""},null,{"$f":"IF(L41>0,INDEX(Poeng!$A$1:$B$100,L41,2),\"\")","v":""},null,{"$f":"IF(N41>0,INDEX(Poeng!$A$1:$B$100,N41,2),\"\")","v":""},null,{"$f":"IF(P41>0,INDEX(Poeng!$A$1:$B$100,P41,2),\"\")","v":""},0,0,0,0,0,0,0,0,0,0,0,0,0,""]
["",null,null,"",{"$f":"IF(AC42<4,\" \",\"F\")","v":" "},null,null,null,{"$f":"IF(H42>0,INDEX(Poeng!$A$1:$B$100,H42,2),\"\")","v":""},null,{"$f":"IF(J42>0,INDEX(Poeng!$A$1:$B$100,J42,2),\"\")","v":""},null,{"$f":"IF(L42>0,INDEX(Poeng!$A$1:$B$100,L42,2),\"\")","v":""},null,{"$f":"IF(N42>0,INDEX(Poeng!$A$1:$B$100,N42,2),\"\")","v":""},null,{"$f":"IF(P42>0,INDEX(Poeng!$A$1:$B$100,P42,2),\"\")","v":""},0,0,0,0,0,0,0,0,0,0,0,0,0,""]
["",null,null,""," ",null,null,null,{"$f":"IF(H43>0,INDEX(Poeng!$A$1:$B$100,H43,2),\"\")","v":""},null,{"$f":"IF(J43>0,INDEX(Poeng!$A$1:$B$100,J43,2),\"\")","v":""},null,{"$f":"IF(L43>0,INDEX(Poeng!$A$1:$B$100,L43,2),\"\")","v":""},null,{"$f":"IF(N43>0,INDEX(Poeng!$A$1:$B$100,N43,2),\"\")","v":""},null,{"$f":"IF(P43>0,INDEX(Poeng!$A$1:$B$100,P43,2),\"\")","v":""},0,0,0,0,0,0,0,0,0,0,0,0,0,""]
["",null,null,""," ",null,null,null,{"$f":"IF(H44>0,INDEX(Poeng!$A$1:$B$100,H44,2),\"\")","v":""},null,{"$f":"IF(J44>0,INDEX(Poeng!$A$1:$B$100,J44,2),\"\")","v":""},null,{"$f":"IF(L44>0,INDEX(Poeng!$A$1:$B$100,L44,2),\"\")","v":""},null,{"$f":"IF(N44>0,INDEX(Poeng!$A$1:$B$100,N44,2),\"\")","v":""},null,{"$f":"IF(P44>0,INDEX(Poeng!$A$1:$B$100,P44,2),\"\")","v":""},0,0,0,0,0,0,0,0,0,0,0,0,0,""]
["",null,null,""," ",null,null,null,{"$f":"IF(H45>0,INDEX(Poeng!$A$1:$B$100,H45,2),\"\")","v":""},null,{"$f":"IF(J45>0,INDEX(Poeng!$A$1:$B$100,J45,2),\"\")","v":""},null,{"$f":"IF(L45>0,INDEX(Poeng!$A$1:$B$100,L45,2),\"\")","v":""},null,{"$f":"IF(N45>0,INDEX(Poeng!$A$1:$B$100,N45,2),\"\")","v":""},null,{"$f":"IF(P45>0,INDEX(Poeng!$A$1:$B$100,P45,2),\"\")","v":""},0,0,0,0,0,0,0,0,0,0,0,0,0,""]
["",null,null,""," ",null,null,null,{"$f":"IF(H46>0,INDEX(Poeng!$A$1:$B$100,H46,2),\"\")","v":""},null,{"$f":"IF(J46>0,INDEX(Poeng!$A$1:$B$100,J46,2),\"\")","v":""},null,{"$f":"IF(L46>0,INDEX(Poeng!$A$1:$B$100,L46,2),\"\")","v":""},null,{"$f":"IF(N46>0,INDEX(Poeng!$A$1:$B$100,N46,2),\"\")","v":""},null,{"$f":"IF(P46>0,INDEX(Poeng!$A$1:$B$100,P46,2),\"\")","v":""},0,0,0,0,0,0,0,0,0,0,0,0,0,""]
["",null,null,""," ",null,null,null,{"$f":"IF(H47>0,INDEX(Poeng!$A$1:$B$100,H47,2),\"\")","v":""},null,{"$f":"IF(J47>0,INDEX(Poeng!$A$1:$B$100,J47,2),\"\")","v":""},null,{"$f":"IF(L47>0,INDEX(Poeng!$A$1:$B$100,L47,2),\"\")","v":""},null,{"$f":"IF(N47>0,INDEX(Poeng!$A$1:$B$100,N47,2),\"\")","v":""},null,{"$f":"IF(P47>0,INDEX(Poeng!$A$1:$B$100,P47,2),\"\")","v":""},0,0,0,0,0,0,0,0,0,0,0,0,0,""]
["",null,null,""," ",null,null,null,{"$f":"IF(H48>0,INDEX(Poeng!$A$1:$B$100,H48,2),\"\")","v":""},null,{"$f":"IF(J48>0,INDEX(Poeng!$A$1:$B$100,J48,2),\"\")","v":""},null,{"$f":"IF(L48>0,INDEX(Poeng!$A$1:$B$100,L48,2),\"\")","v":""},null,{"$f":"IF(N48>0,INDEX(Poeng!$A$1:$B$100,N48,2),\"\")","v":""},null,{"$f":"IF(P48>0,INDEX(Poeng!$A$1:$B$100,P48,2),\"\")","v":""},0,0,0,0,0,0,0,0,0,0,0,0,0,""]
["",null,null,""," ",null,null,null,{"$f":"IF(H49>0,INDEX(Poeng!$A$1:$B$100,H49,2),\"\")","v":""},null,{"$f":"IF(J49>0,INDEX(Poeng!$A$1:$B$100,J49,2),\"\")","v":""},null,{"$f":"IF(L49>0,INDEX(Poeng!$A$1:$B$100,L49,2),\"\")","v":""},null,{"$f":"IF(N49>0,INDEX(Poeng!$A$1:$B$100,N49,2),\"\")","v":""},null,{"$f":"IF(P49>0,INDEX(Poeng!$A$1:$B$100,P49,2),\"\")","v":""},0,0,0,0,0,0,0,0,0,0,0,0,0,""]
["",null,null,""," ",null,null,null,{"$f":"IF(H50>0,INDEX(Poeng!$A$1:$B$100,H50,2),\"\")","v":""},null,{"$f":"IF(J50>0,INDEX(Poeng!$A$1:$B$100,J50,2),\"\")","v":""},null,{"$f":"IF(L50>0,INDEX(Poeng!$A$1:$B$100,L50,2),\"\")","v":""},null,{"$f":"IF(N50>0,INDEX(Poeng!$A$1:$B$100,N50,2),\"\")","v":""},null,{"$f":"IF(P50>0,INDEX(Poeng!$A$1:$B$100,P50,2),\"\")","v":""},0,0,0,0,0,0,0,0,0,0,0,0,0,""]
["",null,null,""," ",null,null,null,{"$f":"IF(H51>0,INDEX(Poeng!$A$1:$B$100,H51,2),\"\")","v":""},null,{"$f":"IF(J51>0,INDEX(Poeng!$A$1:$B$100,J51,2),\"\")","v":""},null,{"$f":"IF(L51>0,INDEX(Poeng!$A$1:$B$100,L51,2),\"\")","v":""},null,{"$f":"IF(N51>0,INDEX(Poeng!$A$1:$B$100,N51,2),\"\")","v":""},null,{"$f":"IF(P51>0,INDEX(Poeng!$A$1:$B$100,P51,2),\"\")","v":""},0,0,0,0,0,0,0,0,0,0,0,0,0,""]
[{"$f":"AE52","v":""},null,null,{"$f":"IF(B52<>\"\",AB52,\"\")","v":""}," ",null,null,null,{"$f":"IF(H52>0,INDEX(Poeng!$A$1:$B$100,H52,2),\"\")","v":""},null,{"$f":"IF(J52>0,INDEX(Poeng!$A$1:$B$100,J52,2),\"\")","v":""},null,{"$f":"IF(L52>0,INDEX(Poeng!$A$1:$B$100,L52,2),\"\")","v":""},null,{"$f":"IF(N52>0,INDEX(Poeng!$A$1:$B$100,N52,2),\"\")","v":""},null,{"$f":"IF(P52>0,INDEX(Poeng!$A$1:$B$100,P52,2),\"\")","v":""},{"$f":"IF(F52>0,G52,0)","v":0},{"$f":"IF(H52>0,I52,0)","v":0},{"$f":"IF(J52>0,K52,0)","v":0},{"$f":"IF(L52>0,M52,0)","v":0},{"$f":"IF(N52>0,O52,0)","v":0},{"$f":"IF(P52>0,Q52,0)","v":0},{"$f":"LARGE(R52:W52,1)","v":0},{"$f":"LARGE(R52:W52,2)","v":0},{"$f":"LARGE(R52:W52,3)","v":0},{"$f":"LARGE(R52:W52,4)","v":0},{"$f":"SUM(X52:AA52)","v":0},{"$f":"COUNT(F52:Q52)/2","v":0},{"$f":"AB52*10^8+X52*10^6/2+Y52*10^4/2+Z52*10^2/2+AA52/2","v":0},""]
["",null,null,""," ",null,null,null,{"$f":"IF(H53>0,INDEX(Poeng!$A$1:$B$100,H53,2),\"\")","v":""},null,{"$f":"IF(J53>0,INDEX(Poeng!$A$1:$B$100,J53,2),\"\")","v":""},null,{"$f":"IF(L53>0,INDEX(Poeng!$A$1:$B$100,L53,2),\"\")","v":""},null,{"$f":"IF(N53>0,INDEX(Poeng!$A$1:$B$100,N53,2),\"\")","v":""},null,{"$f":"IF(P53>0,INDEX(Poeng!$A$1:$B$100,P53,2),\"\")","v":""},0,0,0,0,0,0,0,0,0,0,0,0,0,""]
["",null,null,""," ",null,null,null,{"$f":"IF(H54>0,INDEX(Poeng!$A$1:$B$100,H54,2),\"\")","v":""},null,{"$f":"IF(J54>0,INDEX(Poeng!$A$1:$B$100,J54,2),\"\")","v":""},null,{"$f":"IF(L54>0,INDEX(Poeng!$A$1:$B$100,L54,2),\"\")","v":""},null,{"$f":"IF(N54>0,INDEX(Poeng!$A$1:$B$100,N54,2),\"\")","v":""},null,{"$f":"IF(P54>0,INDEX(Poeng!$A$1:$B$100,P54,2),\"\")","v":""},0,0,0,0,0,0,0,0,0,0,0,0,0,""]
["",null,null,""," ",null,null,null,{"$f":"IF(H55>0,INDEX(Poeng!$A$1:$B$100,H55,2),\"\")","v":""},null,{"$f":"IF(J55>0,INDEX(Poeng!$A$1:$B$100,J55,2),\"\")","v":""},null,{"$f":"IF(L55>0,INDEX(Poeng!$A$1:$B$100,L55,2),\"\")","v":""},null,{"$f":"IF(N55>0,INDEX(Poeng!$A$1:$B$100,N55,2),\"\")","v":""},null,{"$f":"IF(P55>0,INDEX(Poeng!$A$1:$B$100,P55,2),\"\")","v":""},0,0,0,0,0,0,0,0,0,0,0,0,0,""]
["",null,null,""," ",null,null,null,{"$f":"IF(H56>0,INDEX(Poeng!$A$1:$B$100,H56,2),\"\")","v":""},null,{"$f":"IF(J56>0,INDEX(Poeng!$A$1:$B$100,J56,2),\"\")","v":""},null,{"$f":"IF(L56>0,INDEX(Poeng!$A$1:$B$100,L56,2),\"\")","v":""},null,{"$f":"IF(N56>0,INDEX(Poeng!$A$1:$B$100,N56,2),\"\")","v":""},null,{"$f":"IF(P56>0,INDEX(Poeng!$A$1:$B$100,P56,2),\"\")","v":""},0,0,0,0,0,0,0,0,0,0,0,0,0,""]
["",null,null,""," ",null,null,null,{"$f":"IF(H57>0,INDEX(Poeng!$A$1:$B$100,H57,2),\"\")","v":""},null,{"$f":"IF(J57>0,INDEX(Poeng!$A$1:$B$100,J57,2),\"\")","v":""},null,{"$f":"IF(L57>0,INDEX(Poeng!$A$1:$B$100,L57,2),\"\")","v":""},null,{"$f":"IF(N57>0,INDEX(Poeng!$A$1:$B$100,N57,2),\"\")","v":""},null,{"$f":"IF(P57>0,INDEX(Poeng!$A$1:$B$100,P57,2),\"\")","v":""},0,0,0,0,0,0,0,0,0,0,0,0,0,""]
["",null,null,""," ",null,null,null,{"$f":"IF(H58>0,INDEX(Poeng!$A$1:$B$100,H58,2),\"\")","v":""},null,{"$f":"IF(J58>0,INDEX(Poeng!$A$1:$B$100,J58,2),\"\")","v":""},null,{"$f":"IF(L58>0,INDEX(Poeng!$A$1:$B$100,L58,2),\"\")","v":""},null,{"$f":"IF(N58>0,INDEX(Poeng!$A$1:$B$100,N58,2),\"\")","v":""},null,{"$f":"IF(P58>0,INDEX(Poeng!$A$1:$B$100,P58,2),\"\")","v":""},0,0,0,0,0,0,0,0,0,0,0,0,0,""]
["",null,null,""," ",null,null,null,{"$f":"IF(H59>0,INDEX(Poeng!$A$1:$B$100,H59,2),\"\")","v":""},null,{"$f":"IF(J59>0,INDEX(Poeng!$A$1:$B$100,J59,2),\"\")","v":""},null,{"$f":"IF(L59>0,INDEX(Poeng!$A$1:$B$100,L59,2),\"\")","v":""},null,{"$f":"IF(N59>0,INDEX(Poeng!$A$1:$B$100,N59,2),\"\")","v":""},null,{"$f":"IF(P59>0,INDEX(Poeng!$A$1:$B$100,P59,2),\"\")","v":""},0,0,0,0,0,0,0,0,0,0,0,0,0,""]
["",null,null,""," ",null,null,null,{"$f":"IF(H60>0,INDEX(Poeng!$A$1:$B$100,H60,2),\"\")","v":""},null,{"$f":"IF(J60>0,INDEX(Poeng!$A$1:$B$100,J60,2),\"\")","v":""},null,{"$f":"IF(L60>0,INDEX(Poeng!$A$1:$B$100,L60,2),\"\")","v":""},null,{"$f":"IF(N60>0,INDEX(Poeng!$A$1:$B$100,N60,2),\"\")","v":""},null,{"$f":"IF(P60>0,INDEX(Poeng!$A$1:$B$100,P60,2),\"\")","v":""},0,0,0,0,0,0,0,0,0,0,0,0,0,""]
["",null,null,""," ",null,null,null,{"$f":"IF(H61>0,INDEX(Poeng!$A$1:$B$100,H61,2),\"\")","v":""},null,{"$f":"IF(J61>0,INDEX(Poeng!$A$1:$B$100,J61,2),\"\")","v":""},null,{"$f":"IF(L61>0,INDEX(Poeng!$A$1:$B$100,L61,2),\"\")","v":""},null,{"$f":"IF(N61>0,INDEX(Poeng!$A$1:$B$100,N61,2),\"\")","v":""},null,{"$f":"IF(P61>0,INDEX(Poeng!$A$1:$B$100,P61,2),\"\")","v":""},0,0,0,0,0,0,0,0,0,0,0,0,0,""]
[{"$f":"AE62","v":""},null,null,"",{"$f":"IF(AC62<4,\" \",\"F\")","v":" "},null,null,null,{"$f":"IF(H62>0,INDEX(Poeng!$A$1:$B$100,H62,2),\"\")","v":""},null,{"$f":"IF(J62>0,INDEX(Poeng!$A$1:$B$100,J62,2),\"\")","v":""},null,{"$f":"IF(L62>0,INDEX(Poeng!$A$1:$B$100,L62,2),\"\")","v":""},null,{"$f":"IF(N62>0,INDEX(Poeng!$A$1:$B$100,N62,2),\"\")","v":""},null,{"$f":"IF(P62>0,INDEX(Poeng!$A$1:$B$100,P62,2),\"\")","v":""},0,0,0,0,0,0,0,0,0,0,{"$f":"SUM(X62:AA62)","v":0},0,{"$f":"AB62*10^8+X62*10^6/2+Y62*10^4/2+Z62*10^2/2+AA62/2","v":0},""]
["",null,null,""," ",null,null,null,{"$f":"IF(H63>0,INDEX(Poeng!$A$1:$B$100,H63,2),\"\")","v":""},null,{"$f":"IF(J63>0,INDEX(Poeng!$A$1:$B$100,J63,2),\"\")","v":""},null,{"$f":"IF(L63>0,INDEX(Poeng!$A$1:$B$100,L63,2),\"\")","v":""},null,{"$f":"IF(N63>0,INDEX(Poeng!$A$1:$B$100,N63,2),\"\")","v":""},null,{"$f":"IF(P63>0,INDEX(Poeng!$A$1:$B$100,P63,2),\"\")","v":""},0,0,0,0,0,0,0,0,0,0,0,0,0,""]
["",null,null,""," ",null,null,null,{"$f":"IF(H64>0,INDEX(Poeng!$A$1:$B$100,H64,2),\"\")","v":""},null,{"$f":"IF(J64>0,INDEX(Poeng!$A$1:$B$100,J64,2),\"\")","v":""},null,{"$f":"IF(L64>0,INDEX(Poeng!$A$1:$B$100,L64,2),\"\")","v":""},null,{"$f":"IF(N64>0,INDEX(Poeng!$A$1:$B$100,N64,2),\"\")","v":""},null,{"$f":"IF(P64>0,INDEX(Poeng!$A$1:$B$100,P64,2),\"\")","v":""},0,0,0,0,0,0,0,0,0,0,0,0,0,""]
["",null,null,""," ",null,null,null,{"$f":"IF(H65>0,INDEX(Poeng!$A$1:$B$100,H65,2),\"\")","v":""},null,{"$f":"IF(J65>0,INDEX(Poeng!$A$1:$B$100,J65,2),\"\")","v":""},null,{"$f":"IF(L65>0,INDEX(Poeng!$A$1:$B$100,L65,2),\"\")","v":""},null,{"$f":"IF(N65>0,INDEX(Poeng!$A$1:$B$100,N65,2),\"\")","v":""},null,{"$f":"IF(P65>0,INDEX(Poeng!$A$1:$B$100,P65,2),\"\")","v":""},0,0,0,0,0,0,0,0,0,0,0,0,0,""]
["",null,null,""," ",null,null,null,{"$f":"IF(H66>0,INDEX(Poeng!$A$1:$B$100,H66,2),\"\")","v":""},null,{"$f":"IF(J66>0,INDEX(Poeng!$A$1:$B$100,J66,2),\"\")","v":""},null,{"$f":"IF(L66>0,INDEX(Poeng!$A$1:$B$100,L66,2),\"\")","v":""},null,{"$f":"IF(N66>0,INDEX(Poeng!$A$1:$B$100,N66,2),\"\")","v":""},null,{"$f":"IF(P66>0,INDEX(Poeng!$A$1:$B$100,P66,2),\"\")","v":""},0,0,0,0,0,0,0,0,0,0,0,0,0,""]
["",null,null,""," ",null,null,null,{"$f":"IF(H67>0,INDEX(Poeng!$A$1:$B$100,H67,2),\"\")","v":""},null,{"$f":"IF(J67>0,INDEX(Poeng!$A$1:$B$100,J67,2),\"\")","v":""},null,{"$f":"IF(L67>0,INDEX(Poeng!$A$1:$B$100,L67,2),\"\")","v":""},null,{"$f":"IF(N67>0,INDEX(Poeng!$A$1:$B$100,N67,2),\"\")","v":""},null,{"$f":"IF(P67>0,INDEX(Poeng!$A$1:$B$100,P67,2),\"\")","v":""},0,0,0,0,0,0,0,0,0,0,0,0,0,""]
["",null,null,""," ",null,null,null,{"$f":"IF(H68>0,INDEX(Poeng!$A$1:$B$100,H68,2),\"\")","v":""},null,{"$f":"IF(J68>0,INDEX(Poeng!$A$1:$B$100,J68,2),\"\")","v":""},null,{"$f":"IF(L68>0,INDEX(Poeng!$A$1:$B$100,L68,2),\"\")","v":""},null,{"$f":"IF(N68>0,INDEX(Poeng!$A$1:$B$100,N68,2),\"\")","v":""},null,{"$f":"IF(P68>0,INDEX(Poeng!$A$1:$B$100,P68,2),\"\")","v":""},0,0,0,0,0,0,0,0,0,0,0,0,0,{"$f":"IF(B68<>\"\",RANK(AD68,AD$4:AD$51,0),\"\")","v":""}]
["",null,null,""," ",null,null,null,{"$f":"IF(H69>0,INDEX(Poeng!$A$1:$B$100,H69,2),\"\")","v":""},null,{"$f":"IF(J69>0,INDEX(Poeng!$A$1:$B$100,J69,2),\"\")","v":""},null,{"$f":"IF(L69>0,INDEX(Poeng!$A$1:$B$100,L69,2),\"\")","v":""},null,{"$f":"IF(N69>0,INDEX(Poeng!$A$1:$B$100,N69,2),\"\")","v":""},null,{"$f":"IF(P69>0,INDEX(Poeng!$A$1:$B$100,P69,2),\"\")","v":""},0,0,0,0,0,0,0,0,0,0,0,0,0,""]
["",null,null,""," ",null,null,null,{"$f":"IF(H70>0,INDEX(Poeng!$A$1:$B$100,H70,2),\"\")","v":""},null,{"$f":"IF(J70>0,INDEX(Poeng!$A$1:$B$100,J70,2),\"\")","v":""},null,{"$f":"IF(L70>0,INDEX(Poeng!$A$1:$B$100,L70,2),\"\")","v":""},null,{"$f":"IF(N70>0,INDEX(Poeng!$A$1:$B$100,N70,2),\"\")","v":""},null,{"$f":"IF(P70>0,INDEX(Poeng!$A$1:$B$100,P70,2),\"\")","v":""},0,0,0,0,0,0,0,0,0,0,0,0,0,""]
["",null,null,""," ",null,null,null,{"$f":"IF(H71>0,INDEX(Poeng!$A$1:$B$100,H71,2),\"\")","v":""},null,{"$f":"IF(J71>0,INDEX(Poeng!$A$1:$B$100,J71,2),\"\")","v":""},null,{"$f":"IF(L71>0,INDEX(Poeng!$A$1:$B$100,L71,2),\"\")","v":""},null,{"$f":"IF(N71>0,INDEX(Poeng!$A$1:$B$100,N71,2),\"\")","v":""},null,{"$f":"IF(P71>0,INDEX(Poeng!$A$1:$B$100,P71,2),\"\")","v":""},0,0,0,0,0,0,0,0,0,0,0,0,0,""]
["",null,null,""," ",null,null,null,{"$f":"IF(H72>0,INDEX(Poeng!$A$1:$B$100,H72,2),\"\")","v":""},null,{"$f":"IF(J72>0,INDEX(Poeng!$A$1:$B$100,J72,2),\"\")","v":""},null,{"$f":"IF(L72>0,INDEX(Poeng!$A$1:$B$100,L72,2),\"\")","v":""},null,{"$f":"IF(N72>0,INDEX(Poeng!$A$1:$B$100,N72,2),\"\")","v":""},null,{"$f":"IF(P72>0,INDEX(Poeng!$A$1:$B$100,P72,2),\"\")","v":""},0,0,0,0,0,0,0,0,0,0,0,0,0,""]
["",null,null,""," ",null,null,null,{"$f":"IF(H73>0,INDEX(Poeng!$A$1:$B$100,H73,2),\"\")","v":""},null,{"$f":"IF(J73>0,INDEX(Poeng!$A$1:$B$100,J73,2),\"\")","v":""},null,{"$f":"IF(L73>0,INDEX(Poeng!$A$1:$B$100,L73,2),\"\")","v":""},null,{"$f":"IF(N73>0,INDEX(Poeng!$A$1:$B$100,N73,2),\"\")","v":""},null,{"$f":"IF(P73>0,INDEX(Poeng!$A$1:$B$100,P73,2),\"\")","v":""},0,0,0,0,0,0,0,0,0,0,0,0,0,""]
["",null,null,""," ",null,null,null,{"$f":"IF(H74>0,INDEX(Poeng!$A$1:$B$100,H74,2),\"\")","v":""},null,{"$f":"IF(J74>0,INDEX(Poeng!$A$1:$B$100,J74,2),\"\")","v":""},null,{"$f":"IF(L74>0,INDEX(Poeng!$A$1:$B$100,L74,2),\"\")","v":""},null,{"$f":"IF(N74>0,INDEX(Poeng!$A$1:$B$100,N74,2),\"\")","v":""},null,{"$f":"IF(P74>0,INDEX(Poeng!$A$1:$B$100,P74,2),\"\")","v":""},0,0,0,0,0,0,0,0,0,0,0,0,0,""]
["",null,null,""," ",null,null,null,{"$f":"IF(H75>0,INDEX(Poeng!$A$1:$B$100,H75,2),\"\")","v":""},null,{"$f":"IF(J75>0,INDEX(Poeng!$A$1:$B$100,J75,2),\"\")","v":""},null,{"$f":"IF(L75>0,INDEX(Poeng!$A$1:$B$100,L75,2),\"\")","v":""},null,{"$f":"IF(N75>0,INDEX(Poeng!$A$1:$B$100,N75,2),\"\")","v":""},null,{"$f":"IF(P75>0,INDEX(Poeng!$A$1:$B$100,P75,2),\"\")","v":""},0,0,0,0,0,0,0,0,0,0,{"$f":"SUM(X75:AA75)","v":0},0,0,""]
["",null,null,""," ",null,null,null,{"$f":"IF(H76>0,INDEX(Poeng!$A$1:$B$100,H76,2),\"\")","v":""},null,{"$f":"IF(J76>0,INDEX(Poeng!$A$1:$B$100,J76,2),\"\")","v":""},null,{"$f":"IF(L76>0,INDEX(Poeng!$A$1:$B$100,L76,2),\"\")","v":""},null,{"$f":"IF(N76>0,INDEX(Poeng!$A$1:$B$100,N76,2),\"\")","v":""},null,{"$f":"IF(P76>0,INDEX(Poeng!$A$1:$B$100,P76,2),\"\")","v":""},0,0,0,0,0,0,0,0,0,0,{"$f":"SUM(X76:AA76)","v":0},0,0,""]

{"sheet":"G16","index":7,"n_rows":87,"n_cols":32,"rows_kept":87,"cut":false,"hidden":false,"merged":[[0,2,0,16],[1,5,1,6],[1,7,1,8],[1,9,1,10],[1,11,1,12],[1,13,1,14],[1,15,1,16],[2,15,2,16],[2,5,2,6],[2,7,2,8],[2,9,2,10],[2,11,2,12],[2,13,2,14]]}
["Gutter 16",null,"  Sparebank1-CUP 2021"]
[null,null,null,null,null,"SP1- CUP 1 ",null,"SP1- CUP 2 ",null,"SP1- CUP 3",null,"SP1- CUP 4",null,"SP1- CUP 5",null,"SP1- CUP 6",null,"Poeng",null,null,null,null,null,null,"Fire beste",null,null,null,"Sum"]
["Nr","NAVN","KLUBB","POENG","Fullført","Nr.  Poeng ",null,"Nr.  Poeng ",null,"Nr.   Poeng ",null,"Nr.  Poeng ",null,"Nr.  Poeng ",null,"Nr. Poeng ",null,1,2,3,4,5,6,7,1,2,3,4]
[{"$f":"AF4","v":1},"Adrian Cornelius Kaasbøll","Byåsen IL",{"$f":"IF(B4<>\"\",AC4,\"\")","v":400},{"$f":"IF(AD4<4,\" \",\"F\")","v":"F"},1,{"$f":"IF(F4>0,INDEX(Poeng!$A$1:$B$100,F4,2),\"\")","v":100},1,{"$f":"IF(H4>0,INDEX(Poeng!$A$1:$B$100,H4,2),\"\")","v":100},1,{"$f":"IF(J4>0,INDEX(Poeng!$A$1:$B$100,J4,2),\"\")","v":100},1,{"$f":"IF(L4>0,INDEX(Poeng!$A$1:$B$100,L4,2),\"\")","v":100},1,{"$f":"IF(N4>0,INDEX(Poeng!$A$1:$B$100,N4,2),\"\")","v":100},1,{"$f":"IF(P4>0,INDEX(Poeng!$A$1:$B$100,P4,2),\"\")","v":100},{"$f":"IF(F4>0,G4,0)","v":100},{"$f":"IF(H4>0,I4,0)","v":100},{"$f":"IF(J4>0,K4,0)","v":100},{"$f":"IF(L4>0,M4,0)","v":100},{"$f":"IF(N4>0,O4,0)","v":100},{"$f":"IF(P4>0,Q4,0)","v":100},{"$f":"IF(#REF!>0,#REF!,0)","v":{"$error":"#REF!"}},{"$f":"LARGE(R4:W4,1)","v":100},{"$f":"LARGE(R4:W4,2)","v":100},{"$f":"LARGE(R4:W4,3)","v":100},{"$f":"LARGE(R4:W4,4)","v":100},{"$f":"SUM(Y4:AB4)","v":400},{"$f":"COUNT(F4:Q4)/2","v":6},{"$f":"AC4*10^8+Y4*10^6/2+Z4*10^4/2+AA4*10^2/2+AB4/2","v":40050505050},{"$f":"IF(B4<>\"\",RANK(AE4,AE$4:AE$62,0),\"\")","v":1}]
[2,"Niklas Almås","Byåsen IL",300,"F",2,{"$f":"IF(F5>0,INDEX(Poeng!$A$1:$B$100,F5,2),\"\")","v":80},2,{"$f":"IF(H5>0,INDEX(Poeng!$A$1:$B$100,H5,2),\"\")","v":80},4,{"$f":"IF(J5>0,INDEX(Poeng!$A$1:$B$100,J5,2),\"\")","v":50},3,{"$f":"IF(L5>0,INDEX(Poeng!$A$1:$B$100,L5,2),\"\")","v":60},2,{"$f":"IF(N5>0,INDEX(Poeng!$A$1:$B$100,N5,2),\"\")","v":80},3,{"$f":"IF(P5>0,INDEX(Poeng!$A$1:$B$100,P5,2),\"\")","v":60},80,80,50,60,80,60,{"$f":"IF(#REF!>0,#REF!,0)","v":{"$error":"#REF!"}},80,80,80,60,300,6,30040404030,2]
[2,"Nikolai Fossum","Byåsen IL",300,"F",6,{"$f":"IF(F6>0,INDEX(Poeng!$A$1:$B$100,F6,2),\"\")","v":40},3,{"$f":"IF(H6>0,INDEX(Poeng!$A$1:$B$100,H6,2),\"\")","v":60},2,{"$f":"IF(J6>0,INDEX(Poeng!$A$1:$B$100,J6,2),\"\")","v":80},2,{"$f":"IF(L6>0,INDEX(Poeng!$A$1:$B$100,L6,2),\"\")","v":80},6,{"$f":"IF(N6>0,INDEX(Poeng!$A$1:$B$100,N6,2),\"\")","v":40},2,{"$f":"IF(P6>0,INDEX(Poeng!$A$1:$B$100,P6,2),\"\")","v":80},40,60,80,80,40,80,{"$f":"IF(#REF!>0,#REF!,0)","v":{"$error":"#REF!"}},80,80,80,60,300,6,30040404030,2]
[4,"Mats Augdal Dahl","Byåsen IL",210,"F",4,{"$f":"IF(F7>0,INDEX(Poeng!$A$1:$B$100,F7,2),\"\")","v":50},5,{"$f":"IF(H7>0,INDEX(Poeng!$A$1:$B$100,H7,2),\"\")","v":45},3,{"$f":"IF(J7>0,INDEX(Poeng!$A$1:$B$100,J7,2),\"\")","v":60},4,{"$f":"IF(L7>0,INDEX(Poeng!$A$1:$B$100,L7,2),\"\")","v":50},4,{"$f":"IF(N7>0,INDEX(Poeng!$A$1:$B$100,N7,2),\"\")","v":50},4,{"$f":"IF(P7>0,INDEX(Poeng!$A$1:$B$100,P7,2),\"\")","v":50},50,45,60,50,50,50,{"$f":"IF(#REF!>0,#REF!,0)","v":{"$error":"#REF!"}},60,50,50,50,210,6,21030252525,4]
[5,"Ola Randen","Leik, IL",186,"F",8,{"$f":"IF(F8>0,INDEX(Poeng!$A$1:$B$100,F8,2),\"\")","v":32},7,{"$f":"IF(H8>0,INDEX(Poeng!$A$1:$B$100,H8,2),\"\")","v":36},5,{"$f":"IF(J8>0,INDEX(Poeng!$A$1:$B$100,J8,2),\"\")","v":45},7,{"$f":"IF(L8>0,INDEX(Poeng!$A$1:$B$100,L8,2),\"\")","v":36},3,{"$f":"IF(N8>0,INDEX(Poeng!$A$1:$B$100,N8,2),\"\")","v":60},5,{"$f":"IF(P8>0,INDEX(Poeng!$A$1:$B$100,P8,2),\"\")","v":45},32,36,45,36,60,45,{"$f":"IF(#REF!>0,#REF!,0)","v":{"$error":"#REF!"}},60,45,45,36,186,6,18630227268,5]
[6,"Ola Garmo Hov","Byåsen IL",175,"F",12,{"$f":"IF(F9>0,INDEX(Poeng!$A$1:$B$100,F9,2),\"\")","v":22},4,{"$f":"IF(H9>0,INDEX(Poeng!$A$1:$B$100,H9,2),\"\")","v":50},6,{"$f":"IF(J9>0,INDEX(Poeng!$A$1:$B$100,J9,2),\"\")","v":40},6,{"$f":"IF(L9>0,INDEX(Poeng!$A$1:$B$100,L9,2),\"\")","v":40},5,{"$f":"IF(N9>0,INDEX(Poeng!$A$1:$B$100,N9,2),\"\")","v":45},6,{"$f":"IF(P9>0,INDEX(Poeng!$A$1:$B$100,P9,2),\"\")","v":40},22,50,40,40,45,40,{"$f":"IF(#REF!>0,#REF!,0)","v":{"$error":"#REF!"}},50,45,40,40,175,6,17525227020,6]
[7,"Lars Lystad Svorkdal","Svorkmo N.O.I.",144,"F",9,{"$f":"IF(F10>0,INDEX(Poeng!$A$1:$B$100,F10,2),\"\")","v":29},6,{"$f":"IF(H10>0,INDEX(Poeng!$A$1:$B$100,H10,2),\"\")","v":40},null,{"$f":"IF(J10>0,INDEX(Poeng!$A$1:$B$100,J10,2),\"\")","v":""},8,{"$f":"IF(L10>0,INDEX(Poeng!$A$1:$B$100,L10,2),\"\")","v":32},7,{"$f":"IF(N10>0,INDEX(Poeng!$A$1:$B$100,N10,2),\"\")","v":36},7,{"$f":"IF(P10>0,INDEX(Poeng!$A$1:$B$100,P10,2),\"\")","v":36},29,40,0,32,36,36,{"$f":"IF(#REF!>0,#REF!,0)","v":{"$error":"#REF!"}},40,36,36,32,144,5,14420181816,7]
[8,"Morten Grut","Idrettslaget Nor",113,"F",16,{"$f":"IF(F11>0,INDEX(Poeng!$A$1:$B$100,F11,2),\"\")","v":15},12,{"$f":"IF(H11>0,INDEX(Poeng!$A$1:$B$100,H11,2),\"\")","v":22},7,{"$f":"IF(J11>0,INDEX(Poeng!$A$1:$B$100,J11,2),\"\")","v":36},11,{"$f":"IF(L11>0,INDEX(Poeng!$A$1:$B$100,L11,2),\"\")","v":24},11,{"$f":"IF(N11>0,INDEX(Poeng!$A$1:$B$100,N11,2),\"\")","v":24},9,{"$f":"IF(P11>0,INDEX(Poeng!$A$1:$B$100,P11,2),\"\")","v":29},15,22,36,24,24,29,{"$f":"IF(#REF!>0,#REF!,0)","v":{"$error":"#REF!"}},36,29,24,24,113,6,11318146212,8]
[9,"Tobias Grendstad","Klæbu IL",107,"F",17,{"$f":"IF(F12>0,INDEX(Poeng!$A$1:$B$100,F12,2),\"\")","v":14},null,{"$f":"IF(H12>0,INDEX(Poeng!$A$1:$B$100,H12,2),\"\")","v":""},null,{"$f":"IF(J12>0,INDEX(Poeng!$A$1:$B$100,J12,2),\"\")","v":""},9,{"$f":"IF(L12>0,INDEX(Poeng!$A$1:$B$100,L12,2),\"\")","v":29},8,{"$f":"IF(N12>0,INDEX(Poeng!$A$1:$B$100,N12,2),\"\")","v":32},8,{"$f":"IF(P12>0,INDEX(Poeng!$A$1:$B$100,P12,2),\"\")","v":32},14,0,0,29,32,32,{"$f":"IF(#REF!>0,#REF!,0)","v":{"$error":"#REF!"}},32,32,29,14,107,4,10716161457,9]
[10,"Ådne Hoston Stiklestad","Fjellmann IL",105,"F",14,{"$f":"IF(F13>0,INDEX(Poeng!$A$1:$B$100,F13,2),\"\")","v":18},11,{"$f":"IF(H13>0,INDEX(Poeng!$A$1:$B$100,H13,2),\"\")","v":24},10,{"$f":"IF(J13>0,INDEX(Poeng!$A$1:$B$100,J13,2),\"\")","v":26},null,{"$f":"IF(L13>0,INDEX(Poeng!$A$1:$B$100,L13,2),\"\")","v":""},9,{"$f":"IF(N13>0,INDEX(Poeng!$A$1:$B$100,N13,2),\"\")","v":29},10,{"$f":"IF(P13>0,INDEX(Poeng!$A$1:$B$100,P13,2),\"\")","v":26},18,24,26,0,29,26,{"$f":"IF(#REF!>0,#REF!,0)","v":{"$error":"#REF!"}},29,26,26,24,105,5,10514631312,10]
[11,"Vegard Lereim Storli","Byaasen Skiklub",97,"F",19,{"$f":"IF(F14>0,INDEX(Poeng!$A$1:$B$100,F14,2),\"\")","v":12},8,{"$f":"IF(H14>0,INDEX(Poeng!$A$1:$B$100,H14,2),\"\")","v":32},9,{"$f":"IF(J14>0,INDEX(Poeng!$A$1:$B$100,J14,2),\"\")","v":29},null,{"$f":"IF(L14>0,INDEX(Poeng!$A$1:$B$100,L14,2),\"\")","v":""},null,{"$f":"IF(N14>0,INDEX(Poeng!$A$1:$B$100,N14,2),\"\")","v":""},11,{"$f":"IF(P14>0,INDEX(Poeng!$A$1:$B$100,P14,2),\"\")","v":24},12,32,29,0,0,24,{"$f":"IF(#REF!>0,#REF!,0)","v":{"$error":"#REF!"}},32,29,24,12,97,4,9716146206,11]
[12,"Magnus Steien Løseth","Orkdal IL",81," ",7,{"$f":"IF(F15>0,INDEX(Poeng!$A$1:$B$100,F15,2),\"\")","v":36},null,{"$f":"IF(H15>0,INDEX(Poeng!$A$1:$B$100,H15,2),\"\")","v":""},null,{"$f":"IF(J15>0,INDEX(Poeng!$A$1:$B$100,J15,2),\"\")","v":""},5,{"$f":"IF(L15>0,INDEX(Poeng!$A$1:$B$100,L15,2),\"\")","v":45},null,{"$f":"IF(N15>0,INDEX(Poeng!$A$1:$B$100,N15,2),\"\")","v":""},null,{"$f":"IF(P15>0,INDEX(Poeng!$A$1:$B$100,P15,2),\"\")","v":""},36,0,0,45,0,0,{"$f":"IF(#REF!>0,#REF!,0)","v":{"$error":"#REF!"}},45,36,0,0,81,2,8122680000,12]
[13,"Eivind Næve","Svorkmo N.O.I.",81," ",10,{"$f":"IF(F16>0,INDEX(Poeng!$A$1:$B$100,F16,2),\"\")","v":26},9,{"$f":"IF(H16>0,INDEX(Poeng!$A$1:$B$100,H16,2),\"\")","v":29},null,{"$f":"IF(J16>0,INDEX(Poeng!$A$1:$B$100,J16,2),\"\")","v":""},10,{"$f":"IF(L16>0,INDEX(Poeng!$A$1:$B$100,L16,2),\"\")","v":26},null,{"$f":"IF(N16>0,INDEX(Poeng!$A$1:$B$100,N16,2),\"\")","v":""},null,{"$f":"IF(P16>0,INDEX(Poeng!$A$1:$B$100,P16,2),\"\")","v":""},26,29,0,26,0,0,{"$f":"IF(#REF!>0,#REF!,0)","v":{"$error":"#REF!"}},29,26,26,0,81,3,8114631300,13]
[14,"Magnus Græsli","Leinstrand IL",68," ",null,{"$f":"IF(F17>0,INDEX(Poeng!$A$1:$B$100,F17,2),\"\")","v":""},null,{"$f":"IF(H17>0,INDEX(Poeng!$A$1:$B$100,H17,2),\"\")","v":""},null,{"$f":"IF(J17>0,INDEX(Poeng!$A$1:$B$100,J17,2),\"\")","v":""},12,{"$f":"IF(L17>0,INDEX(Poeng!$A$1:$B$100,L17,2),\"\")","v":22},10,{"$f":"IF(N17>0,INDEX(Poeng!$A$1:$B$100,N17,2),\"\")","v":26},13,{"$f":"IF(P17>0,INDEX(Poeng!$A$1:$B$100,P17,2),\"\")","v":20},0,0,0,22,26,20,{"$f":"IF(#REF!>0,#REF!,0)","v":{"$error":"#REF!"}},26,22,20,0,68,3,6813111000,14]
[15,"Isak Skogrand","Oppdal IL ",60," ",3,{"$f":"IF(F18>0,INDEX(Poeng!$A$1:$B$100,F18,2),\"\")","v":60},null,{"$f":"IF(H18>0,INDEX(Poeng!$A$1:$B$100,H18,2),\"\")","v":""},null,{"$f":"IF(J18>0,INDEX(Poeng!$A$1:$B$100,J18,2),\"\")","v":""},null,{"$f":"IF(L18>0,INDEX(Poeng!$A$1:$B$100,L18,2),\"\")","v":""},null,{"$f":"IF(N18>0,INDEX(Poeng!$A$1:$B$100,N18,2),\"\")","v":""},null,{"$f":"IF(P18>0,INDEX(Poeng!$A$1:$B$100,P18,2),\"\")","v":""},60,0,0,0,0,0,{"$f":"IF(#REF!>0,#REF!,0)","v":{"$error":"#REF!"}},60,0,0,0,60,1,6030000000,15]
[16,"Jon Hofstad","Melhus IL",60," ",21,{"$f":"IF(F19>0,INDEX(Poeng!$A$1:$B$100,F19,2),\"\")","v":10},null,{"$f":"IF(H19>0,INDEX(Poeng!$A$1:$B$100,H19,2),\"\")","v":""},8,{"$f":"IF(J19>0,INDEX(Poeng!$A$1:$B$100,J19,2),\"\")","v":32},null,{"$f":"IF(L19>0,INDEX(Poeng!$A$1:$B$100,L19,2),\"\")","v":""},null,{"$f":"IF(N19>0,INDEX(Poeng!$A$1:$B$100,N19,2),\"\")","v":""},14,{"$f":"IF(P19>0,INDEX(Poeng!$A$1:$B$100,P19,2),\"\")","v":18},10,0,32,0,0,18,{"$f":"IF(#REF!>0,#REF!,0)","v":{"$error":"#REF!"}},32,18,10,0,60,3,6016090500,16]
[17,"Jørgen Aune","Byåsen IL",53," ",18,{"$f":"IF(F20>0,INDEX(Poeng!$A$1:$B$100,F20,2),\"\")","v":13},null,{"$f":"IF(H20>0,INDEX(Poeng!$A$1:$B$100,H20,2),\"\")","v":""},null,{"$f":"IF(J20>0,INDEX(Poeng!$A$1:$B$100,J20,2),\"\")","v":""},14,{"$f":"IF(L20>0,INDEX(Poeng!$A$1:$B$100,L20,2),\"\")","v":18},null,{"$f":"IF(N20>0,INDEX(Poeng!$A$1:$B$100,N20,2),\"\")","v":""},12,{"$f":"IF(P20>0,INDEX(Poeng!$A$1:$B$100,P20,2),\"\")","v":22},13,0,0,18,0,22,{"$f":"IF(#REF!>0,#REF!,0)","v":{"$error":"#REF!"}},22,18,13,0,53,3,5311090650,17]
[18,"Egil Vassmo Mæhlumsveen","Byåsen IL",50," ",4,{"$f":"IF(F21>0,INDEX(Poeng!$A$1:$B$100,F21,2),\"\")","v":50},null,{"$f":"IF(H21>0,INDEX(Poeng!$A$1:$B$100,H21,2),\"\")","v":""},null,{"$f":"IF(J21>0,INDEX(Poeng!$A$1:$B$100,J21,2),\"\")","v":""},null,{"$f":"IF(L21>0,INDEX(Poeng!$A$1:$B$100,L21,2),\"\")","v":""},null,{"$f":"IF(N21>0,INDEX(Poeng!$A$1:$B$100,N21,2),\"\")","v":""},null,{"$f":"IF(P21>0,INDEX(Poeng!$A$1:$B$100,P21,2),\"\")","v":""},50,0,0,0,0,0,{"$f":"IF(#REF!>0,#REF!,0)","v":{"$error":"#REF!"}},50,0,0,0,50,1,5025000000,18]
[19,"Sindre Hergot","Byåsen IL",38," ",null,{"$f":"IF(F22>0,INDEX(Poeng!$A$1:$B$100,F22,2),\"\")","v":""},null,{"$f":"IF(H22>0,INDEX(Poeng!$A$1:$B$100,H22,2),\"\")","v":""},null,{"$f":"IF(J22>0,INDEX(Poeng!$A$1:$B$100,J22,2),\"\")","v":""},null,{"$f":"IF(L22>0,INDEX(Poeng!$A$1:$B$100,L22,2),\"\")","v":""},12,{"$f":"IF(N22>0,INDEX(Poeng!$A$1:$B$100,N22,2),\"\")","v":22},15,{"$f":"IF(P22>0,INDEX(Poeng!$A$1:$B$100,P22,2),\"\")","v":16},0,0,0,0,22,16,{"$f":"IF(#REF!>0,#REF!,0)","v":{"$error":"#REF!"}},22,16,0,0,38,2,3811080000,19]
[20,"Sveinung Henrik Eriksen ","Jonsvatnet IL",36," ",15,{"$f":"IF(F23>0,INDEX(Poeng!$A$1:$B$100,F23,2),\"\")","v":16},null,{"$f":"IF(H23>0,INDEX(Poeng!$A$1:$B$100,H23,2),\"\")","v":""},null,{"$f":"IF(J23>0,INDEX(Poeng!$A$1:$B$100,J23,2),\"\")","v":""},13,{"$f":"IF(L23>0,INDEX(Poeng!$A$1:$B$100,L23,2),\"\")","v":20},null,{"$f":"IF(N23>0,INDEX(Poeng!$A$1:$B$100,N23,2),\"\")","v":""},null,{"$f":"IF(P23>0,INDEX(Poeng!$A$1:$B$100,P23,2),\"\")","v":""},16,0,0,20,0,0,{"$f":"IF(#REF!>0,#REF!,0)","v":{"$error":"#REF!"}},20,16,0,0,36,2,3610080000,20]
[20,"Ådne Stordal","Byåsen IL",36," ",null,{"$f":"IF(F24>0,INDEX(Poeng!$A$1:$B$100,F24,2),\"\")","v":""},null,{"$f":"IF(H24>0,INDEX(Poeng!$A$1:$B$100,H24,2),\"\")","v":""},null,{"$f":"IF(J24>0,INDEX(Poeng!$A$1:$B$100,J24,2),\"\")","v":""},15,{"$f":"IF(L24>0,INDEX(Poeng!$A$1:$B$100,L24,2),\"\")","v":16},13,{"$f":"IF(N24>0,INDEX(Poeng!$A$1:$B$100,N24,2),\"\")","v":20},null,{"$f":"IF(P24>0,INDEX(Poeng!$A$1:$B$100,P24,2),\"\")","v":""},0,0,0,16,20,0,{"$f":"IF(#REF!>0,#REF!,0)","v":{"$error":"#REF!"}},20,16,0,0,36,2,3610080000,20]
[22,"Kristoffer Strømdal Wik","Byaasen Skiklub",26," ",null,{"$f":"IF(F25>0,INDEX(Poeng!$A$1:$B$100,F25,2),\"\")","v":""},10,{"$f":"IF(H25>0,INDEX(Poeng!$A$1:$B$100,H25,2),\"\")","v":26},null,{"$f":"IF(J25>0,INDEX(Poeng!$A$1:$B$100,J25,2),\"\")","v":""},null,{"$f":"IF(L25>0,INDEX(Poeng!$A$1:$B$100,L25,2),\"\")","v":""},null,{"$f":"IF(N25>0,INDEX(Poeng!$A$1:$B$100,N25,2),\"\")","v":""},null,{"$f":"IF(P25>0,INDEX(Poeng!$A$1:$B$100,P25,2),\"\")","v":""},0,26,0,0,0,0,{"$f":"IF(#REF!>0,#REF!,0)","v":{"$error":"#REF!"}},26,0,0,0,26,1,2613000000,22]
[22,"Jens Borgar Aarhaug","Sokna IL",26," ",10,{"$f":"IF(F26>0,INDEX(Poeng!$A$1:$B$100,F26,2),\"\")","v":26},null,{"$f":"IF(H26>0,INDEX(Poeng!$A$1:$B$100,H26,2),\"\")","v":""},null,{"$f":"IF(J26>0,INDEX(Poeng!$A$1:$B$100,J26,2),\"\")","v":""},null,{"$f":"IF(L26>0,INDEX(Poeng!$A$1:$B$100,L26,2),\"\")","v":""},null,{"$f":"IF(N26>0,INDEX(Poeng!$A$1:$B$100,N26,2),\"\")","v":""},null,null,26,0,0,0,0,0,{"$f":"IF(#REF!>0,#REF!,0)","v":{"$error":"#REF!"}},26,0,0,0,26,1,2613000000,22]
[24,"Endre Bjørkøy","Kyrksæterøra IL",23," ",23,{"$f":"IF(F27>0,INDEX(Poeng!$A$1:$B$100,F27,2),\"\")","v":8},null,{"$f":"IF(H27>0,INDEX(Poeng!$A$1:$B$100,H27,2),\"\")","v":""},null,{"$f":"IF(J27>0,INDEX(Poeng!$A$1:$B$100,J27,2),\"\")","v":""},16,{"$f":"IF(L27>0,INDEX(Poeng!$A$1:$B$100,L27,2),\"\")","v":15},null,{"$f":"IF(N27>0,INDEX(Poeng!$A$1:$B$100,N27,2),\"\")","v":""},null,{"$f":"IF(P27>0,INDEX(Poeng!$A$1:$B$100,P27,2),\"\")","v":""},8,0,0,15,0,0,{"$f":"IF(#REF!>0,#REF!,0)","v":{"$error":"#REF!"}},15,8,0,0,23,2,2307540000,24]
[25,"Karl Petter Antonsen","Skaun IL",23," ",22,{"$f":"IF(F28>0,INDEX(Poeng!$A$1:$B$100,F28,2),\"\")","v":9},null,{"$f":"IF(H28>0,INDEX(Poeng!$A$1:$B$100,H28,2),\"\")","v":""},null,{"$f":"IF(J28>0,INDEX(Poeng!$A$1:$B$100,J28,2),\"\")","v":""},17,{"$f":"IF(L28>0,INDEX(Poeng!$A$1:$B$100,L28,2),\"\")","v":14},null,{"$f":"IF(N28>0,INDEX(Poeng!$A$1:$B$100,N28,2),\"\")","v":""},null,{"$f":"IF(P28>0,INDEX(Poeng!$A$1:$B$100,P28,2),\"\")","v":""},9,0,0,14,0,0,{"$f":"IF(#REF!>0,#REF!,0)","v":{"$error":"#REF!"}},14,9,0,0,23,2,2307045000,25]
[26,"Emil Tørset Frisk","Oppdal IL ",20," ",13,{"$f":"IF(F29>0,INDEX(Poeng!$A$1:$B$100,F29,2),\"\")","v":20},null,{"$f":"IF(H29>0,INDEX(Poeng!$A$1:$B$100,H29,2),\"\")","v":""},null,{"$f":"IF(J29>0,INDEX(Poeng!$A$1:$B$100,J29,2),\"\")","v":""},null,{"$f":"IF(L29>0,INDEX(Poeng!$A$1:$B$100,L29,2),\"\")","v":""},null,{"$f":"IF(N29>0,INDEX(Poeng!$A$1:$B$100,N29,2),\"\")","v":""},null,{"$f":"IF(P29>0,INDEX(Poeng!$A$1:$B$100,P29,2),\"\")","v":""},20,0,0,0,0,0,{"$f":"IF(#REF!>0,#REF!,0)","v":{"$error":"#REF!"}},20,0,0,0,20,1,2010000000,26]
[27,"Andreas Utkilen","Byåsen IL",15," ",null,{"$f":"IF(F30>0,INDEX(Poeng!$A$1:$B$100,F30,2),\"\")","v":""},null,{"$f":"IF(H30>0,INDEX(Poeng!$A$1:$B$100,H30,2),\"\")","v":""},null,{"$f":"IF(J30>0,INDEX(Poeng!$A$1:$B$100,J30,2),\"\")","v":""},null,{"$f":"IF(L30>0,INDEX(Poeng!$A$1:$B$100,L30,2),\"\")","v":""},null,{"$f":"IF(N30>0,INDEX(Poeng!$A$1:$B$100,N30,2),\"\")","v":""},16,{"$f":"IF(P30>0,INDEX(Poeng!$A$1:$B$100,P30,2),\"\")","v":15},0,0,0,0,0,15,{"$f":"IF(#REF!>0,#REF!,0)","v":{"$error":"#REF!"}},15,0,0,0,15,1,1507500000,27]
[28,"Amund Tore Solberg","Sokna IL",11," ",20,{"$f":"IF(F31>0,INDEX(Poeng!$A$1:$B$100,F31,2),\"\")","v":11},null,{"$f":"IF(H31>0,INDEX(Poeng!$A$1:$B$100,H31,2),\"\")","v":""},null,{"$f":"IF(J31>0,INDEX(Poeng!$A$1:$B$100,J31,2),\"\")","v":""},null,{"$f":"IF(L31>0,INDEX(Poeng!$A$1:$B$100,L31,2),\"\")","v":""},null,{"$f":"IF(N31>0,INDEX(Poeng!$A$1:$B$100,N31,2),\"\")","v":""},null,{"$f":"IF(P31>0,INDEX(Poeng!$A$1:$B$100,P31,2),\"\")","v":""},11,0,0,0,0,0,{"$f":"IF(#REF!>0,#REF!,0)","v":{"$error":"#REF!"}},11,0,0,0,11,1,1105500000,28]
[{"$f":"AF32","v":""},null,null,{"$f":"IF(B32<>\"\",AC32,\"\")","v":""},{"$f":"IF(AD32<4,\" \",\"F\")","v":" "},null,{"$f":"IF(F32>0,INDEX(Poeng!$A$1:$B$100,F32,2),\"\")","v":""},null,{"$f":"IF(H32>0,INDEX(Poeng!$A$1:$B$100,H32,2),\"\")","v":""},null,{"$f":"IF(J32>0,INDEX(Poeng!$A$1:$B$100,J32,2),\"\")","v":""},null,{"$f":"IF(L32>0,INDEX(Poeng!$A$1:$B$100,L32,2),\"\")","v":""},null,{"$f":"IF(N32>0,INDEX(Poeng!$A$1:$B$100,N32,2),\"\")","v":""},null,{"$f":"IF(P32>0,INDEX(Poeng!$A$1:$B$100,P32,2),\"\")","v":""},0,0,0,0,0,0,{"$f":"IF(#REF!>0,#REF!,0)","v":{"$error":"#REF!"}},0,0,0,0,0,0,0,""]
["",null,null,""," ",null,{"$f":"IF(F33>0,INDEX(Poeng!$A$1:$B$100,F33,2),\"\")","v":""},null,{"$f":"IF(H33>0,INDEX(Poeng!$A$1:$B$100,H33,2),\"\")","v":""},null,{"$f":"IF(J33>0,INDEX(Poeng!$A$1:$B$100,J33,2),\"\")","v":""},null,{"$f":"IF(L33>0,INDEX(Poeng!$A$1:$B$100,L33,2),\"\")","v":""},null,{"$f":"IF(N33>0,INDEX(Poeng!$A$1:$B$100,N33,2),\"\")","v":""},null,{"$f":"IF(P33>0,INDEX(Poeng!$A$1:$B$100,P33,2),\"\")","v":""},0,0,0,0,0,0,{"$f":"IF(#REF!>0,#REF!,0)","v":{"$error":"#REF!"}},0,0,0,0,0,0,0,""]
["",null,null,""," ",null,{"$f":"IF(F34>0,INDEX(Poeng!$A$1:$B$100,F34,2),\"\")","v":""},null,{"$f":"IF(H34>0,INDEX(Poeng!$A$1:$B$100,H34,2),\"\")","v":""},null,{"$f":"IF(J34>0,INDEX(Poeng!$A$1:$B$100,J34,2),\"\")","v":""},null,{"$f":"IF(L34>0,INDEX(Poeng!$A$1:$B$100,L34,2),\"\")","v":""},null,{"$f":"IF(N34>0,INDEX(Poeng!$A$1:$B$100,N34,2),\"\")","v":""},null,{"$f":"IF(P34>0,INDEX(Poeng!$A$1:$B$100,P34,2),\"\")","v":""},0,0,0,0,0,0,{"$f":"IF(#REF!>0,#REF!,0)","v":{"$error":"#REF!"}},0,0,0,0,0,0,0,""]
["",null,null,{"$f":"IF(B35<>\"\",AC35,\"\")","v":""}," ",null,{"$f":"IF(F35>0,INDEX(Poeng!$A$1:$B$100,F35,2),\"\")","v":""},null,{"$f":"IF(H35>0,INDEX(Poeng!$A$1:$B$100,H35,2),\"\")","v":""},null,{"$f":"IF(J35>0,INDEX(Poeng!$A$1:$B$100,J35,2),\"\")","v":""},null,{"$f":"IF(L35>0,INDEX(Poeng!$A$1:$B$100,L35,2),\"\")","v":""},null,{"$f":"IF(N35>0,INDEX(Poeng!$A$1:$B$100,N35,2),\"\")","v":""},null,{"$f":"IF(P35>0,INDEX(Poeng!$A$1:$B$100,P35,2),\"\")","v":""},{"$f":"IF(F35>0,G35,0)","v":0},{"$f":"IF(H35>0,I35,0)","v":0},{"$f":"IF(J35>0,K35,0)","v":0},{"$f":"IF(L35>0,M35,0)","v":0},{"$f":"IF(N35>0,O35,0)","v":0},{"$f":"IF(P35>0,Q35,0)","v":0},{"$f":"IF(#REF!>0,#REF!,0)","v":{"$error":"#REF!"}},{"$f":"LARGE(R35:W35,1)","v":0},{"$f":"LARGE(R35:W35,2)","v":0},{"$f":"LARGE(R35:W35,3)","v":0},{"$f":"LARGE(R35:W35,4)","v":0},{"$f":"SUM(Y35:AB35)","v":0},{"$f":"COUNT(F35:Q35)/2","v":0},{"$f":"AC35*10^8+Y35*10^6/2+Z35*10^4/2+AA35*10^2/2+AB35/2","v":0},""]
["",null,null,""," ",null,{"$f":"IF(F36>0,INDEX(Poeng!$A$1:$B$100,F36,2),\"\")","v":""},null,{"$f":"IF(H36>0,INDEX(Poeng!$A$1:$B$100,H36,2),\"\")","v":""},null,{"$f":"IF(J36>0,INDEX(Poeng!$A$1:$B$100,J36,2),\"\")","v":""},null,{"$f":"IF(L36>0,INDEX(Poeng!$A$1:$B$100,L36,2),\"\")","v":""},null,{"$f":"IF(N36>0,INDEX(Poeng!$A$1:$B$100,N36,2),\"\")","v":""},null,{"$f":"IF(P36>0,INDEX(Poeng!$A$1:$B$100,P36,2),\"\")","v":""},0,0,0,0,0,0,{"$f":"IF(#REF!>0,#REF!,0)","v":{"$error":"#REF!"}},0,0,0,0,0,0,0,{"$f":"IF(B36<>\"\",RANK(AE36,AE$4:AE$62,0),\"\")","v":""}]
["",null,null,""," ",null,{"$f":"IF(F37>0,INDEX(Poeng!$A$1:$B$100,F37,2),\"\")","v":""},null,{"$f":"IF(H37>0,INDEX(Poeng!$A$1:$B$100,H37,2),\"\")","v":""},null,{"$f":"IF(J37>0,INDEX(Poeng!$A$1:$B$100,J37,2),\"\")","v":""},null,{"$f":"IF(L37>0,INDEX(Poeng!$A$1:$B$100,L37,2),\"\")","v":""},null,{"$f":"IF(N37>0,INDEX(Poeng!$A$1:$B$100,N37,2),\"\")","v":""},null,{"$f":"IF(P37>0,INDEX(Poeng!$A$1:$B$100,P37,2),\"\")","v":""},0,0,0,0,0,0,{"$f":"IF(#REF!>0,#REF!,0)","v":{"$error":"#REF!"}},0,0,0,0,0,0,0,""]
["",null,null,""," ",null,null,null,{"$f":"IF(H38>0,INDEX(Poeng!$A$1:$B$100,H38,2),\"\")","v":""},null,{"$f":"IF(J38>0,INDEX(Poeng!$A$1:$B$100,J38,2),\"\")","v":""},null,{"$f":"IF(L38>0,INDEX(Poeng!$A$1:$B$100,L38,2),\"\")","v":""},null,{"$f":"IF(N38>0,INDEX(Poeng!$A$1:$B$100,N38,2),\"\")","v":""},null,{"$f":"IF(P38>0,INDEX(Poeng!$A$1:$B$100,P38,2),\"\")","v":""},0,0,0,0,0,0,{"$f":"IF(#REF!>0,#REF!,0)","v":{"$error":"#REF!"}},0,0,0,0,0,0,0,""]
[{"$f":"AF39","v":""},null,null,"",{"$f":"IF(AD39<4,\" \",\"F\")","v":" "},null,null,null,{"$f":"IF(H39>0,INDEX(Poeng!$A$1:$B$100,H39,2),\"\")","v":""},null,{"$f":"IF(J39>0,INDEX(Poeng!$A$1:$B$100,J39,2),\"\")","v":""},null,{"$f":"IF(L39>0,INDEX(Poeng!$A$1:$B$100,L39,2),\"\")","v":""},null,{"$f":"IF(N39>0,INDEX(Poeng!$A$1:$B$100,N39,2),\"\")","v":""},null,{"$f":"IF(P39>0,INDEX(Poeng!$A$1:$B$100,P39,2),\"\")","v":""},0,0,0,0,0,0,{"$f":"IF(#REF!>0,#REF!,0)","v":{"$error":"#REF!"}},0,0,0,0,0,0,0,""]
["",null,null,""," ",null,null,null,{"$f":"IF(H40>0,INDEX(Poeng!$A$1:$B$100,H40,2),\"\")","v":""},null,{"$f":"IF(J40>0,INDEX(Poeng!$A$1:$B$100,J40,2),\"\")","v":""},null,{"$f":"IF(L40>0,INDEX(Poeng!$A$1:$B$100,L40,2),\"\")","v":""},null,{"$f":"IF(N40>0,INDEX(Poeng!$A$1:$B$100,N40,2),\"\")","v":""},null,{"$f":"IF(P40>0,INDEX(Poeng!$A$1:$B$100,P40,2),\"\")","v":""},0,0,0,0,0,0,{"$f":"IF(#REF!>0,#REF!,0)","v":{"$error":"#REF!"}},0,0,0,0,0,0,0,""]
["",null,null,""," ",null,null,null,{"$f":"IF(H41>0,INDEX(Poeng!$A$1:$B$100,H41,2),\"\")","v":""},null,{"$f":"IF(J41>0,INDEX(Poeng!$A$1:$B$100,J41,2),\"\")","v":""},null,{"$f":"IF(L41>0,INDEX(Poeng!$A$1:$B$100,L41,2),\"\")","v":""},null,{"$f":"IF(N41>0,INDEX(Poeng!$A$1:$B$100,N41,2),\"\")","v":""},null,{"$f":"IF(P41>0,INDEX(Poeng!$A$1:$B$100,P41,2),\"\")","v":""},0,0,0,0,0,0,{"$f":"IF(#REF!>0,#REF!,0)","v":{"$error":"#REF!"}},0,0,0,0,0,0,0,""]
["",null,null,""," ",null,null,null,{"$f":"IF(H42>0,INDEX(Poeng!$A$1:$B$100,H42,2),\"\")","v":""},null,{"$f":"IF(J42>0,INDEX(Poeng!$A$1:$B$100,J42,2),\"\")","v":""},null,{"$f":"IF(L42>0,INDEX(Poeng!$A$1:$B$100,L42,2),\"\")","v":""},null,{"$f":"IF(N42>0,INDEX(Poeng!$A$1:$B$100,N42,2),\"\")","v":""},null,{"$f":"IF(P42>0,INDEX(Poeng!$A$1:$B$100,P42,2),\"\")","v":""},0,0,0,0,0,0,{"$f":"IF(#REF!>0,#REF!,0)","v":{"$error":"#REF!"}},0,0,0,0,0,0,0,""]
["",null,null,""," ",null,null,null,{"$f":"IF(H43>0,INDEX(Poeng!$A$1:$B$100,H43,2),\"\")","v":""},null,{"$f":"IF(J43>0,INDEX(Poeng!$A$1:$B$100,J43,2),\"\")","v":""},null,{"$f":"IF(L43>0,INDEX(Poeng!$A$1:$B$100,L43,2),\"\")","v":""},null,{"$f":"IF(N43>0,INDEX(Poeng!$A$1:$B$100,N43,2),\"\")","v":""},null,{"$f":"IF(P43>0,INDEX(Poeng!$A$1:$B$100,P43,2),\"\")","v":""},0,0,0,0,0,0,{"$f":"IF(#REF!>0,#REF!,0)","v":{"$error":"#REF!"}},0,0,0,0,0,0,0,""]
["",null,null,""," ",null,null,null,{"$f":"IF(H44>0,INDEX(Poeng!$A$1:$B$100,H44,2),\"\")","v":""},null,{"$f":"IF(J44>0,INDEX(Poeng!$A$1:$B$100,J44,2),\"\")","v":""},null,{"$f":"IF(L44>0,INDEX(Poeng!$A$1:$B$100,L44,2),\"\")","v":""},null,{"$f":"IF(N44>0,INDEX(Poeng!$A$1:$B$100,N44,2),\"\")","v":""},null,{"$f":"IF(P44>0,INDEX(Poeng!$A$1:$B$100,P44,2),\"\")","v":""},0,0,0,0,0,0,{"$f":"IF(#REF!>0,#REF!,0)","v":{"$error":"#REF!"}},0,0,0,0,0,0,0,""]
["",null,null,""," ",null,null,null,{"$f":"IF(H45>0,INDEX(Poeng!$A$1:$B$100,H45,2),\"\")","v":""},null,{"$f":"IF(J45>0,INDEX(Poeng!$A$1:$B$100,J45,2),\"\")","v":""},null,{"$f":"IF(L45>0,INDEX(Poeng!$A$1:$B$100,L45,2),\"\")","v":""},null,{"$f":"IF(N45>0,INDEX(Poeng!$A$1:$B$100,N45,2),\"\")","v":""},null,{"$f":"IF(P45>0,INDEX(Poeng!$A$1:$B$100,P45,2),\"\")","v":""},0,0,0,0,0,0,{"$f":"IF(#REF!>0,#REF!,0)","v":{"$error":"#REF!"}},0,0,0,0,0,0,0,""]
["",null,null,""," ",null,null,null,{"$f":"IF(H46>0,INDEX(Poeng!$A$1:$B$100,H46,2),\"\")","v":""},null,{"$f":"IF(J46>0,INDEX(Poeng!$A$1:$B$100,J46,2),\"\")","v":""},null,{"$f":"IF(L46>0,INDEX(Poeng!$A$1:$B$100,L46,2),\"\")","v":""},null,{"$f":"IF(N46>0,INDEX(Poeng!$A$1:$B$100,N46,2),\"\")","v":""},null,{"$f":"IF(P46>0,INDEX(Poeng!$A$1:$B$100,P46,2),\"\")","v":""},0,0,0,0,0,0,{"$f":"IF(#REF!>0,#REF!,0)","v":{"$error":"#REF!"}},{"$f":"LARGE(R46:W46,1)","v":0},{"$f":"LARGE(R46:W46,2)","v":0},{"$f":"LARGE(R46:W46,3)","v":0},{"$f":"LARGE(R46:W46,4)","v":0},{"$f":"SUM(Y46:AB46)","v":0},0,{"$f":"AC46*10^8+Y46*10^6/2+Z46*10^4/2+AA46*10^2/2+AB46/2","v":0},""]
["",null,null,""," ",null,null,null,{"$f":"IF(H47>0,INDEX(Poeng!$A$1:$B$100,H47,2),\"\")","v":""},null,{"$f":"IF(J47>0,INDEX(Poeng!$A$1:$B$100,J47,2),\"\")","v":""},null,{"$f":"IF(L47>0,INDEX(Poeng!$A$1:$B$100,L47,2),\"\")","v":""},null,{"$f":"IF(N47>0,INDEX(Poeng!$A$1:$B$100,N47,2),\"\")","v":""},null,{"$f":"IF(P47>0,INDEX(Poeng!$A$1:$B$100,P47,2),\"\")","v":""},0,0,0,0,0,0,{"$f":"IF(#REF!>0,#REF!,0)","v":{"$error":"#REF!"}},0,0,0,0,0,0,0,""]
["",null,null,""," ",null,null,null,{"$f":"IF(H48>0,INDEX(Poeng!$A$1:$B$100,H48,2),\"\")","v":""},null,{"$f":"IF(J48>0,INDEX(Poeng!$A$1:$B$100,J48,2),\"\")","v":""},null,{"$f":"IF(L48>0,INDEX(Poeng!$A$1:$B$100,L48,2),\"\")","v":""},null,{"$f":"IF(N48>0,INDEX(Poeng!$A$1:$B$100,N48,2),\"\")","v":""},null,{"$f":"IF(P48>0,INDEX(Poeng!$A$1:$B$100,P48,2),\"\")","v":""},0,0,0,0,0,0,{"$f":"IF(#REF!>0,#REF!,0)","v":{"$error":"#REF!"}},0,0,0,0,0,0,0,""]
["",null,null,""," ",null,null,null,{"$f":"IF(H49>0,INDEX(Poeng!$A$1:$B$100,H49,2),\"\")","v":""},null,{"$f":"IF(J49>0,INDEX(Poeng!$A$1:$B$100,J49,2),\"\")","v":""},null,{"$f":"IF(L49>0,INDEX(Poeng!$A$1:$B$100,L49,2),\"\")","v":""},null,{"$f":"IF(N49>0,INDEX(Poeng!$A$1:$B$100,N49,2),\"\")","v":""},null,{"$f":"IF(P49>0,INDEX(Poeng!$A$1:$B$100,P49,2),\"\")","v":""},0,0,0,0,0,0,{"$f":"IF(#REF!>0,#REF!,0)","v":{"$error":"#REF!"}},0,0,0,0,0,0,0,""]
["",null,null,""," ",null,null,null,{"$f":"IF(H50>0,INDEX(Poeng!$A$1:$B$100,H50,2),\"\")","v":""},null,{"$f":"IF(J50>0,INDEX(Poeng!$A$1:$B$100,J50,2),\"\")","v":""},null,{"$f":"IF(L50>0,INDEX(Poeng!$A$1:$B$100,L50,2),\"\")","v":""},null,{"$f":"IF(N50>0,INDEX(Poeng!$A$1:$B$100,N50,2),\"\")","v":""},null,{"$f":"IF(P50>0,INDEX(Poeng!$A$1:$B$100,P50,2),\"\")","v":""},0,0,0,0,0,0,{"$f":"IF(#REF!>0,#REF!,0)","v":{"$error":"#REF!"}},0,0,0,0,0,0,0,""]
["",null,null,""," ",null,null,null,{"$f":"IF(H51>0,INDEX(Poeng!$A$1:$B$100,H51,2),\"\")","v":""},null,{"$f":"IF(J51>0,INDEX(Poeng!$A$1:$B$100,J51,2),\"\")","v":""},null,{"$f":"IF(L51>0,INDEX(Poeng!$A$1:$B$100,L51,2),\"\")","v":""},null,{"$f":"IF(N51>0,INDEX(Poeng!$A$1:$B$100,N51,2),\"\")","v":""},null,{"$f":"IF(P51>0,INDEX(Poeng!$A$1:$B$100,P51,2),\"\")","v":""},0,0,0,0,0,0,{"$f":"IF(#REF!>0,#REF!,0)","v":{"$error":"#REF!"}},0,0,0,0,0,0,0,""]
["",null,null,""," ",null,null,null,{"$f":"IF(H52>0,INDEX(Poeng!$A$1:$B$100,H52,2),\"\")","v":""},null,{"$f":"IF(J52>0,INDEX(Poeng!$A$1:$B$100,J52,2),\"\")","v":""},null,{"$f":"IF(L52>0,INDEX(Poeng!$A$1:$B$100,L52,2),\"\")","v":""},null,{"$f":"IF(N52>0,INDEX(Poeng!$A$1:$B$100,N52,2),\"\")","v":""},null,{"$f":"IF(P52>0,INDEX(Poeng!$A$1:$B$100,P52,2),\"\")","v":""},0,0,0,0,0,0,{"$f":"IF(#REF!>0,#REF!,0)","v":{"$error":"#REF!"}},0,0,0,0,0,0,0,""]
["",null,null,""," ",null,null,null,{"$f":"IF(H53>0,INDEX(Poeng!$A$1:$B$100,H53,2),\"\")","v":""},null,{"$f":"IF(J53>0,INDEX(Poeng!$A$1:$B$100,J53,2),\"\")","v":""},null,{"$f":"IF(L53>0,INDEX(Poeng!$A$1:$B$100,L53,2),\"\")","v":""},null,{"$f":"IF(N53>0,INDEX(Poeng!$A$1:$B$100,N53,2),\"\")","v":""},null,{"$f":"IF(P53>0,INDEX(Poeng!$A$1:$B$100,P53,2),\"\")","v":""},0,0,0,0,0,0,{"$f":"IF(#REF!>0,#REF!,0)","v":{"$error":"#REF!"}},0,0,0,0,0,0,0,""]
["",null,null,""," ",null,null,null,{"$f":"IF(H54>0,INDEX(Poeng!$A$1:$B$100,H54,2),\"\")","v":""},null,{"$f":"IF(J54>0,INDEX(Poeng!$A$1:$B$100,J54,2),\"\")","v":""},null,{"$f":"IF(L54>0,INDEX(Poeng!$A$1:$B$100,L54,2),\"\")","v":""},null,{"$f":"IF(N54>0,INDEX(Poeng!$A$1:$B$100,N54,2),\"\")","v":""},null,{"$f":"IF(P54>0,INDEX(Poeng!$A$1:$B$100,P54,2),\"\")","v":""},0,0,0,0,0,0,{"$f":"IF(#REF!>0,#REF!,0)","v":{"$error":"#REF!"}},0,0,0,0,0,0,0,""]
["",null,null,""," ",null,null,null,{"$f":"IF(H55>0,INDEX(Poeng!$A$1:$B$100,H55,2),\"\")","v":""},null,{"$f":"IF(J55>0,INDEX(Poeng!$A$1:$B$100,J55,2),\"\")","v":""},null,{"$f":"IF(L55>0,INDEX(Poeng!$A$1:$B$100,L55,2),\"\")","v":""},null,{"$f":"IF(N55>0,INDEX(Poeng!$A$1:$B$100,N55,2),\"\")","v":""},null,{"$f":"IF(P55>0,INDEX(Poeng!$A$1:$B$100,P55,2),\"\")","v":""},0,0,0,0,0,0,{"$f":"IF(#REF!>0,#REF!,0)","v":{"$error":"#REF!"}},0,0,0,0,0,0,0,""]
["",null,null,""," ",null,null,null,{"$f":"IF(H56>0,INDEX(Poeng!$A$1:$B$100,H56,2),\"\")","v":""},null,{"$f":"IF(J56>0,INDEX(Poeng!$A$1:$B$100,J56,2),\"\")","v":""},null,{"$f":"IF(L56>0,INDEX(Poeng!$A$1:$B$100,L56,2),\"\")","v":""},null,{"$f":"IF(N56>0,INDEX(Poeng!$A$1:$B$100,N56,2),\"\")","v":""},null,{"$f":"IF(P56>0,INDEX(Poeng!$A$1:$B$100,P56,2),\"\")","v":""},0,0,0,0,0,0,{"$f":"IF(#REF!>0,#REF!,0)","v":{"$error":"#REF!"}},{"$f":"LARGE(R56:W56,1)","v":0},{"$f":"LARGE(R56:W56,2)","v":0},{"$f":"LARGE(R56:W56,3)","v":0},{"$f":"LARGE(R56:W56,4)","v":0},{"$f":"SUM(Y56:AB56)","v":0},0,{"$f":"AC56*10^8+Y56*10^6/2+Z56*10^4/2+AA56*10^2/2+AB56/2","v":0},""]
["",null,null,""," ",null,null,null,{"$f":"IF(H57>0,INDEX(Poeng!$A$1:$B$100,H57,2),\"\")","v":""},null,{"$f":"IF(J57>0,INDEX(Poeng!$A$1:$B$100,J57,2),\"\")","v":""},null,{"$f":"IF(L57>0,INDEX(Poeng!$A$1:$B$100,L57,2),\"\")","v":""},null,{"$f":"IF(N57>0,INDEX(Poeng!$A$1:$B$100,N57,2),\"\")","v":""},null,{"$f":"IF(P57>0,INDEX(Poeng!$A$1:$B$100,P57,2),\"\")","v":""},0,0,0,0,0,0,{"$f":"IF(#REF!>0,#REF!,0)","v":{"$error":"#REF!"}},0,0,0,0,0,0,0,""]
["",null,null,""," ",null,null,null,{"$f":"IF(H58>0,INDEX(Poeng!$A$1:$B$100,H58,2),\"\")","v":""},null,{"$f":"IF(J58>0,INDEX(Poeng!$A$1:$B$100,J58,2),\"\")","v":""},null,{"$f":"IF(L58>0,INDEX(Poeng!$A$1:$B$100,L58,2),\"\")","v":""},null,{"$f":"IF(N58>0,INDEX(Poeng!$A$1:$B$100,N58,2),\"\")","v":""},null,{"$f":"IF(P58>0,INDEX(Poeng!$A$1:$B$100,P58,2),\"\")","v":""},0,0,0,0,0,0,{"$f":"IF(#REF!>0,#REF!,0)","v":{"$error":"#REF!"}},0,0,0,0,0,0,0,""]
[{"$f":"AF59","v":""},null,null,"",{"$f":"IF(AD59<4,\" \",\"F\")","v":" "},null,null,null,{"$f":"IF(H59>0,INDEX(Poeng!$A$1:$B$100,H59,2),\"\")","v":""},null,{"$f":"IF(J59>0,INDEX(Poeng!$A$1:$B$100,J59,2),\"\")","v":""},null,{"$f":"IF(L59>0,INDEX(Poeng!$A$1:$B$100,L59,2),\"\")","v":""},null,{"$f":"IF(N59>0,INDEX(Poeng!$A$1:$B$100,N59,2),\"\")","v":""},null,{"$f":"IF(P59>0,INDEX(Poeng!$A$1:$B$100,P59,2),\"\")","v":""},0,0,0,0,0,0,{"$f":"IF(#REF!>0,#REF!,0)","v":{"$error":"#REF!"}},0,0,0,0,0,0,0,""]
["",null,null,""," ",null,null,null,{"$f":"IF(H60>0,INDEX(Poeng!$A$1:$B$100,H60,2),\"\")","v":""},null,{"$f":"IF(J60>0,INDEX(Poeng!$A$1:$B$100,J60,2),\"\")","v":""},null,{"$f":"IF(L60>0,INDEX(Poeng!$A$1:$B$100,L60,2),\"\")","v":""},null,{"$f":"IF(N60>0,INDEX(Poeng!$A$1:$B$100,N60,2),\"\")","v":""},null,{"$f":"IF(P60>0,INDEX(Poeng!$A$1:$B$100,P60,2),\"\")","v":""},0,0,0,0,0,0,{"$f":"IF(#REF!>0,#REF!,0)","v":{"$error":"#REF!"}},0,0,0,0,0,0,0,""]
["",null,null,""," ",null,null,null,{"$f":"IF(H61>0,INDEX(Poeng!$A$1:$B$100,H61,2),\"\")","v":""},null,{"$f":"IF(J61>0,INDEX(Poeng!$A$1:$B$100,J61,2),\"\")","v":""},null,{"$f":"IF(L61>0,INDEX(Poeng!$A$1:$B$100,L61,2),\"\")","v":""},null,{"$f":"IF(N61>0,INDEX(Poeng!$A$1:$B$100,N61,2),\"\")","v":""},null,{"$f":"IF(P61>0,INDEX(Poeng!$A$1:$B$100,P61,2),\"\")","v":""},0,0,0,0,0,0,{"$f":"IF(#REF!>0,#REF!,0)","v":{"$error":"#REF!"}},0,0,0,0,0,0,0,""]
["",null,null,{"$f":"IF(B62<>\"\",AC62,\"\")","v":""}," ",null,null,null,{"$f":"IF(H62>0,INDEX(Poeng!$A$1:$B$100,H62,2),\"\")","v":""},null,{"$f":"IF(J62>0,INDEX(Poeng!$A$1:$B$100,J62,2),\"\")","v":""},null,{"$f":"IF(L62>0,INDEX(Poeng!$A$1:$B$100,L62,2),\"\")","v":""},null,{"$f":"IF(N62>0,INDEX(Poeng!$A$1:$B$100,N62,2),\"\")","v":""},null,{"$f":"IF(P62>0,INDEX(Poeng!$A$1:$B$100,P62,2),\"\")","v":""},{"$f":"IF(F62>0,G62,0)","v":0},{"$f":"IF(H62>0,I62,0)","v":0},{"$f":"IF(J62>0,K62,0)","v":0},{"$f":"IF(L62>0,M62,0)","v":0},{"$f":"IF(N62>0,O62,0)","v":0},{"$f":"IF(P62>0,Q62,0)","v":0},{"$f":"IF(#REF!>0,#REF!,0)","v":{"$error":"#REF!"}},0,0,0,0,0,{"$f":"COUNT(F62:Q62)/2","v":0},0,""]
["",null,null,""," ",null,null,null,{"$f":"IF(H63>0,INDEX(Poeng!$A$1:$B$100,H63,2),\"\")","v":""},null,{"$f":"IF(J63>0,INDEX(Poeng!$A$1:$B$100,J63,2),\"\")","v":""},null,{"$f":"IF(L63>0,INDEX(Poeng!$A$1:$B$100,L63,2),\"\")","v":""},null,{"$f":"IF(N63>0,INDEX(Poeng!$A$1:$B$100,N63,2),\"\")","v":""},null,{"$f":"IF(P63>0,INDEX(Poeng!$A$1:$B$100,P63,2),\"\")","v":""},0,0,0,0,0,0,{"$f":"IF(#REF!>0,#REF!,0)","v":{"$error":"#REF!"}},0,0,0,0,0,0,0,""]
["",null,null,""," ",null,null,null,{"$f":"IF(H64>0,INDEX(Poeng!$A$1:$B$100,H64,2),\"\")","v":""},null,{"$f":"IF(J64>0,INDEX(Poeng!$A$1:$B$100,J64,2),\"\")","v":""},null,{"$f":"IF(L64>0,INDEX(Poeng!$A$1:$B$100,L64,2),\"\")","v":""},null,{"$f":"IF(N64>0,INDEX(Poeng!$A$1:$B$100,N64,2),\"\")","v":""},null,{"$f":"IF(P64>0,INDEX(Poeng!$A$1:$B$100,P64,2),\"\")","v":""},0,0,0,0,0,0,{"$f":"IF(#REF!>0,#REF!,0)","v":{"$error":"#REF!"}},0,0,0,0,0,0,0,""]
["",null,null,""," ",null,null,null,{"$f":"IF(H65>0,INDEX(Poeng!$A$1:$B$100,H65,2),\"\")","v":""},null,{"$f":"IF(J65>0,INDEX(Poeng!$A$1:$B$100,J65,2),\"\")","v":""},null,{"$f":"IF(L65>0,INDEX(Poeng!$A$1:$B$100,L65,2),\"\")","v":""},null,{"$f":"IF(N65>0,INDEX(Poeng!$A$1:$B$100,N65,2),\"\")","v":""},null,{"$f":"IF(P65>0,INDEX(Poeng!$A$1:$B$100,P65,2),\"\")","v":""},0,0,0,0,0,0,{"$f":"IF(#REF!>0,#REF!,0)","v":{"$error":"#REF!"}},0,0,0,0,0,0,0,""]
["",null,null,""," ",null,null,null,{"$f":"IF(H66>0,INDEX(Poeng!$A$1:$B$100,H66,2),\"\")","v":""},null,{"$f":"IF(J66>0,INDEX(Poeng!$A$1:$B$100,J66,2),\"\")","v":""},null,{"$f":"IF(L66>0,INDEX(Poeng!$A$1:$B$100,L66,2),\"\")","v":""},null,{"$f":"IF(N66>0,INDEX(Poeng!$A$1:$B$100,N66,2),\"\")","v":""},null,{"$f":"IF(P66>0,INDEX(Poeng!$A$1:$B$100,P66,2),\"\")","v":""},0,0,0,0,0,0,{"$f":"IF(#REF!>0,#REF!,0)","v":{"$error":"#REF!"}},0,0,0,0,0,0,0,""]
["",null,null,""," ",null,null,null,{"$f":"IF(H67>0,INDEX(Poeng!$A$1:$B$100,H67,2),\"\")","v":""},null,{"$f":"IF(J67>0,INDEX(Poeng!$A$1:$B$100,J67,2),\"\")","v":""},null,{"$f":"IF(L67>0,INDEX(Poeng!$A$1:$B$100,L67,2),\"\")","v":""},null,{"$f":"IF(N67>0,INDEX(Poeng!$A$1:$B$100,N67,2),\"\")","v":""},null,{"$f":"IF(P67>0,INDEX(Poeng!$A$1:$B$100,P67,2),\"\")","v":""},0,0,0,0,0,0,{"$f":"IF(#REF!>0,#REF!,0)","v":{"$error":"#REF!"}},0,0,0,0,0,0,0,""]
["",null,null,""," ",null,null,null,{"$f":"IF(H68>0,INDEX(Poeng!$A$1:$B$100,H68,2),\"\")","v":""},null,{"$f":"IF(J68>0,INDEX(Poeng!$A$1:$B$100,J68,2),\"\")","v":""},null,{"$f":"IF(L68>0,INDEX(Poeng!$A$1:$B$100,L68,2),\"\")","v":""},null,{"$f":"IF(N68>0,INDEX(Poeng!$A$1:$B$100,N68,2),\"\")","v":""},null,{"$f":"IF(P68>0,INDEX(Poeng!$A$1:$B$100,P68,2),\"\")","v":""},0,0,0,0,0,0,{"$f":"IF(#REF!>0,#REF!,0)","v":{"$error":"#REF!"}},0,0,0,0,0,0,0,{"$f":"IF(B68<>\"\",RANK(AE68,AE$4:AE$62,0),\"\")","v":""}]
["",null,null,""," ",null,null,null,{"$f":"IF(H69>0,INDEX(Poeng!$A$1:$B$100,H69,2),\"\")","v":""},null,{"$f":"IF(J69>0,INDEX(Poeng!$A$1:$B$100,J69,2),\"\")","v":""},null,{"$f":"IF(L69>0,INDEX(Poeng!$A$1:$B$100,L69,2),\"\")","v":""},null,{"$f":"IF(N69>0,INDEX(Poeng!$A$1:$B$100,N69,2),\"\")","v":""},null,{"$f":"IF(P69>0,INDEX(Poeng!$A$1:$B$100,P69,2),\"\")","v":""},0,0,0,0,0,0,{"$f":"IF(#REF!>0,#REF!,0)","v":{"$error":"#REF!"}},0,0,0,0,0,0,0,""]
["",null,null,""," ",null,null,null,{"$f":"IF(H70>0,INDEX(Poeng!$A$1:$B$100,H70,2),\"\")","v":""},null,{"$f":"IF(J70>0,INDEX(Poeng!$A$1:$B$100,J70,2),\"\")","v":""},null,{"$f":"IF(L70>0,INDEX(Poeng!$A$1:$B$100,L70,2),\"\")","v":""},null,{"$f":"IF(N70>0,INDEX(Poeng!$A$1:$B$100,N70,2),\"\")","v":""},null,{"$f":"IF(P70>0,INDEX(Poeng!$A$1:$B$100,P70,2),\"\")","v":""},0,0,0,0,0,0,{"$f":"IF(#REF!>0,#REF!,0)","v":{"$error":"#REF!"}},0,0,0,0,0,0,0,""]
["",null,null,""," ",null,null,null,{"$f":"IF(H71>0,INDEX(Poeng!$A$1:$B$100,H71,2),\"\")","v":""},null,{"$f":"IF(J71>0,INDEX(Poeng!$A$1:$B$100,J71,2),\"\")","v":""},null,{"$f":"IF(L71>0,INDEX(Poeng!$A$1:$B$100,L71,2),\"\")","v":""},null,{"$f":"IF(N71>0,INDEX(Poeng!$A$1:$B$100,N71,2),\"\")","v":""},null,{"$f":"IF(P71>0,INDEX(Poeng!$A$1:$B$100,P71,2),\"\")","v":""},0,0,0,0,0,0,{"$f":"IF(#REF!>0,#REF!,0)","v":{"$error":"#REF!"}},0,0,0,0,0,0,0,""]
["",null,null,""," ",null,null,null,{"$f":"IF(H72>0,INDEX(Poeng!$A$1:$B$100,H72,2),\"\")","v":""},null,{"$f":"IF(J72>0,INDEX(Poeng!$A$1:$B$100,J72,2),\"\")","v":""},null,{"$f":"IF(L72>0,INDEX(Poeng!$A$1:$B$100,L72,2),\"\")","v":""},null,{"$f":"IF(N72>0,INDEX(Poeng!$A$1:$B$100,N72,2),\"\")","v":""},null,{"$f":"IF(P72>0,INDEX(Poeng!$A$1:$B$100,P72,2),\"\")","v":""},0,0,0,0,0,0,{"$f":"IF(#REF!>0,#REF!,0)","v":{"$error":"#REF!"}},0,0,0,0,0,0,0,""]
["",null,null,""," ",null,null,null,{"$f":"IF(H73>0,INDEX(Poeng!$A$1:$B$100,H73,2),\"\")","v":""},null,{"$f":"IF(J73>0,INDEX(Poeng!$A$1:$B$100,J73,2),\"\")","v":""},null,{"$f":"IF(L73>0,INDEX(Poeng!$A$1:$B$100,L73,2),\"\")","v":""},null,{"$f":"IF(N73>0,INDEX(Poeng!$A$1:$B$100,N73,2),\"\")","v":""},null,{"$f":"IF(P73>0,INDEX(Poeng!$A$1:$B$100,P73,2),\"\")","v":""},0,0,0,0,0,0,{"$f":"IF(#REF!>0,#REF!,0)","v":{"$error":"#REF!"}},0,0,0,0,0,0,0,""]
["",null,null,""," ",null,null,null,{"$f":"IF(H74>0,INDEX(Poeng!$A$1:$B$100,H74,2),\"\")","v":""},null,{"$f":"IF(J74>0,INDEX(Poeng!$A$1:$B$100,J74,2),\"\")","v":""},null,{"$f":"IF(L74>0,INDEX(Poeng!$A$1:$B$100,L74,2),\"\")","v":""},null,{"$f":"IF(N74>0,INDEX(Poeng!$A$1:$B$100,N74,2),\"\")","v":""},null,{"$f":"IF(P74>0,INDEX(Poeng!$A$1:$B$100,P74,2),\"\")","v":""},0,0,0,0,0,0,{"$f":"IF(#REF!>0,#REF!,0)","v":{"$error":"#REF!"}},0,0,0,0,0,0,0,""]
["",null,null,""," ",null,null,null,{"$f":"IF(H75>0,INDEX(Poeng!$A$1:$B$100,H75,2),\"\")","v":""},null,{"$f":"IF(J75>0,INDEX(Poeng!$A$1:$B$100,J75,2),\"\")","v":""},null,{"$f":"IF(L75>0,INDEX(Poeng!$A$1:$B$100,L75,2),\"\")","v":""},null,{"$f":"IF(N75>0,INDEX(Poeng!$A$1:$B$100,N75,2),\"\")","v":""},null,{"$f":"IF(P75>0,INDEX(Poeng!$A$1:$B$100,P75,2),\"\")","v":""},0,0,0,0,0,0,{"$f":"IF(#REF!>0,#REF!,0)","v":{"$error":"#REF!"}},0,0,0,0,0,0,0,""]
["",null,null,"",{"$f":"IF(AD76<4,\" \",\"F\")","v":" "},null,null,null,{"$f":"IF(H76>0,INDEX(Poeng!$A$1:$B$100,H76,2),\"\")","v":""},null,{"$f":"IF(J76>0,INDEX(Poeng!$A$1:$B$100,J76,2),\"\")","v":""},null,{"$f":"IF(L76>0,INDEX(Poeng!$A$1:$B$100,L76,2),\"\")","v":""},null,{"$f":"IF(N76>0,INDEX(Poeng!$A$1:$B$100,N76,2),\"\")","v":""},null,{"$f":"IF(P76>0,INDEX(Poeng!$A$1:$B$100,P76,2),\"\")","v":""},0,0,0,0,0,0,{"$f":"IF(#REF!>0,#REF!,0)","v":{"$error":"#REF!"}},0,0,0,0,0,0,0,""]
["",null,null,""," ",null,null,null,{"$f":"IF(H77>0,INDEX(Poeng!$A$1:$B$100,H77,2),\"\")","v":""},null,{"$f":"IF(J77>0,INDEX(Poeng!$A$1:$B$100,J77,2),\"\")","v":""},null,{"$f":"IF(L77>0,INDEX(Poeng!$A$1:$B$100,L77,2),\"\")","v":""},null,{"$f":"IF(N77>0,INDEX(Poeng!$A$1:$B$100,N77,2),\"\")","v":""},null,{"$f":"IF(P77>0,INDEX(Poeng!$A$1:$B$100,P77,2),\"\")","v":""},0,0,0,0,0,0,{"$f":"IF(#REF!>0,#REF!,0)","v":{"$error":"#REF!"}},0,0,0,0,0,0,0,""]
["",null,null,""," ",null,null,null,{"$f":"IF(H78>0,INDEX(Poeng!$A$1:$B$100,H78,2),\"\")","v":""},null,{"$f":"IF(J78>0,INDEX(Poeng!$A$1:$B$100,J78,2),\"\")","v":""},null,{"$f":"IF(L78>0,INDEX(Poeng!$A$1:$B$100,L78,2),\"\")","v":""},null,{"$f":"IF(N78>0,INDEX(Poeng!$A$1:$B$100,N78,2),\"\")","v":""},null,{"$f":"IF(P78>0,INDEX(Poeng!$A$1:$B$100,P78,2),\"\")","v":""},0,0,0,0,0,0,{"$f":"IF(#REF!>0,#REF!,0)","v":{"$error":"#REF!"}},0,0,0,0,0,0,0,""]
["",null,null,""," ",null,null,null,{"$f":"IF(H79>0,INDEX(Poeng!$A$1:$B$100,H79,2),\"\")","v":""},null,{"$f":"IF(J79>0,INDEX(Poeng!$A$1:$B$100,J79,2),\"\")","v":""},null,{"$f":"IF(L79>0,INDEX(Poeng!$A$1:$B$100,L79,2),\"\")","v":""},null,{"$f":"IF(N79>0,INDEX(Poeng!$A$1:$B$100,N79,2),\"\")","v":""},null,{"$f":"IF(P79>0,INDEX(Poeng!$A$1:$B$100,P79,2),\"\")","v":""},0,0,0,0,0,0,{"$f":"IF(#REF!>0,#REF!,0)","v":{"$error":"#REF!"}},0,0,0,0,0,0,0,""]
["",null,null,""," ",null,null,null,{"$f":"IF(H80>0,INDEX(Poeng!$A$1:$B$100,H80,2),\"\")","v":""},null,{"$f":"IF(J80>0,INDEX(Poeng!$A$1:$B$100,J80,2),\"\")","v":""},null,{"$f":"IF(L80>0,INDEX(Poeng!$A$1:$B$100,L80,2),\"\")","v":""},null,{"$f":"IF(N80>0,INDEX(Poeng!$A$1:$B$100,N80,2),\"\")","v":""},null,{"$f":"IF(P80>0,INDEX(Poeng!$A$1:$B$100,P80,2),\"\")","v":""},0,0,0,0,0,0,{"$f":"IF(#REF!>0,#REF!,0)","v":{"$error":"#REF!"}},0,0,0,0,0,0,0,""]
["",null,null,""," ",null,null,null,{"$f":"IF(H81>0,INDEX(Poeng!$A$1:$B$100,H81,2),\"\")","v":""},null,{"$f":"IF(J81>0,INDEX(Poeng!$A$1:$B$100,J81,2),\"\")","v":""},null,{"$f":"IF(L81>0,INDEX(Poeng!$A$1:$B$100,L81,2),\"\")","v":""},null,{"$f":"IF(N81>0,INDEX(Poeng!$A$1:$B$100,N81,2),\"\")","v":""},null,{"$f":"IF(P81>0,INDEX(Poeng!$A$1:$B$100,P81,2),\"\")","v":""},0,0,0,0,0,0,{"$f":"IF(#REF!>0,#REF!,0)","v":{"$error":"#REF!"}},0,0,0,0,0,0,0,""]
["",null,null,""," ",null,null,null,{"$f":"IF(H82>0,INDEX(Poeng!$A$1:$B$100,H82,2),\"\")","v":""},null,{"$f":"IF(J82>0,INDEX(Poeng!$A$1:$B$100,J82,2),\"\")","v":""},null,{"$f":"IF(L82>0,INDEX(Poeng!$A$1:$B$100,L82,2),\"\")","v":""},null,{"$f":"IF(N82>0,INDEX(Poeng!$A$1:$B$100,N82,2),\"\")","v":""},null,{"$f":"IF(P82>0,INDEX(Poeng!$A$1:$B$100,P82,2),\"\")","v":""},0,0,0,0,0,0,{"$f":"IF(#REF!>0,#REF!,0)","v":{"$error":"#REF!"}},0,0,0,0,0,0,0,""]
["",null,null,""," ",null,null,null,{"$f":"IF(H83>0,INDEX(Poeng!$A$1:$B$100,H83,2),\"\")","v":""},null,{"$f":"IF(J83>0,INDEX(Poeng!$A$1:$B$100,J83,2),\"\")","v":""},null,{"$f":"IF(L83>0,INDEX(Poeng!$A$1:$B$100,L83,2),\"\")","v":""},null,{"$f":"IF(N83>0,INDEX(Poeng!$A$1:$B$100,N83,2),\"\")","v":""},null,{"$f":"IF(P83>0,INDEX(Poeng!$A$1:$B$100,P83,2),\"\")","v":""},0,0,0,0,0,0,{"$f":"IF(#REF!>0,#REF!,0)","v":{"$error":"#REF!"}},0,0,0,0,0,0,0,""]
["",null,null,""," ",null,null,null,{"$f":"IF(H84>0,INDEX(Poeng!$A$1:$B$100,H84,2),\"\")","v":""},null,{"$f":"IF(J84>0,INDEX(Poeng!$A$1:$B$100,J84,2),\"\")","v":""},null,{"$f":"IF(L84>0,INDEX(Poeng!$A$1:$B$100,L84,2),\"\")","v":""},null,{"$f":"IF(N84>0,INDEX(Poeng!$A$1:$B$100,N84,2),\"\")","v":""},null,{"$f":"IF(P84>0,INDEX(Poeng!$A$1:$B$100,P84,2),\"\")","v":""},0,0,0,0,0,0,{"$f":"IF(#REF!>0,#REF!,0)","v":{"$error":"#REF!"}},0,0,0,0,0,0,0,""]
["",null,null,""," ",null,null,null,{"$f":"IF(H85>0,INDEX(Poeng!$A$1:$B$100,H85,2),\"\")","v":""},null,{"$f":"IF(J85>0,INDEX(Poeng!$A$1:$B$100,J85,2),\"\")","v":""},null,{"$f":"IF(L85>0,INDEX(Poeng!$A$1:$B$100,L85,2),\"\")","v":""},null,{"$f":"IF(N85>0,INDEX(Poeng!$A$1:$B$100,N85,2),\"\")","v":""},null,{"$f":"IF(P85>0,INDEX(Poeng!$A$1:$B$100,P85,2),\"\")","v":""},0,0,0,0,0,0,{"$f":"IF(#REF!>0,#REF!,0)","v":{"$error":"#REF!"}},0,0,0,0,0,0,0,""]
["",null,null,""," ",null,null,null,{"$f":"IF(H86>0,INDEX(Poeng!$A$1:$B$100,H86,2),\"\")","v":""},null,{"$f":"IF(J86>0,INDEX(Poeng!$A$1:$B$100,J86,2),\"\")","v":""},null,{"$f":"IF(L86>0,INDEX(Poeng!$A$1:$B$100,L86,2),\"\")","v":""},null,{"$f":"IF(N86>0,INDEX(Poeng!$A$1:$B$100,N86,2),\"\")","v":""},null,{"$f":"IF(P86>0,INDEX(Poeng!$A$1:$B$100,P86,2),\"\")","v":""},0,0,0,0,0,0,{"$f":"IF(#REF!>0,#REF!,0)","v":{"$error":"#REF!"}},0,0,0,0,0,0,0,""]
["",null,null,""," ",null,null,null,{"$f":"IF(H87>0,INDEX(Poeng!$A$1:$B$100,H87,2),\"\")","v":""},null,{"$f":"IF(J87>0,INDEX(Poeng!$A$1:$B$100,J87,2),\"\")","v":""},null,{"$f":"IF(L87>0,INDEX(Poeng!$A$1:$B$100,L87,2),\"\")","v":""},null,{"$f":"IF(N87>0,INDEX(Poeng!$A$1:$B$100,N87,2),\"\")","v":""},null,{"$f":"IF(P87>0,INDEX(Poeng!$A$1:$B$100,P87,2),\"\")","v":""},0,0,0,0,0,0,{"$f":"IF(#REF!>0,#REF!,0)","v":{"$error":"#REF!"}},0,0,0,0,0,0,0,""]

{"sheet":"Poeng","index":8,"n_rows":100,"n_cols":2,"rows_kept":100,"cut":false,"hidden":false,"merged":[]}
[1,100]
[2,80]
[3,60]
[4,50]
[5,45]
[6,40]
[7,36]
[8,32]
[9,29]
[10,26]
[11,24]
[12,22]
[13,20]
[14,18]
[15,16]
[16,15]
[17,14]
[18,13]
[19,12]
[20,11]
[21,10]
[22,9]
[23,8]
[24,7]
[25,6]
[26,5]
[27,4]
[28,3]
[29,2]
[30,1]
[31,1]
[32,1]
[33,1]
[34,1]
[35,1]
[36,1]
[37,1]
[38,1]
[39,1]
[40,1]
[41,1]
[42,1]
[43,1]
[44,1]
[45,1]
[46,1]
[47,1]
[48,1]
[49,1]
[50,1]
[51,1]
[52,1]
[53,1]
[54,1]
[55,1]
[56,1]
[57,1]
[58,1]
[59,1]
[60,1]
[61,1]
[62,1]
[63,1]
[64,1]
[65,1]
[66,1]
[67,1]
[68,1]
[69,1]
[70,1]
[71,1]
[72,1]
[73,1]
[74,1]
[75,1]
[76,1]
[77,1]
[78,1]
[79,1]
[80,1]
[81,1]
[82,1]
[83,1]
[84,1]
[85,1]
[86,1]
[87,1]
[88,1]
[89,1]
[90,1]
[91,1]
[92,1]
[93,1]
[94,1]
[95,1]
[96,1]
[97,1]
[98,1]
[99,1]
[100,1]