{"text_format":"1","workbook":"xlsx","n_sheets":5,"sheets":["Introduksjon 2022","J11 2022","G11 2022","J12 2022","G12 2022"],"not_rendered":{"charts":0,"images":7,"macros":0,"external_links":0,"defined_names":4,"comments":0,"pivot_tables":0},"unopened":[],"bounds":{"document_bytes":16777216,"sheet_cells":100000,"rows_first":2000,"rows_last":500,"rows_between":2000,"halvings":0,"cell_chars":16384,"cell_head_chars":4096},"cells_cut":0,"cells_raw":0,"read":"whole","date_system":"1900"}

{"sheet":"Introduksjon 2022","index":0,"n_rows":24,"n_cols":1,"rows_kept":24,"cut":false,"hidden":false,"merged":[]}
["Resultatliste Oslo Cup 2022"]
[]
[]
[]
["- Oslo Cup arrangeres av Oslo Skikrets i samarbeid med IRS, Heming, Ready, Njård, Ljan og Kjelsås"]
["- 8 renn, arrangert av de samarbeidende klubbene, inngår i Oslo Cup "]
["- Det konkurreres i separate årsklasser, J11, G11, J12 og G12"]
["- Sammenlagtresultatene beregnes med World Cup poeng + deltakerpoeng."]
["- De fem beste resultatene er tellende sammenlagt, men alle deltakerpoengene teller med i totalresultatet"]
["- Premiering av de tre beste sammenlagt i hver klasse"]
[]
[]
["Poengsystem:"]
["- World Cup poeng for plasseringer (100 poeng for seier, 80 for andre plass osv). "]
["- De fem beste resultatene er tellende i sammendraget"]
["- Det gis 5 deltakerpoeng pr. renn, uanhengig av resultat og om resultatet er tellende i sammendraget"]
[]
[]
["Forklaring på overskriften i resultatlistene:"]
["- Plass = plassering i rennet "]
["- Res. = resultatpoeng etter World Cup skala "]
["- Del. = deltakerpoeng, 5 poeng for deltakelse "]
["- Tot. = totalpoeng for rennet, sum av resultatpoeng og deltakerpoeng "]
["- Resultater/poeng som ikke er tellende for de som har kjørt flere enn seks renn er markert/skravert med grått"]

{"sheet":"J11 2022","index":1,"n_rows":55,"n_cols":77,"rows_kept":55,"cut":false,"hidden":false,"merged":[[0,48,0,51],[2,27,2,30],[2,32,2,35],[2,42,2,45],[2,47,2,50],[3,63,3,65],[4,8,4,15],[4,18,4,25],[2,37,2,40],[2,57,2,60],[2,62,2,65],[3,28,3,30],[3,33,3,35],[3,43,3,45],[3,48,3,50],[3,53,3,55],[3,38,3,40],[3,58,3,60],[2,52,2,55]]}
["Resultatliste Oslo Cup 2022- Jenter 11 år"]
[]
[null,null,null,null,null,null,null,null,"IRS Rennet","Ljan Rennet","Njård Rennet","Ready Rennet","Telenor Arena Cup","Kidsbühel","Oslo Alpinfestival SL","Oslo Alpinfestival SSL",null,null,"IRS Rennet","Ljan Rennet","Njård Rennet","Ready Rennet","Telenor Arena Cup","Kidsbühel","Oslo Alpinfestival SL","Oslo Alpinfestival SSL",null,"--------IRS Rennet----------",null,null,null,null,"----------Ljan Rennet---------",null,null,null,null,"------Kidsbühel--------",null,null,null,null,"--------Njård Rennet----------",null,null,null,null,"--------Ready Rennet---------",null,null,null,null,"-----Telenor Arena Cup----",null,null,null,null,"---Oslo Alpinfestival SL---",null,null,null,null,"---Oslo Alpinfestival SSL---"]
[null,null,null,null,null,null,"Antall",null,"2022-01-29","2022-01-30","2022-02-04","2022-02-05","2022-02-16","2022-02-02","2022-03-12","2022-03-13",null,"Poeng","2022-01-29","2022-01-30","2022-02-04","2022-02-05","2022-02-16","2022-02-02","2022-03-12","2022-03-13",null,null,"--------Poeng--------",null,null,null,null,"--------Poeng--------",null,null,null,null,"-------Poeng---------",null,null,null,null,"-------Poeng---------",null,null,null,null,"-------Poeng---------",null,null,null,null,"-------Poeng---------",null,null,null,null,"-------Poeng---------",null,null,null,null,"-------Poeng---------",null,null,null,null,null,"Løpere med ","Løpere med ","Løpere med ","Løpere med ","Løpere med ","Løpere med ","Løpere med ","Løpere med "]
["Plass","Plass","Etternavn","Fornavn","Klubb","Poeng","renn",null,"------------------------------Plassering i rennene---------------------------------",null,null,null,null,null,null,null,null,"brutto","----------------Resultatpoeng hvis mer enn 5 renn----------------",null,null,null,null,null,null,null,null,"Plass","Res.","Del.","Tot.",null,"Plass","Res.","Del.","Tot.",null,"Plass","Res.","Del.","Tot.",null,"Plass","Res.","Del.","Tot.",null,"Plass","Res.","Del.","Tot.",null,"Plass","Res.","Del.","Tot.",null,"Plass","Res.","Del.","Tot.",null,"Plass","Res.","Del.","Tot.",null,"Plass","Poeng","8 renn","7 renn","6 renn","5 renn","4 renn","3 renn","2 renn","kun 1 renn"]
[{"$f":"IF(F6<F5,BP6,A5)","v":1},1,"Braute","Solveig Elouise","Ready",{"$f":"IF(G6<5,\"\",(R6-SUM(SMALL(S6:Z6,{1;2;3}))))","v":351},{"$f":"(IF(AD6=5,1,0)+IF(AI6=5,1,0)+IF(AS6=5,1,0)+IF(AX6=5,1,0)+IF(BC6=5,1,0)+IF(AN6=5,1,0)+IF(BH6=5,1,0)+IF(BM6=5,1,0))","v":7},null,{"$f":"IF(AB6=\"\",\"\",AB6)","v":3},{"$f":"IF(AG6=\"\",\"\",AG6)","v":2},{"$f":"IF(AQ6=\"\",\"\",AQ6)","v":""},{"$f":"IF(AV6=\"\",\"\",AV6)","v":7},{"$f":"IF(BA6=\"\",\"\",BA6)","v":"DNF"},{"$f":"IF(AL6=\"\",\"\",AL6)","v":2},{"$f":"IF(BF6=\"\",\"\",BF6)","v":"DNS"},{"$f":"IF(BK6=\"\",\"\",BK6)","v":3},null,{"$f":"AE6+AJ6+AT6+AY6+BD6+AO6+BI6+BN6","v":351},{"$f":"IF($G6>=5,IF(AC6=\"\",\"\",AC6),\"\")","v":60},{"$f":"IF($G6>=5,IF(AH6=\"\",\"\",AH6),\"\")","v":80},{"$f":"IF($G6>=5,IF(AR6=\"\",\"\",AR6),\"\")","v":0},{"$f":"IF($G6>=5,IF(AW6=\"\",\"\",AW6),\"\")","v":36},{"$f":"IF($G6>=5,IF(BB6=\"\",\"\",BB6),\"\")","v":0},{"$f":"IF($G6>=5,IF(AM6=\"\",\"\",AM6),\"\")","v":80},{"$f":"IF($G6>=5,IF(BG6=\"\",\"\",BG6),\"\")","v":0},{"$f":"IF($G6>=5,IF(BL6=\"\",\"\",BL6),\"\")","v":60},null,3,{"$f":"IF(ISNUMBER(AB6),(VLOOKUP(AB6,$BP$6:$BQ$50,2)),0)","v":60},{"$f":"IF(AB6<>\"\",5,0)","v":5},{"$f":"AC6+AD6","v":65},null,2,{"$f":"IF(ISNUMBER(AG6),(VLOOKUP(AG6,$BP$6:$BQ$50,2)),0)","v":80},{"$f":"IF(AG6<>\"\",5,0)","v":5},{"$f":"AH6+AI6","v":85},null,2,{"$f":"IF(ISNUMBER(AL6),(VLOOKUP(AL6,$BP$6:$BQ$50,2)),0)","v":80},{"$f":"IF(AL6<>\"\",5,0)","v":5},{"$f":"AM6+AN6","v":85},null,null,{"$f":"IF(ISNUMBER(AQ6),(VLOOKUP(AQ6,$BP$6:$BQ$50,2)),0)","v":0},{"$f":"IF(AQ6<>\"\",5,0)","v":0},{"$f":"AR6+AS6","v":0},null,7,{"$f":"IF(ISNUMBER(AV6),(VLOOKUP(AV6,$BP$6:$BQ$50,2)),0)","v":36},{"$f":"IF(AV6<>\"\",5,0)","v":5},{"$f":"AW6+AX6","v":41},null,"DNF",{"$f":"IF(ISNUMBER(BA6),(VLOOKUP(BA6,$BP$6:$BQ$50,2)),0)","v":0},{"$f":"IF(BA6<>\"\",5,0)","v":5},{"$f":"BB6+BC6","v":5},null,"DNS",{"$f":"IF(ISNUMBER(BF6),(VLOOKUP(BF6,$BP$6:$BQ$50,2)),0)","v":0},{"$f":"IF(BF6<>\"\",5,0)","v":5},{"$f":"BG6+BH6","v":5},null,3,{"$f":"IF(ISNUMBER(BK6),(VLOOKUP(BK6,$BP$6:$BQ$50,2)),0)","v":60},{"$f":"IF(BK6<>\"\",5,0)","v":5},{"$f":"BL6+BM6","v":65},null,1,100,{"$f":"IF($G6=8,1,0)","v":0},{"$f":"IF($G6=7,1,0)","v":1},{"$f":"IF($G6=6,1,0)","v":0},{"$f":"IF($G6=5,1,0)","v":0},{"$f":"IF($G6=4,1,0)","v":0},{"$f":"IF($G6=3,1,0)","v":0},{"$f":"IF($G6=2,1,0)","v":0},{"$f":"IF($G6=1,1,0)","v":0}]
[2,2,"Halvorsen","Heddy","Heming",{"$f":"IF(G7<5,\"\",(R7-SUM(SMALL(S7:Z7,{1;2;3}))))","v":280},7,null,1,"DSQ","",4,4,5,"DNS","DNS",null,280,{"$f":"IF($G7>=5,IF(AC7=\"\",\"\",AC7),\"\")","v":100},{"$f":"IF($G7>=5,IF(AH7=\"\",\"\",AH7),\"\")","v":0},{"$f":"IF($G7>=5,IF(AR7=\"\",\"\",AR7),\"\")","v":0},{"$f":"IF($G7>=5,IF(AW7=\"\",\"\",AW7),\"\")","v":50},{"$f":"IF($G7>=5,IF(BB7=\"\",\"\",BB7),\"\")","v":50},{"$f":"IF($G7>=5,IF(AM7=\"\",\"\",AM7),\"\")","v":45},{"$f":"IF($G7>=5,IF(BG7=\"\",\"\",BG7),\"\")","v":0},{"$f":"IF($G7>=5,IF(BL7=\"\",\"\",BL7),\"\")","v":0},null,1,100,5,105,null,"DSQ",0,5,5,null,5,45,5,50,null,null,0,0,0,null,4,50,5,{"$f":"AW7+AX7","v":55},null,4,50,5,55,null,"DNS",0,5,5,null,"DNS",0,5,5,null,2,80,{"$f":"IF($G7=8,1,0)","v":0},1,0,0,0,0,0,0]
[2,null,"Grohshenning","Louise","Heming",{"$f":"IF(G8<5,\"\",(R8-SUM(SMALL(S8:Z8,{1;2;3}))))","v":""},3,null,2,"","","",5,1,"","",null,240,"","","","","","","","",null,2,80,5,85,null,null,0,0,0,null,1,100,5,105,null,null,0,0,0,null,null,0,0,{"$f":"AW8+AX8","v":0},null,5,45,5,50,null,null,0,0,0,null,null,0,0,0,null,3,60,0,0,0,0,0,1,0,0]
[4,3,"Toverud","Anna Margrete","Ingierkollen Rustad",{"$f":"IF(G9<5,\"\",(R9-SUM(SMALL(S9:Z9,{1;2;3}))))","v":235},5,null,4,"","",11,15,6,2,"",null,235,50,0,0,24,16,40,80,0,null,4,50,5,55,null,null,0,0,0,null,6,40,5,45,null,null,0,0,0,null,11,24,5,29,null,15,16,5,21,null,2,80,5,85,null,null,0,0,0,null,4,50,0,0,0,1,0,0,0,0]
[5,4,"Androstsuk","Arina","Ready",{"$f":"IF(G10<5,\"\",(R10-SUM(SMALL(S10:Z10,{1;2;3}))))","v":194},7,null,"DSQ","DSQ","",13,23,7,4,5,null,194,0,0,0,20,8,36,50,45,null,"DSQ",0,5,5,null,"DSQ",0,5,5,null,7,36,5,41,null,null,0,0,0,null,13,20,5,25,null,23,8,5,13,null,4,50,5,55,null,5,45,5,50,null,5,45,0,1,0,0,0,0,0,0]
[5,null,"Watle","Linnea","Ingierkollen Rustad",{"$f":"IF(G11<5,\"\",(R11-SUM(SMALL(S11:Z11,{1;2;3}))))","v":""},4,null,5,"","","",10,"",1,"DNS",null,191,"","","","","","","","",null,5,45,5,50,null,null,0,0,0,null,null,0,0,0,null,null,0,0,0,null,null,0,0,0,null,10,26,5,31,null,1,100,5,105,null,"DNS",0,5,5,null,6,40,0,0,0,0,1,0,0,0]
[5,null,"Stuge","Hermine","Heming",{"$f":"IF(G12<5,\"\",(R12-SUM(SMALL(S12:Z12,{1;2;3}))))","v":""},2,null,"","","",2,1,"","","",null,190,"","","","","","","","",null,null,0,0,0,null,null,0,0,0,null,null,0,0,0,null,null,0,0,0,null,2,80,5,85,null,1,100,5,105,null,null,0,0,0,null,null,0,0,0,null,7,36,0,0,0,0,0,0,1,0]
[5,null,"Strandenæs","Vilje","Heming",{"$f":"IF(G13<5,\"\",(R13-SUM(SMALL(S13:Z13,{1;2;3}))))","v":""},3,null,"","","",6,2,4,"","",null,185,"","","","","","","","",null,null,0,0,0,null,null,0,0,0,null,4,50,5,55,null,null,0,0,0,null,6,40,5,45,null,2,80,5,85,null,null,0,0,0,null,null,0,0,0,null,8,32,0,0,0,0,0,1,0,0]
[5,null,"Anderssen","Charlotte","Ingierkollen Rustad",{"$f":"IF(G14<5,\"\",(R14-SUM(SMALL(S14:Z14,{1;2;3}))))","v":""},3,null,"","","","",13,"",6,1,null,175,"","","","","","","","",null,null,0,0,0,null,null,0,0,0,null,null,0,0,0,null,null,0,0,0,null,null,0,0,0,null,13,20,5,25,null,6,40,5,45,null,1,100,5,105,null,9,29,0,0,0,0,0,1,0,0]
[5,null,"Hiorth","Fanny","Heming",{"$f":"IF(G15<5,\"\",(R15-SUM(SMALL(S15:Z15,{1;2;3}))))","v":""},3,null,"",1,"","DNS",3,"","","",null,175,"","","","","","","","",null,null,0,0,0,null,1,100,5,105,null,null,0,0,0,null,null,0,0,0,null,"DNS",0,5,5,null,3,60,5,65,null,null,0,0,0,null,null,0,0,0,null,10,26,0,0,0,0,0,1,0,0]
[5,null,"Astrup","Heddy","Ready",{"$f":"IF(G16<5,\"\",(R16-SUM(SMALL(S16:Z16,{1;2;3}))))","v":""},3,null,"","","","",17,"",3,2,null,169,"","","","","","","","",null,null,0,0,0,null,null,0,0,0,null,null,0,0,0,null,null,0,0,0,null,null,0,0,0,null,17,14,5,19,null,3,60,5,65,null,2,80,5,85,null,11,24,0,0,0,0,0,1,0,0]
[12,5,"Wilhelmsen","Ebba","Njård",{"$f":"IF(G17<5,\"\",(R17-SUM(SMALL(S17:Z17,{1;2;3}))))","v":126},5,null,7,"","","","DNS",9,"DSQ",7,null,126,36,0,0,0,0,29,0,36,null,7,36,5,41,null,null,0,0,0,null,9,29,5,34,null,null,0,0,0,null,null,0,0,0,null,"DNS",0,5,5,null,"DSQ",0,5,5,null,7,36,5,41,null,12,22,0,0,0,1,0,0,0,0]
[12,null,"Susrud","Ava","Ready",{"$f":"IF(G18<5,\"\",(R18-SUM(SMALL(S18:Z18,{1;2;3}))))","v":""},3,null,"","","","",18,"",5,4,null,123,"","","","","","","","",null,null,0,0,0,null,null,0,0,0,null,null,0,0,0,null,null,0,0,0,null,null,0,0,0,null,18,13,5,18,null,5,45,5,50,null,4,50,5,55,null,13,20,0,0,0,0,0,1,0,0]
[14,6,"Frydendal","Henriette","Heming",{"$f":"IF(G19<5,\"\",(R19-SUM(SMALL(S19:Z19,{1;2;3}))))","v":122},6,null,"DSQ","","","DSQ",8,3,"DNS","DNS",null,122,0,0,0,0,32,60,0,0,null,"DSQ",0,5,5,null,null,0,0,0,null,3,60,5,65,null,null,0,0,0,null,"DSQ",0,5,5,null,8,32,5,37,null,"DNS",0,5,5,null,"DNS",0,5,5,null,14,18,0,0,1,0,0,0,0,0]
[14,null,"Bakkevig","Karoline","Heming",{"$f":"IF(G20<5,\"\",(R20-SUM(SMALL(S20:Z20,{1;2;3}))))","v":""},2,null,"","","",1,"DSQ","","","",null,110,"","","","","","","","",null,null,0,0,0,null,null,0,0,0,null,null,0,0,0,null,null,0,0,0,null,1,100,5,105,null,"DSQ",0,5,5,null,null,0,0,0,null,null,0,0,0,null,15,16,0,0,0,0,0,0,1,0]
[14,null,"Misund","Helene","Heming",{"$f":"IF(G21<5,\"\",(R21-SUM(SMALL(S21:Z21,{1;2;3}))))","v":""},2,null,"","","",3,6,"","","",null,110,"","","","","","","","",null,null,0,0,0,null,null,0,0,0,null,null,0,0,0,null,null,0,0,0,null,3,60,5,65,null,6,40,5,45,null,null,0,0,0,null,null,0,0,0,null,16,15,0,0,0,0,0,0,1,0]
[14,null,"Zackrisson","Ada","Heming",{"$f":"IF(G22<5,\"\",(R22-SUM(SMALL(S22:Z22,{1;2;3}))))","v":""},2,null,"","","",5,9,"","","",null,84,"","","","","","","","",null,null,0,0,0,null,null,0,0,0,null,null,0,0,0,null,null,0,0,0,null,5,45,5,50,null,9,29,5,34,null,null,0,0,0,null,null,0,0,0,null,17,14,0,0,0,0,0,0,1,0]
[14,null,"Moxon","Lilly Madeleine","Heming",{"$f":"IF(G23<5,\"\",(R23-SUM(SMALL(S23:Z23,{1;2;3}))))","v":""},3,null,"","","",9,11,"","","DNS",null,68,"","","","","","","","",null,null,0,0,0,null,null,0,0,0,null,null,0,0,0,null,null,0,0,0,null,9,29,5,34,null,11,24,5,29,null,null,0,0,0,null,"DNS",0,5,5,null,18,13,0,0,0,0,0,1,0,0]
[14,null,"Storhaug-Blom","Signe","Njård",{"$f":"IF(G24<5,\"\",(R24-SUM(SMALL(S24:Z24,{1;2;3}))))","v":""},4,null,"DSQ","","","","DSQ","","DSQ",6,null,60,"","","","","","","","",null,"DSQ",0,5,5,null,null,0,0,0,null,null,0,0,0,null,null,0,0,0,null,null,0,0,0,null,"DSQ",0,5,5,null,"DSQ",0,5,5,null,6,40,5,45,null,19,12,0,0,0,0,1,0,0,0]
[14,null,"Bjerke","Marielle","Ready",{"$f":"IF(G25<5,\"\",(R25-SUM(SMALL(S25:Z25,{1;2;3}))))","v":""},3,null,6,"","","DSQ","","DNS","","",null,55,"","","","","","","","",null,6,40,5,45,null,null,0,0,0,null,"DNS",0,5,5,null,null,0,0,0,null,"DSQ",0,5,5,null,null,0,0,0,null,null,0,0,0,null,null,0,0,0,null,20,11,0,0,0,0,0,1,0,0]
[14,null,"Grepstad","Hannah","Heming",{"$f":"IF(G26<5,\"\",(R26-SUM(SMALL(S26:Z26,{1;2;3}))))","v":""},2,null,"","","",10,20,"","","",null,47,"","","","","","","","",null,null,0,0,0,null,null,0,0,0,null,null,0,0,0,null,null,0,0,0,null,10,26,5,31,null,20,11,5,16,null,null,0,0,0,null,null,0,0,0,null,21,10,0,0,0,0,0,0,1,0]
[14,null,"Tranby","Charlotte","Njård",{"$f":"IF(G27<5,\"\",(R27-SUM(SMALL(S27:Z27,{1;2;3}))))","v":""},2,null,"","","",8,"DNS","","","",null,42,"","","","","","","","",null,null,0,0,0,null,null,0,0,0,null,null,0,0,0,null,null,0,0,0,null,8,32,5,37,null,"DNS",0,5,5,null,null,0,0,0,null,null,0,0,0,null,22,9,0,0,0,0,0,0,1,0]
[14,null,"Høegh","Hannah","Heming",{"$f":"IF(G28<5,\"\",(R28-SUM(SMALL(S28:Z28,{1;2;3}))))","v":""},1,null,"","","","",7,"","","",null,41,"","","","","","","","",null,null,0,0,0,null,null,0,0,0,null,null,0,0,0,null,null,0,0,0,null,null,0,0,0,null,7,36,5,41,null,null,0,0,0,null,null,0,0,0,null,23,8,0,0,0,0,0,0,0,1]
[14,null,"Terjesen","Olivia","Kjelsås",{"$f":"IF(G29<5,\"\",(R29-SUM(SMALL(S29:Z29,{1;2;3}))))","v":""},3,null,"","","","","",10,"DNS","DNS",null,41,"","","","","","","","",null,null,0,0,0,null,null,0,0,0,null,10,26,5,31,null,null,0,0,0,null,null,0,0,0,null,null,0,0,0,null,"DNS",0,5,5,null,"DNS",0,5,5,null,24,7,0,0,0,0,0,1,0,0]
[14,null,"Ovrum","Anne","Kjelsås",{"$f":"IF(G30<5,\"\",(R30-SUM(SMALL(S30:Z30,{1;2;3}))))","v":""},1,null,"","","","","",8,"","",null,37,"","","","","","","","",null,null,0,0,0,null,null,0,0,0,null,8,32,5,37,null,null,0,0,0,null,null,0,0,0,null,null,0,0,0,null,null,0,0,0,null,null,0,0,0,null,25,6,0,0,0,0,0,0,0,1]
[14,null,"Johnsen","Nicoline","Heming",{"$f":"IF(G31<5,\"\",(R31-SUM(SMALL(S31:Z31,{1;2;3}))))","v":""},4,null,"","","","",16,"DNS","DNS","DNS",null,35,"","","","","","","","",null,null,0,0,0,null,null,0,0,0,null,"DNS",0,5,5,null,null,0,0,0,null,null,0,0,0,null,16,15,5,20,null,"DNS",0,5,5,null,"DNS",0,5,5,null,26,5,0,0,0,0,1,0,0,0]
[14,null,"Homberset","Ragnhild","Try",{"$f":"IF(G32<5,\"\",(R32-SUM(SMALL(S32:Z32,{1;2;3}))))","v":""},2,null,"","","",14,25,"","","",null,34,"","","","","","","","",null,null,0,0,0,null,null,0,0,0,null,null,0,0,0,null,null,0,0,0,null,14,18,5,23,null,25,6,5,11,null,null,0,0,0,null,null,0,0,0,null,27,4,0,0,0,0,0,0,1,0]
[14,null,"Sommerschild","Hilken","Heming",{"$f":"IF(G33<5,\"\",(R33-SUM(SMALL(S33:Z33,{1;2;3}))))","v":""},2,null,"","","",12,"DNS","","","",null,32,"","","","","","","","",null,null,0,0,0,null,null,0,0,0,null,null,0,0,0,null,null,0,0,0,null,12,22,5,27,null,"DNS",0,5,5,null,null,0,0,0,null,null,0,0,0,null,28,3,0,0,0,0,0,0,1,0]
[14,null,"Skoe","Sofie","Heming",{"$f":"IF(G34<5,\"\",(R34-SUM(SMALL(S34:Z34,{1;2;3}))))","v":""},1,null,"","","","",12,"","","",null,27,"","","","","","","","",null,null,0,0,0,null,null,0,0,0,null,null,0,0,0,null,null,0,0,0,null,null,0,0,0,null,12,22,5,27,null,null,0,0,0,null,null,0,0,0,null,29,2,0,0,0,0,0,0,0,1]
[14,null,"Bolling","Madeleine","Heming",{"$f":"IF(G35<5,\"\",(R35-SUM(SMALL(S35:Z35,{1;2;3}))))","v":""},2,null,"","","",15,"DNS","","","",null,26,"","","","","","","","",null,null,0,0,0,null,null,0,0,0,null,null,0,0,0,null,null,0,0,0,null,15,16,5,21,null,"DNS",0,5,5,null,null,0,0,0,null,null,0,0,0,null,30,1,0,0,0,0,0,0,1,0]
[14,null,"Høegh","Thea","Heming",{"$f":"IF(G36<5,\"\",(R36-SUM(SMALL(S36:Z36,{1;2;3}))))","v":""},1,null,"","","","",14,"","","",null,23,"","","","","","","","",null,null,0,0,0,null,null,0,0,0,null,null,0,0,0,null,null,0,0,0,null,null,0,0,0,null,14,18,5,23,null,null,0,0,0,null,null,0,0,0,null,31,0,0,0,0,0,0,0,0,1]
[14,null,"Platou","Elise","Heming",{"$f":"IF(G37<5,\"\",(R37-SUM(SMALL(S37:Z37,{1;2;3}))))","v":""},2,null,"","","","DNS",21,"","","",null,20,"","","","","","","","",null,null,0,0,0,null,null,0,0,0,null,null,0,0,0,null,null,0,0,0,null,"DNS",0,5,5,null,21,10,5,15,null,null,0,0,0,null,null,0,0,0,null,32,0,0,0,0,0,0,0,1,0]
[14,null,"Reistad","Thale","Kjelsås",{"$f":"IF(G38<5,\"\",(R38-SUM(SMALL(S38:Z38,{1;2;3}))))","v":""},4,null,"DNS","","","","","DNS","DSQ","DNS",null,20,"","","","","","","","",null,"DNS",{"$f":"IF(ISNUMBER(AB38),(VLOOKUP(AB38,$BP$6:$BQ$50,2)),0)","v":0},5,5,null,null,{"$f":"IF(ISNUMBER(AG38),(VLOOKUP(AG38,$BP$6:$BQ$50,2)),0)","v":0},0,0,null,"DNS",{"$f":"IF(ISNUMBER(AL38),(VLOOKUP(AL38,$BP$6:$BQ$50,2)),0)","v":0},5,5,null,null,{"$f":"IF(ISNUMBER(AQ38),(VLOOKUP(AQ38,$BP$6:$BQ$50,2)),0)","v":0},0,0,null,null,{"$f":"IF(ISNUMBER(AV38),(VLOOKUP(AV38,$BP$6:$BQ$50,2)),0)","v":0},0,0,null,null,{"$f":"IF(ISNUMBER(BA38),(VLOOKUP(BA38,$BP$6:$BQ$50,2)),0)","v":0},0,0,null,"DSQ",0,5,5,null,"DNS",0,5,5,null,33,0,0,0,0,0,1,0,0,0]
[14,null,"Qvigstad","Julie","Heming",{"$f":"IF(G39<5,\"\",(R39-SUM(SMALL(S39:Z39,{1;2;3}))))","v":""},1,null,"","","","",19,"","","",null,17,"","","","","","","","",null,null,0,0,0,null,null,0,0,0,null,null,0,0,0,null,null,0,0,0,null,null,0,0,0,null,19,12,5,17,null,null,0,0,0,null,null,0,0,0,null,34,0,0,0,0,0,0,0,0,1]
[14,null,"Sandvik","Francesca","Heming",{"$f":"IF(G40<5,\"\",(R40-SUM(SMALL(S40:Z40,{1;2;3}))))","v":""},1,null,"","","","",22,"","","",null,14,"","","","","","","","",null,null,0,0,0,null,null,0,0,0,null,null,0,0,0,null,null,0,0,0,null,null,0,0,0,null,22,9,5,14,null,null,0,0,0,null,null,0,0,0,null,35,0,0,0,0,0,0,0,0,1]
[14,null,"Kvalheim","Cornelia","Ready",{"$f":"IF(G41<5,\"\",(R41-SUM(SMALL(S41:Z41,{1;2;3}))))","v":""},1,null,"","","","",24,"","","",null,12,"","","","","","","","",null,null,0,0,0,null,null,0,0,0,null,null,0,0,0,null,null,0,0,0,null,null,0,0,0,null,24,7,5,12,null,null,0,0,0,null,null,0,0,0,null,36,0,0,0,0,0,0,0,0,1]
[14,null,"Furuholmen","Cecilie","Heming",{"$f":"IF(G42<5,\"\",(R42-SUM(SMALL(S42:Z42,{1;2;3}))))","v":""},2,null,"","","","DNS","DNS","","","",null,10,"","","","","","","","",null,null,0,0,0,null,null,0,0,0,null,null,0,0,0,null,null,0,0,0,null,"DNS",0,5,5,null,"DNS",0,5,5,null,null,0,0,0,null,null,0,0,0,null,37,0,0,0,0,0,0,0,1,0]
[14,null,"Westgaard","Iben","Ready",{"$f":"IF(G43<5,\"\",(R43-SUM(SMALL(S43:Z43,{1;2;3}))))","v":""},2,null,"","","","DNS","DNS","","","",null,10,"","","","","","","","",null,null,0,0,0,null,null,0,0,0,null,null,0,0,0,null,null,0,0,0,null,"DNS",0,5,5,null,"DNS",0,5,5,null,null,0,0,0,null,null,0,0,0,null,38,0,0,0,0,0,0,0,1,0]
[14,null,"Bugge","Cathinka","Try",{"$f":"IF(G44<5,\"\",(R44-SUM(SMALL(S44:Z44,{1;2;3}))))","v":""},1,null,"","","","","DNS","","","",null,5,"","","","","","","","",null,null,0,0,0,null,null,0,0,0,null,null,0,0,0,null,null,0,0,0,null,null,0,0,0,null,"DNS",0,5,5,null,null,0,0,0,null,null,0,0,0,null,39,0,0,0,0,0,0,0,0,1]
[14,null,"Sørensen","Lili","Ready",{"$f":"IF(G45<5,\"\",(R45-SUM(SMALL(S45:Z45,{1;2;3}))))","v":""},1,null,"","","","","DNS","","","",null,5,"","","","","","","","",null,null,0,0,0,null,null,0,0,0,null,null,0,0,0,null,null,0,0,0,null,null,0,0,0,null,"DNS",0,5,5,null,null,0,0,0,null,null,0,0,0,null,40,0,0,0,0,0,0,0,0,1]
[14,null,null,null,null,{"$f":"IF(G46<5,\"\",(R46-SUM(SMALL(S46:Z46,{1;2;3}))))","v":""},0,null,"","","","","","","","",null,0,"","","","","","","","",null,null,0,0,0,null,null,0,0,0,null,null,0,0,0,null,null,0,0,0,null,null,0,0,0,null,null,0,0,0,null,null,0,0,0,null,null,0,0,0,null,41,0,0,0,0,0,0,0,0,0]
[14,null,null,null,null,null,null,null,"","","","","","","","",null,0,"","","","","","","","",null,null,0,0,0,null,null,0,0,0,null,null,0,0,0,null,null,0,0,0,null,null,0,0,0,null,null,0,0,0,null,null,0,0,0,null,null,0,0,0,null,42,0,0,0,0,0,0,0,0,0]
[14,null,null,null,null,null,null,null,"","","","","",{"$f":"IF(BA48=\"\",\"\",BA48)","v":""},{"$f":"IF(AL48=\"\",\"\",AL48)","v":""},{"$f":"IF(BF48=\"\",\"\",BF48)","v":""},null,0,"","","","","","","","",null,null,0,0,0,null,null,0,0,0,null,null,0,0,0,null,null,0,0,0,null,null,0,0,0,null,null,0,0,0,null,null,0,0,0,null,null,0,0,0,null,43,0,0,0,0,0,0,0,0,0]
[null,null,null,null,null,null,null,null,{"$f":"IF(AB49=\"\",\"\",AB49)","v":""},{"$f":"IF(AG49=\"\",\"\",AG49)","v":""},{"$f":"IF(AQ49=\"\",\"\",AQ49)","v":""},{"$f":"IF(AV49=\"\",\"\",AV49)","v":""},{"$f":"IF(BA49=\"\",\"\",BA49)","v":""},{"$f":"IF(BA49=\"\",\"\",BA49)","v":""},{"$f":"IF(AL49=\"\",\"\",AL49)","v":""},{"$f":"IF(BF49=\"\",\"\",BF49)","v":""},null,0,"","","","","","","","",null,null,0,{"$f":"IF(AB49<>\"\",5,0)","v":0},{"$f":"AC49+AD49","v":0},null,null,0,{"$f":"IF(AG49<>\"\",5,0)","v":0},{"$f":"AH49+AI49","v":0},null,null,0,{"$f":"IF(AL49<>\"\",5,0)","v":0},{"$f":"AM49+AN49","v":0},null,null,0,{"$f":"IF(AQ49<>\"\",5,0)","v":0},{"$f":"AR49+AS49","v":0},null,null,0,{"$f":"IF(AV49<>\"\",5,0)","v":0},{"$f":"AW49+AX49","v":0},null,null,0,{"$f":"IF(BA49<>\"\",5,0)","v":0},{"$f":"BB49+BC49","v":0},null,null,{"$f":"IF(ISNUMBER(BF49),(VLOOKUP(BF49,$BP$6:$BQ$50,2)),0)","v":0},{"$f":"IF(BF49<>\"\",5,0)","v":0},{"$f":"BG49+BH49","v":0},null,null,{"$f":"IF(ISNUMBER(BK49),(VLOOKUP(BK49,$BP$6:$BQ$50,2)),0)","v":0},{"$f":"IF(BK49<>\"\",5,0)","v":0},{"$f":"BL49+BM49","v":0},null,44,0,0,0,0,0,0,0,0,0]
[null,null,null,null,null,null,null,null,"","","","",0,"",{"$f":"IF(AL50=\"\",\"\",AL50)","v":""},"",null,0,"","","","","","","","",null,null,0,0,null,null,null,0,0,0,null,null,0,0,0,null,null,0,0,0,null,null,0,0,0,null,null,0,0,0,null,null,0,0,0,null,null,0,0,0,null,45,0,0,0,0,0,0,0,0,0]
[null,null,null,null,null,null,null,null,"","","","",0,"",{"$f":"IF(AL51=\"\",\"\",AL51)","v":""},"",null,0,"","","","","","","","",null,null,0,0,null,null,null,0,0,0,null,null,0,0,0,null,null,0,0,0,null,null,0,0,0,null,null,0,0,0,null,null,0,0,0,null,null,0,0,0,null,46,0,0,0,0,0,0,0,0,0]
[null,null,null,null,null,null,null,null,"","","","",0,"",{"$f":"IF(AL52=\"\",\"\",AL52)","v":""},"",null,0,"","","","","","","","",null,null,0,0,null,null,null,0,0,0,null,null,0,0,0,null,null,0,0,0,null,null,0,0,0,null,null,0,0,0,null,null,0,0,0,null,null,0,0,0,null,47,0,0,0,0,0,0,0,0,0]
[null,null,null,null,null,null,null,null,null,null,null,null,null,null,null,null,null,null,{"$f":"IF($G53>=7,IF(AC53=\"\",\"\",AC53),\"\")","v":""},{"$f":"IF($G53>=7,IF(AH53=\"\",\"\",AH53),\"\")","v":""},{"$f":"IF($G53>=7,IF(AR53=\"\",\"\",AR53),\"\")","v":""},{"$f":"IF($G53>=7,IF(AW53=\"\",\"\",AW53),\"\")","v":""},{"$f":"IF($G53>=7,IF(BB53=\"\",\"\",BB53),\"\")","v":""},{"$f":"IF($G53>=7,IF(AM53=\"\",\"\",AM53),\"\")","v":""},{"$f":"IF($G53>=7,IF(BG53=\"\",\"\",BG53),\"\")","v":""},{"$f":"IF($G53>=7,IF(BL53=\"\",\"\",BL53),\"\")","v":""},null,null,0,0,null,null,null,0,0,null,null,null,0,0,null,null,null,0,0,null,null,null,0,0,null,null,null,0,0,null,null,null,0,0,null,null,null,0,0,null,null,48,0]
[null,null,null,null,null,null,null,null,null,null,null,null,null,null,null,null,null,null,{"$f":"IF($G54>=7,IF(AC54=\"\",\"\",AC54),\"\")","v":""},{"$f":"IF($G54>=7,IF(AH54=\"\",\"\",AH54),\"\")","v":""},{"$f":"IF($G54>=7,IF(AR54=\"\",\"\",AR54),\"\")","v":""},{"$f":"IF($G54>=7,IF(AW54=\"\",\"\",AW54),\"\")","v":""},{"$f":"IF($G54>=7,IF(BB54=\"\",\"\",BB54),\"\")","v":""},{"$f":"IF($G54>=7,IF(AM54=\"\",\"\",AM54),\"\")","v":""},{"$f":"IF($G54>=7,IF(BG54=\"\",\"\",BG54),\"\")","v":""},{"$f":"IF($G54>=7,IF(BL54=\"\",\"\",BL54),\"\")","v":""},null,null,0,0,null,null,null,0,0,null,null,null,0,0,null,null,null,0,0,null,null,null,0,0,null,null,null,0,0,null,null,null,0,0,null,null,null,0,0]
[null,null,null,null,null,null,null,null,null,null,null,null,null,null,null,null,null,null,{"$f":"IF($G55>=7,IF(AC55=\"\",\"\",AC55),\"\")","v":""},{"$f":"IF($G55>=7,IF(AH55=\"\",\"\",AH55),\"\")","v":""},{"$f":"IF($G55>=7,IF(AR55=\"\",\"\",AR55),\"\")","v":""},{"$f":"IF($G55>=7,IF(AW55=\"\",\"\",AW55),\"\")","v":""},{"$f":"IF($G55>=7,IF(BB55=\"\",\"\",BB55),\"\")","v":""},{"$f":"IF($G55>=7,IF(AM55=\"\",\"\",AM55),\"\")","v":""},{"$f":"IF($G55>=7,IF(BG55=\"\",\"\",BG55),\"\")","v":""},{"$f":"IF($G55>=7,IF(BL55=\"\",\"\",BL55),\"\")","v":""}]

{"sheet":"G11 2022","index":2,"n_rows":87,"n_cols":77,"rows_kept":87,"cut":false,"hidden":false,"merged":[[0,48,0,51],[2,27,2,30],[2,32,2,35],[2,42,2,45],[2,47,2,50],[3,63,3,65],[4,8,4,15],[4,18,4,25],[2,37,2,40],[2,57,2,60],[2,62,2,65],[3,28,3,30],[3,33,3,35],[3,43,3,45],[3,48,3,50],[3,53,3,55],[3,38,3,40],[3,58,3,60],[2,52,2,55]]}
["Resultatliste Oslo Cup 2022 - Gutter 11 år"]
[]
[null,null,null,null,null,null,null,null,"IRS Rennet","Ljan Rennet","Njård Rennet","Ready Rennet","Telenor Arena Cup","Kidsbühel","Oslo Alpinfestival SL","Oslo Alpinfestival SSL",null,null,"IRS Rennet","Ljan Rennet","Njård Rennet","Ready Rennet","Telenor Arena Cup","Kidsbühel","Oslo Alpinfestival SL","Oslo Alpinfestival SSL",null,"--------IRS Rennet----------",null,null,null,null,"----------Ljan Rennet---------",null,null,null,null,"------Kidsbühel--------",null,null,null,null,"--------Njård Rennet----------",null,null,null,null,"--------Ready Rennet---------",null,null,null,null,"-----Telenor Arena Cup----",null,null,null,null,"---Oslo Alpinfestival SL---",null,null,null,null,"---Oslo Alpinfestival SSL---"]
[null,null,null,null,null,null,"Antall",null,"2022-01-29","2022-01-30","2022-02-04","2022-02-05","2022-02-16","2022-02-02","2022-03-12","2022-03-13",null,"Poeng","2022-01-29","2022-01-30","2022-02-04","2022-02-05","2022-02-16","2022-02-02","2022-03-12","2022-03-13",null,null,"--------Poeng--------",null,null,null,null,"--------Poeng--------",null,null,null,null,"-------Poeng---------",null,null,null,null,"-------Poeng---------",null,null,null,null,"-------Poeng---------",null,null,null,null,"-------Poeng---------",null,null,null,null,"-------Poeng---------",null,null,null,null,"-------Poeng---------",null,null,null,null,null,"Løpere med ","Løpere med ","Løpere med ","Løpere med ","Løpere med ","Løpere med ","Løpere med ","Løpere med "]
["Plass","Plass","Etternavn","Fornavn","Klubb","Poeng","renn",null,"------------------------------Plassering i rennene---------------------------------",null,null,null,null,null,null,null,null,"brutto","----------------Resultatpoeng hvis mer enn 5 renn----------------",null,null,null,null,null,null,null,null,"Plass","Res.","Del.","Tot.",null,"Plass","Res.","Del.","Tot.",null,"Plass","Res.","Del.","Tot.",null,"Plass","Res.","Del.","Tot.",null,"Plass","Res.","Del.","Tot.",null,"Plass","Res.","Del.","Tot.",null,"Plass","Res.","Del.","Tot.",null,"Plass","Res.","Del.","Tot.",null,"Plass","Poeng","8 renn","7 renn","6 renn","5 renn","4 renn","3 renn","2 renn","kun 1 renn"]
[{"$f":"IF(F6<F5,BP6,A5)","v":1},1,"Istad","Ulrik","Ljan",{"$f":"IF(G6<=6,R6,(R6-SUM(SMALL(S6:Z6,{1;2;3}))))","v":535},{"$f":"(IF(AD6=5,1,0)+IF(AI6=5,1,0)+IF(AS6=5,1,0)+IF(AX6=5,1,0)+IF(BC6=5,1,0)+IF(AN6=5,1,0)+IF(BH6=5,1,0)+IF(BM6=5,1,0))","v":7},null,{"$f":"IF(AB6=\"\",\"\",AB6)","v":1},{"$f":"IF(AG6=\"\",\"\",AG6)","v":1},{"$f":"IF(AQ6=\"\",\"\",AQ6)","v":""},{"$f":"IF(AV6=\"\",\"\",AV6)","v":1},{"$f":"IF(BA6=\"\",\"\",BA6)","v":1},{"$f":"IF(AL6=\"\",\"\",AL6)","v":1},{"$f":"IF(BF6=\"\",\"\",BF6)","v":1},{"$f":"IF(BK6=\"\",\"\",BK6)","v":1},null,{"$f":"AE6+AJ6+AT6+AY6+BD6+AO6+BI6+BN6","v":735},{"$f":"IF($G6>=5,IF(AC6=\"\",\"\",AC6),\"\")","v":100},{"$f":"IF($G6>=5,IF(AH6=\"\",\"\",AH6),\"\")","v":100},{"$f":"IF($G6>=5,IF(AR6=\"\",\"\",AR6),\"\")","v":0},{"$f":"IF($G6>=5,IF(AW6=\"\",\"\",AW6),\"\")","v":100},{"$f":"IF($G6>=5,IF(BB6=\"\",\"\",BB6),\"\")","v":100},{"$f":"IF($G6>=5,IF(AM6=\"\",\"\",AM6),\"\")","v":100},{"$f":"IF($G6>=5,IF(BG6=\"\",\"\",BG6),\"\")","v":100},{"$f":"IF($G6>=5,IF(BL6=\"\",\"\",BL6),\"\")","v":100},null,1,{"$f":"IF(ISNUMBER(AB6),(VLOOKUP(AB6,$BP$6:$BQ$50,2)),0)","v":100},{"$f":"IF(AB6<>\"\",5,0)","v":5},{"$f":"AC6+AD6","v":105},null,1,{"$f":"IF(ISNUMBER(AG6),(VLOOKUP(AG6,$BP$6:$BQ$50,2)),0)","v":100},{"$f":"IF(AG6<>\"\",5,0)","v":5},{"$f":"AH6+AI6","v":105},null,1,{"$f":"IF(ISNUMBER(AL6),(VLOOKUP(AL6,$BP$6:$BQ$50,2)),0)","v":100},{"$f":"IF(AL6<>\"\",5,0)","v":5},{"$f":"AM6+AN6","v":105},null,null,{"$f":"IF(ISNUMBER(AQ6),(VLOOKUP(AQ6,$BP$6:$BQ$50,2)),0)","v":0},{"$f":"IF(AQ6<>\"\",5,0)","v":0},{"$f":"AR6+AS6","v":0},null,1,{"$f":"IF(ISNUMBER(AV6),(VLOOKUP(AV6,$BP$6:$BQ$50,2)),0)","v":100},{"$f":"IF(AV6<>\"\",5,0)","v":5},{"$f":"AW6+AX6","v":105},null,1,{"$f":"IF(ISNUMBER(BA6),(VLOOKUP(BA6,$BP$6:$BQ$50,2)),0)","v":100},{"$f":"IF(BA6<>\"\",5,0)","v":5},{"$f":"BB6+BC6","v":105},null,1,{"$f":"IF(ISNUMBER(BF6),(VLOOKUP(BF6,$BP$6:$BQ$50,2)),0)","v":100},{"$f":"IF(BF6<>\"\",5,0)","v":5},{"$f":"BG6+BH6","v":105},null,1,{"$f":"IF(ISNUMBER(BK6),(VLOOKUP(BK6,$BP$6:$BQ$50,2)),0)","v":100},{"$f":"IF(BK6<>\"\",5,0)","v":5},{"$f":"BL6+BM6","v":105},null,1,100,{"$f":"IF($G6=8,1,0)","v":0},{"$f":"IF($G6=7,1,0)","v":1},{"$f":"IF($G6=6,1,0)","v":0},{"$f":"IF($G6=5,1,0)","v":0},{"$f":"IF($G6=4,1,0)","v":0},{"$f":"IF($G6=3,1,0)","v":0},{"$f":"IF($G6=2,1,0)","v":0},{"$f":"IF($G6=1,1,0)","v":0}]
[2,2,"Sande","Sivert","Kjelsås",{"$f":"IF(G7<=6,R7,(R7-SUM(SMALL(S7:Z7,{1;2;3}))))","v":395},7,null,5,3,"",13,3,2,2,2,null,460,{"$f":"IF($G7>=5,IF(AC7=\"\",\"\",AC7),\"\")","v":45},{"$f":"IF($G7>=5,IF(AH7=\"\",\"\",AH7),\"\")","v":60},{"$f":"IF($G7>=5,IF(AR7=\"\",\"\",AR7),\"\")","v":0},{"$f":"IF($G7>=5,IF(AW7=\"\",\"\",AW7),\"\")","v":20},{"$f":"IF($G7>=5,IF(BB7=\"\",\"\",BB7),\"\")","v":60},{"$f":"IF($G7>=5,IF(AM7=\"\",\"\",AM7),\"\")","v":80},{"$f":"IF($G7>=5,IF(BG7=\"\",\"\",BG7),\"\")","v":80},{"$f":"IF($G7>=5,IF(BL7=\"\",\"\",BL7),\"\")","v":80},null,5,45,5,50,null,3,60,5,65,null,2,80,5,85,null,null,0,0,0,null,13,20,5,25,null,3,60,5,65,null,2,80,5,85,null,2,80,5,85,null,2,80,{"$f":"IF($G7=8,1,0)","v":0},1,0,0,0,0,0,0]
[3,3,"Søyland","Sebastian","Ready",{"$f":"IF(G8<=6,R8,(R8-SUM(SMALL(S8:Z8,{1;2;3}))))","v":305},7,null,3,"DSQ","",4,7,4,3,4,null,341,60,0,0,50,36,50,60,50,null,3,60,5,65,null,"DSQ",0,5,5,null,4,50,5,55,null,null,0,0,0,null,4,50,5,55,null,7,36,5,41,null,3,60,5,65,null,4,50,5,55,null,3,60,0,1,0,0,0,0,0,0]
[3,null,"Rødvik","Jonas","Heming",{"$f":"IF(G9<=6,R9,(R9-SUM(SMALL(S9:Z9,{1;2}))))","v":320},4,null,2,2,"",3,2,"","","",null,320,"","","","","","","","",null,2,80,5,85,null,2,80,5,85,null,null,0,0,0,null,null,0,0,0,null,3,60,5,65,null,2,80,5,85,null,null,0,0,0,null,null,0,0,0,null,4,50,0,0,0,0,1,0,0,0]
[5,4,"Moe","Oliver","Njård",{"$f":"IF(G10<=6,R10,(R10-SUM(SMALL(S10:Z10,{1;2;3}))))","v":295},7,null,"DNF","DSQ","",6,4,3,4,3,null,295,0,0,0,40,50,60,50,60,null,"DNF",0,5,5,null,"DSQ",0,5,5,null,3,60,5,65,null,null,0,0,0,null,6,40,5,45,null,4,50,5,55,null,4,50,5,55,null,3,60,5,65,null,5,45,0,1,0,0,0,0,0,0]
[6,5,"Øslebø","Erik","Ready",{"$f":"IF(G11<=6,R11,(R11-SUM(SMALL(S11:Z11,{1;2;3}))))","v":230},7,null,"DSQ","DSQ","",5,5,16,5,5,null,230,0,0,0,45,45,15,45,45,null,"DSQ",0,5,5,null,"DSQ",0,5,5,null,16,15,5,20,null,null,0,0,0,null,5,45,5,50,null,5,45,5,50,null,5,45,5,50,null,5,45,5,50,null,6,40,0,1,0,0,0,0,0,0]
[7,6,"Haukenes","Per Christian","Njård",{"$f":"IF(G12<=6,R12,(R12-SUM(SMALL(S12:Z12,{1;2;3}))))","v":189},5,null,"","","",7,15,6,7,7,null,189,0,0,0,36,16,40,36,36,null,null,0,0,0,null,null,0,0,0,null,6,40,5,45,null,null,0,0,0,null,7,36,5,41,null,15,16,5,21,null,7,36,5,41,null,7,36,5,41,null,7,36,0,0,0,1,0,0,0,0]
[8,7,"Aasen","Aleksander","Ingierkollen Rustad",{"$f":"IF(G13<=6,R13,(R13-SUM(SMALL(S13:Z13,{1;2;3}))))","v":174},7,null,7,5,"","DNS","DNS",9,"DSQ",9,null,174,36,45,0,0,0,29,0,29,null,7,36,5,41,null,5,45,5,50,null,9,29,5,34,null,null,0,0,0,null,"DNS",0,5,5,null,"DNS",0,5,5,null,"DSQ",0,5,5,null,9,29,5,34,null,8,32,0,1,0,0,0,0,0,0]
[9,8,"Østerud","Oskar","Njård",{"$f":"IF(G14<=6,R14,(R14-SUM(SMALL(S14:Z14,{1;2;3}))))","v":161},6,null,"DSQ",8,"",14,19,"",9,6,null,161,0,32,0,18,12,0,29,40,null,"DSQ",0,5,5,null,8,32,5,37,null,null,0,0,0,null,null,0,0,0,null,14,18,5,23,null,19,12,5,17,null,9,29,5,34,null,6,40,5,45,null,9,29,0,0,1,0,0,0,0,0]
[10,9,"Hagfors","Viktor","Ready",{"$f":"IF(G15<=6,R15,(R15-SUM(SMALL(S15:Z15,{1;2;3}))))","v":156},6,null,"","DSQ","",12,25,6,6,14,null,156,0,0,0,22,6,40,40,18,null,null,0,0,0,null,"DSQ",0,5,5,null,6,40,5,45,null,null,0,0,0,null,12,22,5,27,null,25,6,5,11,null,6,40,5,45,null,14,18,5,23,null,10,26,0,0,1,0,0,0,0,0]
[11,10,"Hagen-Småstu","Haakon","Kjelsås",{"$f":"IF(G16<=6,R16,(R16-SUM(SMALL(S16:Z16,{1;2;3}))))","v":151},6,null,"",9,"",16,20,12,12,12,null,151,0,29,0,15,11,22,22,22,null,null,0,0,0,null,9,29,5,34,null,12,22,5,27,null,null,0,0,0,null,16,15,5,20,null,20,11,5,16,null,12,22,5,27,null,12,22,5,27,null,11,24,0,0,1,0,0,0,0,0]
[12,11,"Andresen","Nicolai Andres","Heming",{"$f":"IF(G17<=6,R17,(R17-SUM(SMALL(S17:Z17,{1;2;3}))))","v":141},5,null,6,4,"","",10,"","dns","DNS",null,141,40,50,0,0,26,0,0,0,null,6,40,5,45,null,4,50,5,55,null,null,0,0,0,null,null,0,0,0,null,null,0,0,0,null,10,26,5,31,null,"dns",0,5,5,null,"DNS",0,5,5,null,12,22,0,0,0,1,0,0,0,0]
[13,12,"Bjørnestad","Alexander","Ready",{"$f":"IF(G18<=6,R18,(R18-SUM(SMALL(S18:Z18,{1;2;3}))))","v":125},7,null,"DSQ","DSQ","",8,"DNF","DSQ",10,8,null,125,0,0,0,32,0,0,26,32,null,"DSQ",0,5,5,null,"DSQ",0,5,5,null,"DSQ",0,5,5,null,null,0,0,0,null,8,32,5,37,null,"DNF",0,5,5,null,10,26,5,31,null,8,32,5,37,null,13,20,0,1,0,0,0,0,0,0]
[14,null,"Tranby-Arnesen","Nikolas","Heming",{"$f":"IF(G19<=6,R19,(R19-SUM(SMALL(S19:Z19,{1;2}))))","v":110},4,null,4,"","","DNS",6,"DNS","","",null,110,"","","","","","","","",null,4,50,5,55,null,null,0,0,0,null,"DNS",0,5,5,null,null,0,0,0,null,"DNS",0,5,5,null,6,40,5,45,null,null,0,0,0,null,null,0,0,0,null,14,18,0,0,0,0,1,0,0,0]
[15,13,"Bang-Hansen","Jens Christian","Heming",{"$f":"IF(G20<=6,R20,(R20-SUM(SMALL(S20:Z20,{1;2;3}))))","v":102},5,null,"","","",9,11,11,"DNS","DNS",null,102,0,0,0,29,24,24,0,0,null,null,0,0,0,null,null,0,0,0,null,11,24,5,29,null,null,0,0,0,null,9,29,5,34,null,11,24,5,29,null,"DNS",0,5,5,null,"DNS",0,5,5,null,15,16,0,0,0,1,0,0,0,0]
[16,null,"Bakkevig","Karl-Erik","Heming",{"$f":"IF(G21<=6,R21,(R21-SUM(SMALL(S21:Z21,{1;2}))))","v":90},2,null,"","","",2,"DNF","","","",null,90,"","","","","","","","",null,null,0,0,0,null,null,0,0,0,null,null,0,0,0,null,null,0,0,0,null,2,80,5,85,null,"DNF",0,5,5,null,null,0,0,0,null,null,0,0,0,null,16,15,0,0,0,0,0,0,1,0]
[17,null,"Henschien","Scott","Heming",{"$f":"IF(G22<=6,R22,(R22-SUM(SMALL(S22:Z22,{1;2}))))","v":78},3,null,"","DNS","","",14,5,"","",null,78,"","","","","","","","",null,null,0,0,0,null,"DNS",0,5,5,null,5,45,5,50,null,null,0,0,0,null,null,0,0,0,null,14,18,5,23,null,null,0,0,0,null,null,0,0,0,null,17,14,0,0,0,0,0,1,0,0]
[18,null,"Lunder","Daniel","Njård",{"$f":"IF(G23<=6,R23,(R23-SUM(SMALL(S23:Z23,{1;2}))))","v":72},4,null,"DSQ","DSQ","",10,"","","",10,null,72,"","","","","","","","",null,"DSQ",0,5,5,null,"DSQ",0,5,5,null,null,0,0,0,null,null,0,0,0,null,10,26,5,31,null,null,0,0,0,null,null,0,0,0,null,10,26,5,31,null,18,13,0,0,0,0,1,0,0,0]
[19,null,"Furuseth","Martin","Kjelsås",{"$f":"IF(G24<=6,R24,(R24-SUM(SMALL(S24:Z24,{1;2}))))","v":70},4,null,"","","","","DNS",10,11,"DNS",null,70,"","","","","","","","",null,null,0,0,0,null,null,0,0,0,null,10,26,5,31,null,null,0,0,0,null,null,0,0,0,null,"DNS",0,5,5,null,11,24,5,29,null,"DNS",0,5,5,null,19,12,0,0,0,0,1,0,0,0]
[20,null,"Jürgensen","Oliver","Ready",{"$f":"IF(G25<=6,R25,(R25-SUM(SMALL(S25:Z25,{1;2}))))","v":62},3,null,8,"","","",16,"DNS","","",null,62,"","","","","","","","",null,8,32,5,37,null,null,0,0,0,null,"DNS",0,5,5,null,null,0,0,0,null,null,0,0,0,null,16,15,5,20,null,null,0,0,0,null,null,0,0,0,null,20,11,0,0,0,0,0,1,0,0]
[21,null,"Enoksen","Håkon","Ingierkollen Rustad",{"$f":"IF(G26<=6,R26,(R26-SUM(SMALL(S26:Z26,{1;2}))))","v":60},3,null,"","","","",18,"",8,"DSQ",null,60,"","","","","","","","",null,null,0,0,0,null,null,0,0,0,null,null,0,0,0,null,null,0,0,0,null,null,0,0,0,null,18,13,5,18,null,8,32,5,37,null,"DSQ",0,5,5,null,21,10,0,0,0,0,0,1,0,0]
[21,null,"Olsson","Nicolai","Heming",{"$f":"IF(G27<=6,R27,(R27-SUM(SMALL(S27:Z27,{1;2}))))","v":60},2,null,"",6,"","",21,"","","",null,60,"","","","","","","","",null,null,0,0,0,null,6,40,5,45,null,null,0,0,0,null,null,0,0,0,null,null,0,0,0,null,21,10,5,15,null,null,0,0,0,null,null,0,0,0,null,22,9,0,0,0,0,0,0,1,0]
[23,null,"Gundersen","Kristian","Njård",{"$f":"IF(G28<=6,R28,(R28-SUM(SMALL(S28:Z28,{1;2}))))","v":58},4,null,"","","",11,17,"","DNS","DNS",null,58,"","","","","","","","",null,null,0,0,0,null,null,0,0,0,null,null,0,0,0,null,null,0,0,0,null,11,24,5,29,null,17,14,5,19,null,"DNS",0,5,5,null,"DNS",0,5,5,null,23,8,0,0,0,0,1,0,0,0]
[23,null,"Welin","Jon Ferdinand","Heming",{"$f":"IF(G29<=6,R29,(R29-SUM(SMALL(S29:Z29,{1;2}))))","v":58},3,null,"DSQ",7,"","",24,"","","",null,58,"","","","","","","","",null,"DSQ",0,5,5,null,7,36,5,41,null,null,0,0,0,null,null,0,0,0,null,null,0,0,0,null,24,7,5,12,null,null,0,0,0,null,null,0,0,0,null,24,7,0,0,0,0,0,1,0,0]
[25,null,"Gilhuus-Moe","Leopold","Ready",{"$f":"IF(G30<=6,R30,(R30-SUM(SMALL(S30:Z30,{1;2}))))","v":54},4,null,"DSQ","DNS","","",29,8,"","",null,54,"","","","","","","","",null,"DSQ",0,5,5,null,"DNS",0,5,5,null,8,32,5,37,null,null,0,0,0,null,null,0,0,0,null,29,2,5,7,null,null,0,0,0,null,null,0,0,0,null,25,6,0,0,0,0,1,0,0,0]
[25,14,"Aandal","Andreas","Ready",{"$f":"IF(G31<=6,R31,(R31-SUM(SMALL(S31:Z31,{1;2;3}))))","v":54},5,null,"","","","DNS",22,"DNS","DNS",13,null,54,0,0,0,0,9,0,0,20,null,null,0,0,0,null,null,0,0,0,null,"DNS",0,5,5,null,null,0,0,0,null,"DNS",0,5,5,null,22,9,5,14,null,"DNS",0,5,5,null,13,20,5,25,null,26,5,0,0,0,1,0,0,0,0]
[27,null,"Hommefoss","Ole-Andre","Njård",{"$f":"IF(G32<=6,R32,(R32-SUM(SMALL(S32:Z32,{1;2}))))","v":52},4,null,"","","","DNS",23,"","dsq",11,null,52,"","","","","","","","",null,null,0,0,0,null,null,0,0,0,null,null,0,0,0,null,null,0,0,0,null,"DNS",0,5,5,null,23,8,5,13,null,"dsq",0,5,5,null,11,24,5,29,null,27,4,0,0,0,0,1,0,0,0]
[28,null,"Cock","Scott","Heming",{"$f":"IF(G33<=6,R33,(R33-SUM(SMALL(S33:Z33,{1;2}))))","v":51},3,null,"","DNS","",17,12,"","","",null,51,"","","","","","","","",null,null,0,0,0,null,"DNS",0,5,5,null,null,0,0,0,null,null,0,0,0,null,17,14,5,19,null,12,22,5,27,null,null,0,0,0,null,null,0,0,0,null,28,3,0,0,0,0,0,1,0,0]
[29,null,"Nilsen","Axel Henrik","Kjelsås",{"$f":"IF(G34<=6,R34,(R34-SUM(SMALL(S34:Z34,{1;2}))))","v":50},3,null,"","","","","",16,13,"DNS",null,50,"","","","","","","","",null,null,0,0,0,null,null,0,0,0,null,16,15,5,20,null,null,0,0,0,null,null,0,0,0,null,null,0,0,0,null,13,20,5,25,null,"DNS",0,5,5,null,29,2,0,0,0,0,0,1,0,0]
[30,null,"Wroll-Evensen","Nicolai","Heming",{"$f":"IF(G35<=6,R35,(R35-SUM(SMALL(S35:Z35,{1;2}))))","v":49},4,null,"DNS","DSQ","","DNS",9,"","","",null,49,"","","","","","","","",null,"DNS",0,5,5,null,"DSQ",0,5,5,null,null,0,0,0,null,null,0,0,0,null,"DNS",0,5,5,null,9,29,5,34,null,null,0,0,0,null,null,0,0,0,null,30,1,0,0,0,0,1,0,0,0]
[31,null,"Hagen","Emil","Ready",{"$f":"IF(G36<=6,R36,(R36-SUM(SMALL(S36:Z36,{1;2}))))","v":37},1,null,"","","","",8,"","","",null,37,"","","","","","","","",null,null,0,0,0,null,null,0,0,0,null,null,0,0,0,null,null,0,0,0,null,null,0,0,0,null,8,32,5,37,null,null,0,0,0,null,null,0,0,0,null,31,0,0,0,0,0,0,0,0,1]
[32,null,"Maribu","Andreas","Kjelsås",{"$f":"IF(G37<=6,R37,(R37-SUM(SMALL(S37:Z37,{1;2}))))","v":33},3,null,"","","","","",14,"DNS","DNS",null,33,"","","","","","","","",null,null,0,0,0,null,null,0,0,0,null,14,18,5,23,null,null,0,0,0,null,null,0,0,0,null,null,0,0,0,null,"DNS",0,5,5,null,"DNS",0,5,5,null,32,0,0,0,0,0,0,1,0,0]
[{"$f":"IF(F38<F37,BP38,A37)","v":33},null,"Gatty","Paul Lennart","Heming",{"$f":"IF(G38<=6,R38,(R38-SUM(SMALL(S38:Z38,{1;2}))))","v":29},{"$f":"(IF(AD38=5,1,0)+IF(AI38=5,1,0)+IF(AS38=5,1,0)+IF(AX38=5,1,0)+IF(BC38=5,1,0)+IF(AN38=5,1,0)+IF(BH38=5,1,0)+IF(BM38=5,1,0))","v":2},null,"","","","",28,15,"","",null,{"$f":"AE38+AJ38+AT38+AY38+BD38+AO38+BI38+BN38","v":29},"","","","","","","","",null,null,{"$f":"IF(ISNUMBER(AB38),(VLOOKUP(AB38,$BP$6:$BQ$50,2)),0)","v":0},{"$f":"IF(AB38<>\"\",5,0)","v":0},{"$f":"AC38+AD38","v":0},null,null,{"$f":"IF(ISNUMBER(AG38),(VLOOKUP(AG38,$BP$6:$BQ$50,2)),0)","v":0},{"$f":"IF(AG38<>\"\",5,0)","v":0},{"$f":"AH38+AI38","v":0},null,15,{"$f":"IF(ISNUMBER(AL38),(VLOOKUP(AL38,$BP$6:$BQ$50,2)),0)","v":16},{"$f":"IF(AL38<>\"\",5,0)","v":5},{"$f":"AM38+AN38","v":21},null,null,{"$f":"IF(ISNUMBER(AQ38),(VLOOKUP(AQ38,$BP$6:$BQ$50,2)),0)","v":0},{"$f":"IF(AQ38<>\"\",5,0)","v":0},{"$f":"AR38+AS38","v":0},null,null,{"$f":"IF(ISNUMBER(AV38),(VLOOKUP(AV38,$BP$6:$BQ$50,2)),0)","v":0},{"$f":"IF(AV38<>\"\",5,0)","v":0},{"$f":"AW38+AX38","v":0},null,28,{"$f":"IF(ISNUMBER(BA38),(VLOOKUP(BA38,$BP$6:$BQ$50,2)),0)","v":3},{"$f":"IF(BA38<>\"\",5,0)","v":5},{"$f":"BB38+BC38","v":8},null,null,{"$f":"IF(ISNUMBER(BF38),(VLOOKUP(BF38,$BP$6:$BQ$50,2)),0)","v":0},{"$f":"IF(BF38<>\"\",5,0)","v":0},{"$f":"BG38+BH38","v":0},null,null,{"$f":"IF(ISNUMBER(BK38),(VLOOKUP(BK38,$BP$6:$BQ$50,2)),0)","v":0},{"$f":"IF(BK38<>\"\",5,0)","v":0},{"$f":"BL38+BM38","v":0},null,33,0,0,0,0,0,0,0,1,0]
[34,null,"Heidenreich","Petter Erik","Ready",{"$f":"IF(G39<=6,R39,(R39-SUM(SMALL(S39:Z39,{1;2}))))","v":25},1,null,"","","","","",13,"","",null,25,"","","","","","","","",null,null,0,0,0,null,null,0,0,0,null,13,20,5,25,null,null,0,0,0,null,null,0,0,0,null,null,0,0,0,null,null,0,0,0,null,null,0,0,0,null,34,0,0,0,0,0,0,0,0,1]
[34,null,"Lødding","Jonas","Heming",{"$f":"IF(G40<=6,R40,(R40-SUM(SMALL(S40:Z40,{1;2}))))","v":25},1,null,"","","","",13,"","","",null,25,"","","","","","","","",null,null,0,0,0,null,null,0,0,0,null,null,0,0,0,null,null,0,0,0,null,null,0,0,0,null,13,20,5,25,null,null,0,0,0,null,null,0,0,0,null,35,0,0,0,0,0,0,0,0,1]
[36,null,"Lægreid","Markus","Ready",{"$f":"IF(G41<=6,R41,(R41-SUM(SMALL(S41:Z41,{1;2}))))","v":21},1,null,"","","",15,"","","","",null,21,"","","","","","","","",null,null,0,0,0,null,null,0,0,0,null,null,0,0,0,null,null,0,0,0,null,15,16,5,21,null,null,0,0,0,null,null,0,0,0,null,null,0,0,0,null,36,0,0,0,0,0,0,0,0,1]
[37,null,"Aamodt","Philip Alexander","Kjelsås",{"$f":"IF(G42<=6,R42,(R42-SUM(SMALL(S42:Z42,{1;2}))))","v":20},4,null,"","","","DNS","DNS","DNS","","DNS",null,20,"","","","","","","","",null,null,0,0,0,null,null,0,0,0,null,"DNS",0,5,5,null,null,0,0,0,null,"DNS",0,5,5,null,"DNS",0,5,5,null,null,0,0,0,null,"DNS",0,5,5,null,37,0,0,0,0,0,1,0,0,0]
[38,null,"Haukeli","Aksel","Heming",{"$f":"IF(G43<=6,R43,(R43-SUM(SMALL(S43:Z43,{1;2}))))","v":15},3,null,"","","","DNS","DNS","DNS","","",null,15,"","","","","","","","",null,null,0,0,0,null,null,0,0,0,null,"DNS",0,5,5,null,null,0,0,0,null,"DNS",0,5,5,null,"DNS",0,5,5,null,null,0,0,0,null,null,0,0,0,null,38,0,0,0,0,0,0,1,0,0]
[38,null,"Mohn","Henrik","Heming",{"$f":"IF(G44<=6,R44,(R44-SUM(SMALL(S44:Z44,{1;2}))))","v":15},3,null,"DNS","DSQ","","DNS","","","","",null,15,"","","","","","","","",null,"DNS",0,5,5,null,"DSQ",0,5,5,null,null,0,0,0,null,null,0,0,0,null,"DNS",0,5,5,null,null,0,0,0,null,null,0,0,0,null,null,0,0,0,null,39,0,0,0,0,0,0,1,0,0]
[40,null,"Carr","Michael","Heming",{"$f":"IF(G45<=6,R45,(R45-SUM(SMALL(S45:Z45,{1;2}))))","v":10},2,null,"","","","DSQ","DNF","","","",null,10,"","","","","","","","",null,null,0,0,0,null,null,0,0,0,null,null,0,0,0,null,null,0,0,0,null,"DSQ",0,5,5,null,"DNF",0,5,5,null,null,0,0,0,null,null,0,0,0,null,40,0,0,0,0,0,0,0,1,0]
[40,null,"Lødding","Casper","Heming",{"$f":"IF(G46<=6,R46,(R46-SUM(SMALL(S46:Z46,{1;2}))))","v":10},1,null,"","","","",26,{"$f":"IF(BA46=\"\",\"\",BA46)","v":26},{"$f":"IF(AL46=\"\",\"\",AL46)","v":""},{"$f":"IF(BF46=\"\",\"\",BF46)","v":""},null,10,"","","","","","","","",null,null,0,0,0,null,null,0,0,0,null,null,0,0,0,null,null,0,0,0,null,null,0,0,0,null,26,5,5,10,null,null,0,0,0,null,null,0,0,0,null,41,0,0,0,0,0,0,0,0,1]
[42,null,"Lødding","Theodor","Heming",{"$f":"IF(G47<=6,R47,(R47-SUM(SMALL(S47:Z47,{1;2}))))","v":9},1,null,null,null,null,null,null,null,null,null,null,9,"","","","","","","","",null,null,0,0,0,null,null,0,0,0,null,null,0,0,0,null,null,0,0,0,null,null,0,0,0,null,27,4,5,9,null,null,0,0,0,null,null,0,0,0,null,42,0,0,0,0,0,0,0,0,1]
[43,null,"Asvall","Eimund","Heming",{"$f":"IF(G48<=6,R48,(R48-SUM(SMALL(S48:Z48,{1;2}))))","v":5},1,null,null,null,null,null,null,null,null,null,null,5,"","","","","","","","",null,null,0,0,0,null,null,0,0,0,null,null,0,0,0,null,null,0,0,0,null,null,0,0,0,null,"DNF",0,5,5,null,null,0,0,0,null,null,0,0,0,null,43,0,0,0,0,0,0,0,0,1]
[43,null,"Grove-Knutsen","Sander","Ljan",{"$f":"IF(G49<=6,R49,(R49-SUM(SMALL(S49:Z49,{1;2}))))","v":5},1,null,{"$f":"IF(AB49=\"\",\"\",AB49)","v":""},{"$f":"IF(AG49=\"\",\"\",AG49)","v":"DNS"},{"$f":"IF(AQ49=\"\",\"\",AQ49)","v":""},{"$f":"IF(AV49=\"\",\"\",AV49)","v":""},{"$f":"IF(BA49=\"\",\"\",BA49)","v":""},{"$f":"IF(AL49=\"\",\"\",AL49)","v":""},{"$f":"IF(BF49=\"\",\"\",BF49)","v":""},{"$f":"IF(BK49=\"\",\"\",BK49)","v":""},null,5,"","","","","","","","",null,null,0,0,0,null,"DNS",0,5,5,null,null,0,0,0,null,null,0,0,0,null,null,0,0,0,null,null,0,0,0,null,null,0,0,0,null,null,0,0,0,null,44,0,0,0,0,0,0,0,0,1]
[43,null,"Hjelseth","Theo","Heming",{"$f":"IF(G50<=6,R50,(R50-SUM(SMALL(S50:Z50,{1;2}))))","v":5},1,null,null,null,null,null,null,null,null,null,null,5,"","","","","","","","",null,null,0,0,0,null,null,0,0,0,null,null,0,0,0,null,null,0,0,0,null,null,0,0,0,null,"DNS",0,5,5,null,null,0,0,0,null,null,0,0,0,null,45,0,0,0,0,0,0,0,0,1]
[43,null,"Ljungberg-Tvedt","Christopher","Heming",{"$f":"IF(G51<=6,R51,(R51-SUM(SMALL(S51:Z51,{1;2}))))","v":5},1,null,null,null,null,null,null,null,null,null,null,5,"","","","","","","","",null,null,0,0,0,null,null,0,0,0,null,null,0,0,0,null,null,0,0,0,null,null,0,0,0,null,"DNF",0,5,5,null,null,0,0,0,null,null,0,0,0,null,46,0,0,0,0,0,0,0,0,1]
[43,null,"Strømsnes","Carl-Cornelius","Ljan",{"$f":"IF(G52<=6,R52,(R52-SUM(SMALL(S52:Z52,{1;2}))))","v":5},1,null,{"$f":"IF(AB52=\"\",\"\",AB52)","v":""},{"$f":"IF(AG52=\"\",\"\",AG52)","v":"DSQ"},{"$f":"IF(AQ52=\"\",\"\",AQ52)","v":""},{"$f":"IF(AV52=\"\",\"\",AV52)","v":""},{"$f":"IF(BA52=\"\",\"\",BA52)","v":""},{"$f":"IF(AL52=\"\",\"\",AL52)","v":""},{"$f":"IF(BF52=\"\",\"\",BF52)","v":""},{"$f":"IF(BK52=\"\",\"\",BK52)","v":""},null,5,"","","","","","","","",null,null,0,0,0,null,"DSQ",0,5,5,null,null,0,0,0,null,null,0,0,0,null,null,0,0,0,null,null,0,0,0,null,null,0,0,0,null,null,0,0,0,null,47,0,0,0,0,0,0,0,0,1]
[48,null,null,null,null,{"$f":"IF(G53<=6,R53,(R53-SUM(SMALL(S53:Z53,{1;2}))))","v":0},0,null,null,null,null,null,null,null,null,null,null,0,"","","","","","","","",null,null,0,0,0,null,null,0,0,0,null,null,0,0,0,null,null,0,0,0,null,null,0,0,0,null,null,0,0,0,null,null,0,0,0,null,null,0,0,0,null,48,1,0,0,0,0,0,0,0,0]
[48,null,null,null,null,{"$f":"IF(G54<=6,R54,(R54-SUM(SMALL(S54:Z54,{1;2}))))","v":0},0,null,null,null,null,null,null,null,null,null,null,0,"","","","","","","","",null,null,0,0,0,null,null,0,0,0,null,null,0,0,0,null,null,0,0,0,null,null,0,0,0,null,null,0,0,0,null,null,0,0,0,null,null,0,0,0,null,49,2,0,0,0,0,0,0,0,0]
[48,null,null,null,null,{"$f":"IF(G55<=6,R55,(R55-SUM(SMALL(S55:Z55,{1;2}))))","v":0},0,null,null,null,null,null,null,null,null,null,null,0,"","","","","","","","",null,null,null,null,0,null,null,null,null,0,null,null,null,null,0,null,null,null,null,0,null,null,null,null,0,null,null,null,null,0,null,null,null,null,0,null,null,null,null,0,null,50,3,0,0,0,0,0,0,0,0]
[null,null,null,null,null,null,null,null,{"$f":"IF(AB56=\"\",\"\",AB56)","v":""},{"$f":"IF(AG56=\"\",\"\",AG56)","v":""},{"$f":"IF(AQ56=\"\",\"\",AQ56)","v":""},{"$f":"IF(AV56=\"\",\"\",AV56)","v":""},{"$f":"IF(BA56=\"\",\"\",BA56)","v":""},{"$f":"IF(AL56=\"\",\"\",AL56)","v":""},{"$f":"IF(BF56=\"\",\"\",BF56)","v":""},{"$f":"IF(BK56=\"\",\"\",BK56)","v":""},null,null,{"$f":"IF($G56>=7,IF(AC56=\"\",\"\",AC56),\"\")","v":""},{"$f":"IF($G56>=7,IF(AH56=\"\",\"\",AH56),\"\")","v":""},{"$f":"IF($G56>=7,IF(AR56=\"\",\"\",AR56),\"\")","v":""},{"$f":"IF($G56>=7,IF(AW56=\"\",\"\",AW56),\"\")","v":""},{"$f":"IF($G56>=7,IF(BB56=\"\",\"\",BB56),\"\")","v":""},{"$f":"IF($G56>=7,IF(AM56=\"\",\"\",AM56),\"\")","v":""},{"$f":"IF($G56>=7,IF(BG56=\"\",\"\",BG56),\"\")","v":""},{"$f":"IF($G56>=7,IF(BL56=\"\",\"\",BL56),\"\")","v":""}]
[null,null,null,null,null,null,null,null,"","","","","","","","",null,null,"","","","","","","",""]
[null,null,null,null,null,null,null,null,"","","","","","","","",null,null,"","","","","","","",""]
[null,null,null,null,null,null,null,null,"","","","","","","","",null,null,"","","","","","","",""]
[null,null,null,null,null,null,null,null,"","","","","","","","",null,null,"","","","","","","",""]
[null,null,null,null,null,null,null,null,"","","","","","","","",null,null,"","","","","","","",""]
[null,null,null,null,null,null,null,null,"","","","","","","","",null,null,"","","","","","","",""]
[null,null,null,null,null,null,null,null,"","","","","","","","",null,null,"","","","","","","",""]
[null,null,null,null,null,null,null,null,"","","","","","","","",null,null,"","","","","","","",""]
[null,null,null,null,null,null,null,null,"","","","","","","","",null,null,"","","","","","","",""]
[null,null,null,null,null,null,null,null,"","","","","","","","",null,null,"","","","","","","",""]
[null,null,null,null,null,null,null,null,"","","","","","","","",null,null,"","","","","","","",""]
[null,null,null,null,null,null,null,null,"","","","","","","","",null,null,"","","","","","","",""]
[null,null,null,null,null,null,null,null,"","","","","","","","",null,null,"","","","","","","",""]
[null,null,null,null,null,null,null,null,{"$f":"IF(AB70=\"\",\"\",AB70)","v":""},{"$f":"IF(AG70=\"\",\"\",AG70)","v":""},{"$f":"IF(AQ70=\"\",\"\",AQ70)","v":""},{"$f":"IF(AV70=\"\",\"\",AV70)","v":""},{"$f":"IF(BA70=\"\",\"\",BA70)","v":""},"",{"$f":"IF(BF70=\"\",\"\",BF70)","v":""},{"$f":"IF(BK70=\"\",\"\",BK70)","v":""},null,null,{"$f":"IF($G70>=7,IF(AC70=\"\",\"\",AC70),\"\")","v":""},{"$f":"IF($G70>=7,IF(AH70=\"\",\"\",AH70),\"\")","v":""},{"$f":"IF($G70>=7,IF(AR70=\"\",\"\",AR70),\"\")","v":""},{"$f":"IF($G70>=7,IF(AW70=\"\",\"\",AW70),\"\")","v":""},{"$f":"IF($G70>=7,IF(BB70=\"\",\"\",BB70),\"\")","v":""},{"$f":"IF($G70>=7,IF(AM70=\"\",\"\",AM70),\"\")","v":""},{"$f":"IF($G70>=7,IF(BG70=\"\",\"\",BG70),\"\")","v":""},{"$f":"IF($G70>=7,IF(BL70=\"\",\"\",BL70),\"\")","v":""}]
[null,null,null,null,null,null,null,null,"","","","","","","","",null,null,"","","","","","","",""]
[null,null,null,null,null,null,null,null,"","","","","","","","",null,null,"","","","","","","",""]
[null,null,null,null,null,null,null,null,"","","","","","","","",null,null,"","","","","","","",""]
[null,null,null,null,null,null,null,null,"","","","","","","","",null,null,"","","","","","","",""]
[null,null,null,null,null,null,null,null,"","","","","","","","",null,null,"","","","","","","",""]
[null,null,null,null,null,null,null,null,"","","","","","","","",null,null,"","","","","","","",""]
[null,null,null,null,null,null,null,null,"","","","","","","","",null,null,"","","","","","","",""]
[null,null,null,null,null,null,null,null,"","","","","","","","",null,null,"","","","","","","",""]
[null,null,null,null,null,null,null,null,"","","","","","","","",null,null,"","","","","","","",""]
[null,null,null,null,null,null,null,null,"","","","","","","","",null,null,"","","","","","","",""]
[null,null,null,null,null,null,null,null,"","","","","","","","",null,null,"","","","","","","",""]
[null,null,null,null,null,null,null,null,"","","","","","","","",null,null,"","","","","","","",""]
[null,null,null,null,null,null,null,null,"","","","","","","","",null,null,"","","","","","","",""]
[null,null,null,null,null,null,null,null,"","","","","","","","",null,null,"","","","","","","",""]
[null,null,null,null,null,null,null,null,"","","","","","","","",null,null,"","","","","","","",""]
[null,null,null,null,null,null,null,null,"","","","","","","","",null,null,"","","","","","","",""]
[null,null,null,null,null,null,null,null,"","","","","","","","",null,null,"","","","","","","",""]

{"sheet":"J12 2022","index":3,"n_rows":71,"n_cols":77,"rows_kept":71,"cut":false,"hidden":false,"merged":[[0,48,0,51],[2,27,2,30],[2,32,2,35],[2,37,2,40],[2,47,2,50],[3,63,3,65],[4,8,4,15],[4,18,4,25],[2,42,2,45],[2,57,2,60],[2,62,2,65],[3,28,3,30],[3,33,3,35],[3,38,3,40],[3,48,3,50],[3,53,3,55],[3,43,3,45],[3,58,3,60],[2,52,2,55]]}
[null,"Resultatliste Oslo Cup 20122- Jenter 12 år"]
[]
[null,null,null,null,null,null,null,null,"IRS Rennet","Ljan Rennet","Njård Rennet","Ready Rennet","Telenor Arena Cup","Kidsbühel","Oslo Alpinfestival SL","Oslo Alpinfestival SSL",null,null,"IRS Rennet","Ljan Rennet","Njård Rennet","Ready Rennet","Telenor Arena Cup","Kidsbühel","Oslo Alpinfestival SL","Oslo Alpinfestival SSL",null,"--------IRS Rennet----------",null,null,null,null,"----------Ljan Rennet---------",null,null,null,null,"--------Njård Rennet----------",null,null,null,null,"------Kidsbühel--------",null,null,null,null,"--------Ready Rennet---------",null,null,null,null,"-----Telenor Arena Cup----",null,null,null,null,"---Oslo Alpinfestival SL---",null,null,null,null,"---Oslo Alpinfestival SSL---"]
[null,null,null,null,null,null,"Antall",null,"2022-01-29","2022-01-30","2022-02-04","2022-02-05","2022-02-16","2022-02-02","2022-03-12","2022-03-13",null,"Poeng","2022-01-29","2022-01-30","2022-02-04","2022-02-05","2022-02-16","2022-02-02","2022-03-12","2022-03-13",null,null,"--------Poeng--------",null,null,null,null,"--------Poeng--------",null,null,null,null,"-------Poeng---------",null,null,null,null,"-------Poeng---------",null,null,null,null,"-------Poeng---------",null,null,null,null,"-------Poeng---------",null,null,null,null,"-------Poeng---------",null,null,null,null,"-------Poeng---------",null,null,null,null,null,"Løpere med ","Løpere med ","Løpere med ","Løpere med ","Løpere med ","Løpere med ","Løpere med ","Løpere med "]
["Plass","Plass","Etternavn","Fornavn","Klubb","Poeng","renn",null,"------------------------------Plassering i rennene---------------------------------",null,null,null,null,null,null,null,null,"brutto","----------------Resultatpoeng hvis mer enn 5 renn----------------",null,null,null,null,null,null,null,null,"Plass","Res.","Del.","Tot.",null,"Plass","Res.","Del.","Tot.",null,"Plass","Res.","Del.","Tot.",null,"Plass","Res.","Del.","Tot.",null,"Plass","Res.","Del.","Tot.",null,"Plass","Res.","Del.","Tot.",null,"Plass","Res.","Del.","Tot.",null,"Plass","Res.","Del.","Tot.",null,"Plass","Poeng","8 renn","7 renn","6 renn","5 renn","4 renn","3 renn","2 renn","kun 1 renn"]
[{"$f":"IF(F6<F5,BP6,A5)","v":1},1,"Jæger","Johanne","Ingierkollen Rustad",{"$f":"IF(G6<5,\"\",(R6-SUM(SMALL(S6:Z6,{1;2;3}))))","v":535},{"$f":"(IF(AD6=5,1,0)+IF(AI6=5,1,0)+IF(AN6=5,1,0)+IF(AX6=5,1,0)+IF(BC6=5,1,0)+IF(AS6=5,1,0)+IF(BH6=5,1,0)+IF(BM6=5,1,0))","v":7},null,{"$f":"IF(AB6=\"\",\"\",AB6)","v":1},{"$f":"IF(AG6=\"\",\"\",AG6)","v":1},{"$f":"IF(AL6=\"\",\"\",AL6)","v":""},{"$f":"IF(AV6=\"\",\"\",AV6)","v":7},{"$f":"IF(BA6=\"\",\"\",BA6)","v":1},{"$f":"IF(AQ6=\"\",\"\",AQ6)","v":2},{"$f":"IF(BF6=\"\",\"\",BF6)","v":1},{"$f":"IF(BK6=\"\",\"\",BK6)","v":1},null,{"$f":"AE6+AJ6+AO6+AY6+BD6+AT6+BI6+BN6","v":651},{"$f":"IF($G6>=5,IF(AC6=\"\",\"\",AC6),\"\")","v":100},{"$f":"IF($G6>=5,IF(AH6=\"\",\"\",AH6),\"\")","v":100},{"$f":"IF($G6>=5,IF(AM6=\"\",\"\",AM6),\"\")","v":0},{"$f":"IF($G6>=5,IF(AW6=\"\",\"\",AW6),\"\")","v":36},{"$f":"IF($G6>=5,IF(BB6=\"\",\"\",BB6),\"\")","v":100},{"$f":"IF($G6>=5,IF(AR6=\"\",\"\",AR6),\"\")","v":80},{"$f":"IF($G6>=5,IF(BG6=\"\",\"\",BG6),\"\")","v":100},{"$f":"IF($G6>=5,IF(BL6=\"\",\"\",BL6),\"\")","v":100},null,1,{"$f":"IF(ISNUMBER(AB6),(VLOOKUP(AB6,$BP$6:$BQ$49,2)),0)","v":100},{"$f":"IF(AB6<>\"\",5,0)","v":5},{"$f":"AC6+AD6","v":105},null,1,{"$f":"IF(ISNUMBER(AG6),(VLOOKUP(AG6,$BP$6:$BQ$49,2)),0)","v":100},{"$f":"IF(AG6<>\"\",5,0)","v":5},{"$f":"AH6+AI6","v":105},null,null,{"$f":"IF(ISNUMBER(AL6),(VLOOKUP(AL6,$BP$6:$BQ$49,2)),0)","v":0},{"$f":"IF(AL6<>\"\",5,0)","v":0},{"$f":"AM6+AN6","v":0},null,2,{"$f":"IF(ISNUMBER(AQ6),(VLOOKUP(AQ6,$BP$6:$BQ$49,2)),0)","v":80},{"$f":"IF(AQ6<>\"\",5,0)","v":5},{"$f":"AR6+AS6","v":85},null,7,{"$f":"IF(ISNUMBER(AV6),(VLOOKUP(AV6,$BP$6:$BQ$49,2)),0)","v":36},{"$f":"IF(AV6<>\"\",5,0)","v":5},{"$f":"AW6+AX6","v":41},null,1,{"$f":"IF(ISNUMBER(BA6),(VLOOKUP(BA6,$BP$6:$BQ$49,2)),0)","v":100},{"$f":"IF(BA6<>\"\",5,0)","v":5},{"$f":"BB6+BC6","v":105},null,1,{"$f":"IF(ISNUMBER(BF6),(VLOOKUP(BF6,$BP$6:$BQ$49,2)),0)","v":100},{"$f":"IF(BF6<>\"\",5,0)","v":5},{"$f":"BG6+BH6","v":105},null,1,{"$f":"IF(ISNUMBER(BK6),(VLOOKUP(BK6,$BP$6:$BQ$49,2)),0)","v":100},{"$f":"IF(BK6<>\"\",5,0)","v":5},{"$f":"BL6+BM6","v":105},null,1,100,{"$f":"IF($G6=8,1,0)","v":0},{"$f":"IF($G6=7,1,0)","v":1},{"$f":"IF($G6=6,1,0)","v":0},{"$f":"IF($G6=5,1,0)","v":0},{"$f":"IF($G6=4,1,0)","v":0},{"$f":"IF($G6=3,1,0)","v":0},{"$f":"IF($G6=2,1,0)","v":0},{"$f":"IF($G6=1,1,0)","v":0}]
[2,2,"Røer-Amundsen","Amelia","Ready",{"$f":"IF(G7<5,\"\",(R7-SUM(SMALL(S7:Z7,{1;2;3}))))","v":385},7,null,"DSQ",3,"",2,4,1,4,3,null,435,0,60,0,80,50,100,50,60,null,"DSQ",0,5,5,null,3,60,5,65,null,null,0,0,0,null,1,100,5,105,null,2,80,5,85,null,4,50,5,55,null,4,50,5,55,null,3,60,5,65,null,2,80,{"$f":"IF($G7=8,1,0)","v":0},1,0,0,0,0,0,0]
[3,4,"Orholm","Julie Mathilde","Heming",{"$f":"IF(G8<5,\"\",(R8-SUM(SMALL(S8:Z8,{1;2;3}))))","v":350},6,null,6,"DSQ","",1,13,"",2,2,null,350,40,0,0,100,20,0,80,80,null,6,40,5,45,null,"DSQ",0,5,5,null,null,0,0,0,null,null,0,0,0,null,1,100,5,105,null,13,20,5,25,null,2,80,5,85,null,2,80,5,85,null,3,60,0,0,1,0,0,0,0,0]
[4,3,"Merky ","Nellie Juliette","Kjelsås",{"$f":"IF(G9<5,\"\",(R9-SUM(SMALL(S9:Z9,{1;2;3}))))","v":345},7,null,5,2,"",3,3,5,3,4,null,435,45,80,0,60,60,45,60,50,null,5,45,5,50,null,2,80,5,85,null,null,0,0,0,null,5,45,5,50,null,3,60,5,65,null,3,60,5,65,null,3,60,5,65,null,4,50,5,55,null,4,50,0,1,0,0,0,0,0,0]
[5,5,"Pappos","Pontine","Heming",{"$f":"IF(G10<5,\"\",(R10-SUM(SMALL(S10:Z10,{1;2;3}))))","v":289},7,null,3,4,"",4,2,17,"DNS","DNS",null,289,60,50,0,50,80,14,0,0,null,3,60,5,65,null,4,50,5,55,null,null,0,0,0,null,17,14,5,19,null,4,50,5,55,null,2,80,5,85,null,"DNS",0,5,5,null,"DNS",0,5,5,null,5,45,0,1,0,0,0,0,0,0]
[6,6,"Mathisen","Linnea","Ready",{"$f":"IF(G11<5,\"\",(R11-SUM(SMALL(S11:Z11,{1;2;3}))))","v":285},7,null,2,5,"",9,5,6,"DSQ",6,null,314,80,45,0,29,45,40,0,40,null,2,80,5,85,null,5,45,5,50,null,null,0,0,0,null,6,40,5,45,null,9,29,5,34,null,5,45,5,50,null,"DSQ",0,5,5,null,6,40,5,45,null,6,40,0,1,0,0,0,0,0,0]
[7,7,"Røsjorde","Ella","Kjelsås",{"$f":"IF(G12<5,\"\",(R12-SUM(SMALL(S12:Z12,{1;2;3}))))","v":223},6,null,"DSQ","","",10,7,4,5,7,null,223,0,0,0,26,36,50,45,36,null,"DSQ",0,5,5,null,null,0,0,0,null,null,0,0,0,null,4,50,5,55,null,10,26,5,31,null,7,36,5,41,null,5,45,5,50,null,7,36,5,41,null,7,36,0,0,1,0,0,0,0,0]
[8,8,"Meltvedt","Karoline","Njård",{"$f":"IF(G13<5,\"\",(R13-SUM(SMALL(S13:Z13,{1;2;3}))))","v":202},6,null,10,8,"","",8,7,6,8,null,228,26,32,0,0,32,36,40,32,null,10,26,5,31,null,8,32,5,37,null,null,0,0,0,null,7,36,5,41,null,null,0,0,0,null,8,32,5,37,null,6,40,5,45,null,8,32,5,37,null,8,32,0,0,1,0,0,0,0,0]
[9,9,"Didriksen","Hedda","Ingierkollen Rustad",{"$f":"IF(G14<5,\"\",(R14-SUM(SMALL(S14:Z14,{1;2;3}))))","v":180},7,null,9,9,"",12,10,16,8,9,null,217,29,29,0,22,26,15,32,29,null,9,29,5,34,null,9,29,5,34,null,null,0,0,0,null,16,15,5,20,null,12,22,5,27,null,10,26,5,31,null,8,32,5,37,null,9,29,5,34,null,9,29,0,1,0,0,0,0,0,0]
[10,10,"Bjørke","Arja","Kjelsås",{"$f":"IF(G15<5,\"\",(R15-SUM(SMALL(S15:Z15,{1;2;3}))))","v":176},7,null,"DSQ",7,"","DSQ","DSQ",3,"DSQ",5,null,176,0,36,0,0,0,60,0,45,null,"DSQ",0,5,5,null,7,36,5,41,null,null,0,0,0,null,3,60,5,65,null,"DSQ",0,5,5,null,"DSQ",0,5,5,null,"DSQ",0,5,5,null,5,45,5,50,null,10,26,0,1,0,0,0,0,0,0]
[11,11,"Hilmersen","Aurora","Njård",{"$f":"IF(G16<5,\"\",(R16-SUM(SMALL(S16:Z16,{1;2;3}))))","v":172},6,null,8,"DSQ","",11,12,"",6,11,null,172,32,0,0,24,22,0,40,24,null,8,32,5,37,null,"DSQ",0,5,5,null,null,0,0,0,null,null,0,0,0,null,11,24,5,29,null,12,22,5,27,null,6,40,5,45,null,11,24,5,29,null,11,24,0,0,1,0,0,0,0,0]
[12,12,"Hamran","Frøydis","Kjelsås",{"$f":"IF(G17<5,\"\",(R17-SUM(SMALL(S17:Z17,{1;2;3}))))","v":158},6,null,7,6,"","","DSQ",10,"DSQ",10,null,158,36,40,0,0,0,26,0,26,null,7,36,5,41,null,6,40,5,45,null,null,0,0,0,null,10,26,5,31,null,null,0,0,0,null,"DSQ",0,5,5,null,"DSQ",0,5,5,null,10,26,5,31,null,12,22,0,0,1,0,0,0,0,0]
[13,13,"Bernt","Martine Bruun","Njård",{"$f":"IF(G18<5,\"\",(R18-SUM(SMALL(S18:Z18,{1;2;3}))))","v":145},5,null,"","","",13,14,9,9,12,null,145,0,0,0,20,20,29,29,22,null,null,0,0,0,null,null,0,0,0,null,null,0,0,0,null,9,29,5,34,null,13,20,5,25,null,14,20,5,25,null,9,29,5,34,null,12,22,5,27,null,13,20,0,0,0,1,0,0,0,0]
[{"$f":"IF(F19<#REF!,BP19,#REF!)","v":{"$error":"#REF!"}},14,"Stopar","Wilma","Ready",{"$f":"IF(G19<5,\"\",(R19-SUM(SMALL(S19:Z19,{1;2;3}))))","v":113},5,null,12,11,"",15,18,18,"","",null,113,22,24,0,16,13,13,0,0,null,12,22,5,27,null,11,24,5,29,null,null,0,0,0,null,18,13,5,18,null,15,16,5,21,null,18,13,5,18,null,null,0,0,0,null,null,0,0,0,null,15,16,0,0,0,1,0,0,0,0]
[{"$f":"IF(F20<F19,BP20,A19)","v":{"$error":"#REF!"}},null,"Borge-Andersen","Mie","Heming",{"$f":"IF(G20<5,\"\",(R20-SUM(SMALL(S20:Z20,{1;2;3}))))","v":""},4,null,4,"DSQ","",6,"DSQ","","","",null,110,"","","","","","","","",null,4,50,5,55,null,"DSQ",0,5,5,null,null,0,0,0,null,null,0,0,0,null,6,40,5,45,null,"DSQ",0,5,5,null,null,0,0,0,null,null,0,0,0,null,16,15,0,0,0,0,1,0,0,0]
[17,15,"Argel","Tomine","Heming",{"$f":"IF(G21<5,\"\",(R21-SUM(SMALL(S21:Z21,{1;2;3}))))","v":99},6,null,"","DNS","",5,"DNS",11,"DSQ","DNS",null,99,0,0,0,45,0,24,0,0,null,null,0,0,0,null,"DNS",0,5,5,null,null,0,0,0,null,11,24,5,29,null,5,45,5,50,null,"DNS",0,5,5,null,"DSQ",0,5,5,null,"DNS",0,5,5,null,17,14,0,0,1,0,0,0,0,0]
[17,null,"Egeberg","Silje","Ready",{"$f":"IF(G22<5,\"\",(R22-SUM(SMALL(S22:Z22,{1;2;3}))))","v":""},4,null,11,12,"","",16,15,"","",null,97,"","","","","","","","",null,11,24,5,29,null,12,22,5,27,null,null,0,0,0,null,15,16,5,21,null,null,0,0,0,null,16,15,5,20,null,null,0,0,0,null,null,0,0,0,null,18,13,0,0,0,0,1,0,0,0]
[17,null,"Witte-Skjeldbred","Anne","Heming",{"$f":"IF(G23<5,\"\",(R23-SUM(SMALL(S23:Z23,{1;2;3}))))","v":""},2,null,"","","","",6,8,"","",null,82,"","","","","","","","",null,null,0,0,0,null,null,0,0,0,null,null,0,0,0,null,8,32,5,37,null,null,0,0,0,null,6,40,5,45,null,null,0,0,0,null,null,0,0,0,null,19,12,0,0,0,0,0,0,1,0]
[17,null,"Skjeldam","Helene","Ready",{"$f":"IF(G24<5,\"\",(R24-SUM(SMALL(S24:Z24,{1;2;3}))))","v":""},3,null,"",10,"","",17,14,"","",null,75,"","","","","","","","",null,null,0,0,0,null,10,26,5,31,null,null,0,0,0,null,14,20,5,25,null,null,0,0,0,null,17,14,5,19,null,null,0,0,0,null,null,0,0,0,null,20,11,0,0,0,0,0,1,0,0]
[21,16,"Rivelsrud","Lotte","Heming",{"$f":"IF(G25<5,\"\",(R25-SUM(SMALL(S25:Z25,{1;2;3}))))","v":70},6,null,"DNS","","",14,"DNS",13,"DNS","DNS",null,70,0,0,0,20,0,20,0,0,null,"DNS",0,5,5,null,null,0,0,0,null,null,0,0,0,null,13,20,5,25,null,14,20,5,25,null,"DNS",0,5,5,null,"DNS",0,5,5,null,"DNS",0,5,5,null,21,10,0,0,1,0,0,0,0,0]
[{"$f":"IF(F26<F25,BP26,A25)","v":21},null,"Solhusløkk","Benedikte","Ingierkollen Rustad",{"$f":"IF(G26<5,\"\",(R26-SUM(SMALL(S26:Z26,{1;2;3}))))","v":""},{"$f":"(IF(AD26=5,1,0)+IF(AI26=5,1,0)+IF(AN26=5,1,0)+IF(AX26=5,1,0)+IF(BC26=5,1,0)+IF(AS26=5,1,0)+IF(BH26=5,1,0)+IF(BM26=5,1,0))","v":4},null,{"$f":"IF(AB26=\"\",\"\",AB26)","v":"DSQ"},{"$f":"IF(AG26=\"\",\"\",AG26)","v":"DNS"},{"$f":"IF(AL26=\"\",\"\",AL26)","v":""},{"$f":"IF(AV26=\"\",\"\",AV26)","v":""},{"$f":"IF(BA26=\"\",\"\",BA26)","v":""},{"$f":"IF(AQ26=\"\",\"\",AQ26)","v":""},{"$f":"IF(BF26=\"\",\"\",BF26)","v":10},{"$f":"IF(BK26=\"\",\"\",BK26)","v":14},null,{"$f":"AE26+AJ26+AO26+AY26+BD26+AT26+BI26+BN26","v":66},{"$f":"IF($G26>=5,IF(AC26=\"\",\"\",AC26),\"\")","v":""},{"$f":"IF($G26>=5,IF(AH26=\"\",\"\",AH26),\"\")","v":""},{"$f":"IF($G26>=5,IF(AM26=\"\",\"\",AM26),\"\")","v":""},{"$f":"IF($G26>=5,IF(AW26=\"\",\"\",AW26),\"\")","v":""},{"$f":"IF($G26>=5,IF(BB26=\"\",\"\",BB26),\"\")","v":""},{"$f":"IF($G26>=5,IF(AR26=\"\",\"\",AR26),\"\")","v":""},{"$f":"IF($G26>=5,IF(BG26=\"\",\"\",BG26),\"\")","v":""},{"$f":"IF($G26>=5,IF(BL26=\"\",\"\",BL26),\"\")","v":""},null,"DSQ",{"$f":"IF(ISNUMBER(AB26),(VLOOKUP(AB26,$BP$6:$BQ$49,2)),0)","v":0},{"$f":"IF(AB26<>\"\",5,0)","v":5},{"$f":"AC26+AD26","v":5},null,"DNS",{"$f":"IF(ISNUMBER(AG26),(VLOOKUP(AG26,$BP$6:$BQ$49,2)),0)","v":0},{"$f":"IF(AG26<>\"\",5,0)","v":5},{"$f":"AH26+AI26","v":5},null,null,{"$f":"IF(ISNUMBER(AL26),(VLOOKUP(AL26,$BP$6:$BQ$49,2)),0)","v":0},{"$f":"IF(AL26<>\"\",5,0)","v":0},{"$f":"AM26+AN26","v":0},null,null,{"$f":"IF(ISNUMBER(AQ26),(VLOOKUP(AQ26,$BP$6:$BQ$49,2)),0)","v":0},{"$f":"IF(AQ26<>\"\",5,0)","v":0},{"$f":"AR26+AS26","v":0},null,null,{"$f":"IF(ISNUMBER(AV26),(VLOOKUP(AV26,$BP$6:$BQ$49,2)),0)","v":0},{"$f":"IF(AV26<>\"\",5,0)","v":0},{"$f":"AW26+AX26","v":0},null,null,{"$f":"IF(ISNUMBER(BA26),(VLOOKUP(BA26,$BP$6:$BQ$49,2)),0)","v":0},{"$f":"IF(BA26<>\"\",5,0)","v":0},{"$f":"BB26+BC26","v":0},null,10,{"$f":"IF(ISNUMBER(BF26),(VLOOKUP(BF26,$BP$6:$BQ$49,2)),0)","v":26},{"$f":"IF(BF26<>\"\",5,0)","v":5},{"$f":"BG26+BH26","v":31},null,14,{"$f":"IF(ISNUMBER(BK26),(VLOOKUP(BK26,$BP$6:$BQ$49,2)),0)","v":20},{"$f":"IF(BK26<>\"\",5,0)","v":5},{"$f":"BL26+BM26","v":25},null,22,9,0,0,0,0,1,0,0,0]
[21,null,"Lundhagen Hesselroth","Hermine","Njård",{"$f":"IF(G27<5,\"\",(R27-SUM(SMALL(S27:Z27,{1;2;3}))))","v":""},2,null,"",13,"","","","","",13,null,50,"","","","","","","","",null,null,0,0,0,null,13,20,5,25,null,null,0,0,0,null,null,0,0,0,null,null,0,0,0,null,null,0,0,0,null,null,0,0,0,null,13,20,5,25,null,23,8,0,0,0,0,0,0,1,0]
[21,null,"Norstrand","Lotte","Heming",{"$f":"IF(G28<5,\"\",(R28-SUM(SMALL(S28:Z28,{1;2;3}))))","v":""},2,null,"","","",8,"DNS","","","",null,42,"","","","","","","","",null,null,0,0,0,null,null,0,0,0,null,null,0,0,0,null,null,0,0,0,null,8,32,5,37,null,"DNS",0,5,5,null,null,0,0,0,null,null,0,0,0,null,24,7,0,0,0,0,0,0,1,0]
[21,null,"Hanssen","Caroline","Njård",{"$f":"IF(G29<5,\"\",(R29-SUM(SMALL(S29:Z29,{1;2;3}))))","v":""},2,null,"","","","",9,"DNS","","",null,39,"","","","","","","","",null,null,0,0,0,null,null,0,0,0,null,null,0,0,0,null,"DNS",0,5,5,null,null,0,0,0,null,9,29,5,34,null,null,0,0,0,null,null,0,0,0,null,25,6,0,0,0,0,0,0,1,0]
[21,null,"Schram","Iben","Njård",{"$f":"IF(G30<5,\"\",(R30-SUM(SMALL(S30:Z30,{1;2;3}))))","v":""},2,null,"","","","","DNS",12,"","",null,32,"","","","","","","","",null,null,0,0,0,null,null,0,0,0,null,null,0,0,0,null,12,22,5,27,null,null,0,0,0,null,"DNS",0,5,5,null,null,0,0,0,null,null,0,0,0,null,26,5,0,0,0,0,0,0,1,0]
[21,null,"Oppebøen","Ingrid","Heming",{"$f":"IF(G31<5,\"\",(R31-SUM(SMALL(S31:Z31,{1;2;3}))))","v":""},1,null,"","","","",11,"","","",null,29,"","","","","","","","",null,null,0,0,0,null,null,0,0,0,null,null,0,0,0,null,null,0,0,0,null,null,0,0,0,null,11,24,5,29,null,null,0,0,0,null,null,0,0,0,null,27,4,0,0,0,0,0,0,0,1]
[21,null,"Danielsen","Henriette","Heming",{"$f":"IF(G32<5,\"\",(R32-SUM(SMALL(S32:Z32,{1;2;3}))))","v":""},1,null,"","","","",15,"","","",null,21,"","","","","","","","",null,null,0,0,0,null,null,0,0,0,null,null,0,0,0,null,null,0,0,0,null,null,0,0,0,null,15,16,5,21,null,null,0,0,0,null,null,0,0,0,null,28,3,0,0,0,0,0,0,0,1]
[21,null,"Grønvold","Sanna","Heming",{"$f":"IF(G33<5,\"\",(R33-SUM(SMALL(S33:Z33,{1;2;3}))))","v":""},3,null,"DSQ","","","DNS","DNS","","","",null,15,"","","","","","","","",null,"DSQ",0,5,5,null,null,0,0,0,null,null,0,0,0,null,null,0,0,0,null,"DNS",0,5,5,null,"DNS",0,5,5,null,null,0,0,0,null,null,0,0,0,null,29,2,0,0,0,0,0,1,0,0]
[21,null,"Hansen","Nora","Heming",{"$f":"IF(G34<5,\"\",(R34-SUM(SMALL(S34:Z34,{1;2;3}))))","v":""},2,null,"","","","DNS","DNS","","","",null,10,"","","","","","","","",null,null,0,0,0,null,null,0,0,0,null,null,0,0,0,null,null,0,0,0,null,"DNS",0,5,5,null,"DNS",0,5,5,null,null,0,0,0,null,null,0,0,0,null,30,1,0,0,0,0,0,0,1,0]
[21,null,"Bøhmer","Kristin","Heming",{"$f":"IF(G35<5,\"\",(R35-SUM(SMALL(S35:Z35,{1;2;3}))))","v":""},1,null,"","","","DNS","","","","",null,5,"","","","","","","","",null,null,0,0,0,null,null,0,0,0,null,null,0,0,0,null,null,0,0,0,null,"DNS",0,5,5,null,null,0,0,0,null,null,0,0,0,null,null,0,0,0,null,31,0,0,0,0,0,0,0,0,1]
[21,null,"Riiber","Juline","Heming",{"$f":"IF(G36<5,\"\",(R36-SUM(SMALL(S36:Z36,{1;2;3}))))","v":""},1,null,"","","","DNS","","","","",null,5,"","","","","","","","",null,null,0,0,0,null,null,0,0,0,null,null,0,0,0,null,null,0,0,0,null,"DNS",0,5,5,null,null,0,0,0,null,null,0,0,0,null,null,0,0,0,null,32,0,0,0,0,0,0,0,0,1]
[{"$f":"IF(F37<F36,BP37,A36)","v":21},null,null,null,null,{"$f":"IF(G37<5,\"\",(R37-SUM(SMALL(S37:Z37,{1;2;3}))))","v":""},{"$f":"(IF(AD37=5,1,0)+IF(AI37=5,1,0)+IF(AN37=5,1,0)+IF(AX37=5,1,0)+IF(BC37=5,1,0)+IF(AS37=5,1,0)+IF(BH37=5,1,0)+IF(BM37=5,1,0))","v":0},null,"","","","","","","","",null,{"$f":"AE37+AJ37+AO37+AY37+BD37+AT37+BI37+BN37","v":0},"","","","","","","","",null,null,0,{"$f":"IF(AB37<>\"\",5,0)","v":0},{"$f":"AC37+AD37","v":0},null,null,0,{"$f":"IF(AG37<>\"\",5,0)","v":0},{"$f":"AH37+AI37","v":0},null,null,0,{"$f":"IF(AL37<>\"\",5,0)","v":0},{"$f":"AM37+AN37","v":0},null,null,0,{"$f":"IF(AQ37<>\"\",5,0)","v":0},{"$f":"AR37+AS37","v":0},null,null,0,{"$f":"IF(AV37<>\"\",5,0)","v":0},{"$f":"AW37+AX37","v":0},null,null,0,{"$f":"IF(BA37<>\"\",5,0)","v":0},{"$f":"BB37+BC37","v":0},null,null,0,{"$f":"IF(BF37<>\"\",5,0)","v":0},{"$f":"BG37+BH37","v":0},null,null,0,{"$f":"IF(BK37<>\"\",5,0)","v":0},{"$f":"BL37+BM37","v":0},null,33,0,0,0,0,0,0,0,0,0]
[21,null,null,null,null,{"$f":"IF(G38<5,\"\",(R38-SUM(SMALL(S38:Z38,{1;2;3}))))","v":""},0,null,"","","","","","","","",null,0,"","","","","","","","",null,null,0,0,0,null,null,0,0,0,null,null,0,0,0,null,null,0,0,0,null,null,0,0,0,null,null,0,0,0,null,null,0,0,0,null,null,0,0,0,null,34,0,0,0,0,0,0,0,0,0]
[21,null,null,null,null,{"$f":"IF(G39<5,\"\",(R39-SUM(SMALL(S39:Z39,{1;2;3}))))","v":""},0,null,"","","","","","","","",null,0,{"$f":"IF($G39>=5,IF(AC39=\"\",\"\",AC39),\"\")","v":""},{"$f":"IF($G39>=5,IF(AH39=\"\",\"\",AH39),\"\")","v":""},{"$f":"IF($G39>=5,IF(AM39=\"\",\"\",AM39),\"\")","v":""},{"$f":"IF($G39>=5,IF(AW39=\"\",\"\",AW39),\"\")","v":""},{"$f":"IF($G39>=5,IF(BB39=\"\",\"\",BB39),\"\")","v":""},{"$f":"IF($G39>=5,IF(AR39=\"\",\"\",AR39),\"\")","v":""},{"$f":"IF($G39>=5,IF(BG39=\"\",\"\",BG39),\"\")","v":""},{"$f":"IF($G39>=5,IF(BL39=\"\",\"\",BL39),\"\")","v":""},null,null,0,0,0,null,null,0,0,0,null,null,0,0,0,null,null,0,0,0,null,null,0,0,0,null,null,0,0,0,null,null,0,0,0,null,null,0,0,0,null,35,0,0,0,0,0,0,0,0,0]
[21,null,null,null,null,{"$f":"IF(G40<5,\"\",(R40-SUM(SMALL(S40:Z40,{1;2;3}))))","v":""},0,null,"","","","","","","","",null,0,"","","","","","","","",null,null,0,0,0,null,null,0,0,0,null,null,0,0,0,null,null,0,0,0,null,null,0,0,0,null,null,0,0,0,null,null,0,0,0,null,null,0,0,0,null,36,0,0,0,0,0,0,0,0,0]
[21,null,null,null,null,{"$f":"IF(G41<5,\"\",(R41-SUM(SMALL(S41:Z41,{1;2;3}))))","v":""},0,null,"","","","","","","","",null,0,"","","","","","","","",null,null,0,0,0,null,null,0,0,0,null,null,0,0,0,null,null,0,0,0,null,null,0,0,0,null,null,0,0,0,null,null,0,0,0,null,null,0,0,0,null,37,0,0,0,0,0,0,0,0,0]
[21,null,null,null,null,{"$f":"IF(G42<5,\"\",(R42-SUM(SMALL(S42:Z42,{1;2;3}))))","v":""},0,null,"","","","","","","","",null,0,"","","","","","","","",null,null,0,0,0,null,null,0,0,0,null,null,0,0,0,null,null,0,0,0,null,null,0,0,0,null,null,0,0,0,null,null,0,0,0,null,null,0,0,0,null,38,0,0,0,0,0,0,0,0,0]
[21,null,null,null,null,{"$f":"IF(G43<5,\"\",(R43-SUM(SMALL(S43:Z43,{1;2;3}))))","v":""},0,null,"","","","","","","","",null,0,"","","","","","","","",null,null,0,0,0,null,null,0,0,0,null,null,0,0,0,null,null,0,0,0,null,null,0,0,0,null,null,0,0,0,null,null,0,0,0,null,null,0,0,0,null,39,0,0,0,0,0,0,0,0,0]
[21,null,null,null,null,{"$f":"IF(G44<5,\"\",(R44-SUM(SMALL(S44:Z44,{1;2;3}))))","v":""},0,null,"","","","","","","","",null,0,"","","","","","","","",null,null,0,0,0,null,null,0,0,0,null,null,0,0,0,null,null,0,0,0,null,null,0,0,0,null,null,0,0,0,null,null,0,0,0,null,null,0,0,0,null,40,0,0,0,0,0,0,0,0,0]
[21,null,null,null,null,{"$f":"IF(G45<5,\"\",(R45-SUM(SMALL(S45:Z45,{1;2;3}))))","v":""},0,null,"","","","","","","","",null,0,"","","","","","","","",null,null,0,0,0,null,null,0,0,0,null,null,0,0,0,null,null,0,0,0,null,null,0,0,0,null,null,0,0,0,null,null,0,0,0,null,null,0,0,0,null,41,0,0,0,0,0,0,0,0,0]
[21,null,null,null,null,{"$f":"IF(G46<5,\"\",(R46-SUM(SMALL(S46:Z46,{1;2;3}))))","v":""},0,null,"","","","","","","","",null,0,"","","","","","","","",null,null,0,0,0,null,null,0,0,0,null,null,0,0,0,null,null,0,0,0,null,null,0,0,0,null,null,0,0,0,null,null,0,0,0,null,null,0,0,0,null,42,0,0,0,0,0,0,0,0,0]
[21,null,null,null,null,{"$f":"IF(G47<5,\"\",(R47-SUM(SMALL(S47:Z47,{1;2;3}))))","v":""},0,null,"","","","","",{"$f":"IF(BA47=\"\",\"\",BA47)","v":""},{"$f":"IF(AQ47=\"\",\"\",AQ47)","v":""},{"$f":"IF(BF47=\"\",\"\",BF47)","v":""},null,0,"","","","","","","","",null,null,0,0,0,null,null,0,0,0,null,null,0,0,0,null,null,0,0,0,null,null,0,0,0,null,null,0,0,0,null,null,0,0,0,null,null,0,0,0,null,43,0,0,0,0,0,0,0,0,0]
[21,null,null,null,null,{"$f":"IF(G48<5,\"\",(R48-SUM(SMALL(S48:Z48,{1;2;3}))))","v":""},0,null,null,null,null,null,null,null,null,null,null,0,"","","","","","","","",null,null,0,0,0,null,null,0,0,0,null,null,0,0,0,null,null,0,0,0,null,null,0,0,0,null,null,0,0,0,null,null,0,0,0,null,null,0,0,0,null,44,0,0,0,0,0,0,0,0,0]
[21,null,null,null,null,{"$f":"IF(G49<5,\"\",(R49-SUM(SMALL(S49:Z49,{1;2;3}))))","v":""},0,null,null,null,null,null,null,null,null,null,null,0,"","","","","","","","",null,null,0,0,0,null,null,0,0,0,null,null,0,0,0,null,null,0,0,0,null,null,0,0,0,null,null,0,0,0,null,null,0,0,0,null,null,0,0,0,null,45,0,0,0,0,0,0,0,0,0]
[21,null,null,null,null,{"$f":"IF(G50<5,\"\",(R50-SUM(SMALL(S50:Z50,{1;2;3}))))","v":""},0,null,null,null,null,null,null,null,null,null,null,0,"","","","","","","","",null,null,0,0,0,null,null,0,0,0,null,null,0,0,0,null,null,0,0,0,null,null,0,0,0,null,null,0,0,0,null,null,0,0,0,null,null,0,0,0,null,46,0,0,0,0,0,0,0,0,0]
[21,null,null,null,null,{"$f":"IF(G51<5,\"\",(R51-SUM(SMALL(S51:Z51,{1;2;3}))))","v":""},0,null,null,null,null,null,null,null,null,null,null,0,"","","","","","","","",null,null,0,0,0,null,null,0,0,0,null,null,0,0,0,null,null,0,0,0,null,null,0,0,0,null,null,0,0,0,null,null,0,0,0,null,null,0,0,0,null,47,0,0,0,0,0,0,0,0,0]
[21,null,null,null,null,{"$f":"IF(G52<5,\"\",(R52-SUM(SMALL(S52:Z52,{1;2;3}))))","v":""},0,null,null,null,null,null,null,null,null,null,null,0,"","","","","","","","",null,null,0,0,0,null,null,0,0,0,null,null,0,0,0,null,null,0,0,0,null,null,0,0,0,null,null,0,0,0,null,null,0,0,0,null,null,0,0,0,null,48,0,0,0,0,0,0,0,0,0]
[21,null,null,null,null,{"$f":"IF(G53<5,\"\",(R53-SUM(SMALL(S53:Z53,{1;2;3}))))","v":""},0,null,null,null,null,null,null,null,null,null,null,0,"","","","","","","","",null,null,0,0,0,null,null,0,0,0,null,null,0,0,0,null,null,0,0,0,null,null,0,0,0,null,null,0,0,0,null,null,0,0,0,null,null,0,0,0,null,49,0,0,0,0,0,0,0,0,0]
[null,null,null,null,null,{"$f":"IF(G54<5,\"\",(R54-SUM(SMALL(S54:Z54,{1;2;3}))))","v":""},null,null,{"$f":"IF(AB54=\"\",\"\",AB54)","v":""},{"$f":"IF(AG54=\"\",\"\",AG54)","v":""},{"$f":"IF(AL54=\"\",\"\",AL54)","v":""},{"$f":"IF(AV54=\"\",\"\",AV54)","v":""},{"$f":"IF(BA54=\"\",\"\",BA54)","v":""},{"$f":"IF(AQ54=\"\",\"\",AQ54)","v":""},{"$f":"IF(BF54=\"\",\"\",BF54)","v":""},{"$f":"IF(BK54=\"\",\"\",BK54)","v":""},null,null,{"$f":"IF($G54>=7,IF(AC54=\"\",\"\",AC54),\"\")","v":""},{"$f":"IF($G54>=7,IF(AH54=\"\",\"\",AH54),\"\")","v":""},{"$f":"IF($G54>=7,IF(AM54=\"\",\"\",AM54),\"\")","v":""},{"$f":"IF($G54>=7,IF(AW54=\"\",\"\",AW54),\"\")","v":""},{"$f":"IF($G54>=7,IF(BB54=\"\",\"\",BB54),\"\")","v":""},{"$f":"IF($G54>=7,IF(AR54=\"\",\"\",AR54),\"\")","v":""},{"$f":"IF($G54>=7,IF(BG54=\"\",\"\",BG54),\"\")","v":""},{"$f":"IF($G54>=7,IF(BL54=\"\",\"\",BL54),\"\")","v":""}]
[null,null,null,null,null,null,null,null,{"$f":"IF(AB55=\"\",\"\",AB55)","v":""},{"$f":"IF(AG55=\"\",\"\",AG55)","v":""},{"$f":"IF(AL55=\"\",\"\",AL55)","v":""},{"$f":"IF(AV55=\"\",\"\",AV55)","v":""},{"$f":"IF(BA55=\"\",\"\",BA55)","v":""},"",{"$f":"IF(BF55=\"\",\"\",BF55)","v":""},{"$f":"IF(BK55=\"\",\"\",BK55)","v":""}]
[null,null,null,null,null,null,null,null,"","","","","","","",""]
[null,null,null,null,null,null,null,null,"","","","","","","",""]
[null,null,null,null,null,null,null,null,"","","","","","","",""]
[null,null,null,null,null,null,null,null,"","","","","","","",""]
[null,null,null,null,null,null,null,null,"","","","","","","",""]
[null,null,null,null,null,null,null,null,"","","","","","","",""]
[null,null,null,null,null,null,null,null,"","","","","","","",""]
[null,null,null,null,null,null,null,null,"","","","","","","",""]
[null,null,null,null,null,null,null,null,"","","","","","","",""]
[null,null,null,null,null,null,null,null,"","","","","","","",""]
[null,null,null,null,null,null,null,null,"","","","","","","",""]
[null,null,null,null,null,null,null,null,"","","","","","","",""]
[null,null,null,null,null,null,null,null,"","","","","","","",""]
[null,null,null,null,null,null,null,null,"","","","","","","",""]
[null,null,null,null,null,null,null,null,"","","","","","","",""]
[null,null,null,null,null,null,null,null,"","","","","","","",""]

{"sheet":"G12 2022","index":4,"n_rows":45,"n_cols":77,"rows_kept":45,"cut":false,"hidden":false,"merged":[[0,48,0,51],[2,27,2,30],[2,32,2,35],[2,42,2,45],[2,47,2,50],[3,63,3,65],[4,8,4,15],[4,18,4,25],[2,37,2,40],[2,57,2,60],[2,62,2,65],[3,28,3,30],[3,33,3,35],[3,43,3,45],[3,48,3,50],[3,53,3,55],[3,38,3,40],[3,58,3,60],[2,52,2,55]]}
["Resultatliste Oslo Cup 2022 - Gutter 12 år"]
[]
[null,null,null,null,null,null,null,null,"IRS Rennet","Ljan Rennet","Njård Rennet","Ready Rennet","Telenor Arena Cup","Kidsbühel","Oslo Alpinfestival SL","Oslo Alpinfestival SSL",null,null,"IRS Rennet","Ljan Rennet","Njård Rennet","Ready Rennet","Telenor Arena Cup","Kidsbühel","Oslo Alpinfestival SL","Oslo Alpinfestival SSL",null,"--------IRS Rennet----------",null,null,null,null,"----------Ljan Rennet---------",null,null,null,null,"------Kidsbühel--------",null,null,null,null,"--------Njård Rennet----------",null,null,null,null,"--------Ready Rennet---------",null,null,null,null,"-----Telenor Arena Cup----",null,null,null,null,"---Oslo Alpinfestival SL---",null,null,null,null,"---Oslo Alpinfestival SSL---"]
[null,null,null,null,null,null,"Antall",null,"2022-01-29","2022-01-30","2022-02-04","2022-02-05","2022-02-16","2022-02-02","2022-03-12","2022-03-13",null,"Poeng","2022-01-29","2022-01-30","2022-02-04","2022-02-05","2022-02-16","2022-02-02","2022-03-12","2022-03-13",null,null,"--------Poeng--------",null,null,null,null,"--------Poeng--------",null,null,null,null,"-------Poeng---------",null,null,null,null,"-------Poeng---------",null,null,null,null,"-------Poeng---------",null,null,null,null,"-------Poeng---------",null,null,null,null,"-------Poeng---------",null,null,null,null,"-------Poeng---------",null,null,null,null,null,"Løpere med ","Løpere med ","Løpere med ","Løpere med ","Løpere med ","Løpere med ","Løpere med ","Løpere med "]
["Plass","Plass","Etternavn","Fornavn","Klubb","Poeng","renn",null,"------------------------------Plassering i rennene---------------------------------",null,null,null,null,null,null,null,null,"brutto","----------------Resultatpoeng hvis mer enn 5 renn----------------",null,null,null,null,null,null,null,null,"Plass","Res.","Del.","Tot.",null,"Plass","Res.","Del.","Tot.",null,"Plass","Res.","Del.","Tot.",null,"Plass","Res.","Del.","Tot.",null,"Plass","Res.","Del.","Tot.",null,"Plass","Res.","Del.","Tot.",null,"Plass","Res.","Del.","Tot.",null,"Plass","Res.","Del.","Tot.",null,"Plass","Poeng","8 renn","7 renn","6 renn","5 renn","4 renn","3 renn","2 renn","kun 1 renn"]
[{"$f":"IF(F6<F5,BP6,A5)","v":1},1,"Myhrvold","Aslak","Ljan",{"$f":"IF(G6<5,\"\",(R6-SUM(SMALL(S6:Z6,{1;2;3}))))","v":360},{"$f":"(IF(AD6=5,1,0)+IF(AI6=5,1,0)+IF(AS6=5,1,0)+IF(AX6=5,1,0)+IF(BC6=5,1,0)+IF(AN6=5,1,0)+IF(BH6=5,1,0)+IF(BM6=5,1,0))","v":7},null,{"$f":"IF(AB6=\"\",\"\",AB6)","v":2},{"$f":"IF(AG6=\"\",\"\",AG6)","v":4},{"$f":"IF(AQ6=\"\",\"\",AQ6)","v":""},{"$f":"IF(AV6=\"\",\"\",AV6)","v":9},{"$f":"IF(BA6=\"\",\"\",BA6)","v":5},{"$f":"IF(AL6=\"\",\"\",AL6)","v":4},{"$f":"IF(BF6=\"\",\"\",BF6)","v":1},{"$f":"IF(BK6=\"\",\"\",BK6)","v":"DSQ"},null,{"$f":"AE6+AJ6+AT6+AY6+BD6+AO6+BI6+BN6","v":389},{"$f":"IF($G6>=5,IF(AC6=\"\",\"\",AC6),\"\")","v":80},{"$f":"IF($G6>=5,IF(AH6=\"\",\"\",AH6),\"\")","v":50},{"$f":"IF($G6>=5,IF(AR6=\"\",\"\",AR6),\"\")","v":0},{"$f":"IF($G6>=5,IF(AW6=\"\",\"\",AW6),\"\")","v":29},{"$f":"IF($G6>=5,IF(BB6=\"\",\"\",BB6),\"\")","v":45},{"$f":"IF($G6>=5,IF(AM6=\"\",\"\",AM6),\"\")","v":50},{"$f":"IF($G6>=5,IF(BG6=\"\",\"\",BG6),\"\")","v":100},{"$f":"IF($G6>=5,IF(BL6=\"\",\"\",BL6),\"\")","v":0},null,2,{"$f":"IF(ISNUMBER(AB6),(VLOOKUP(AB6,$BP$6:$BQ$40,2)),0)","v":80},{"$f":"IF(AB6<>\"\",5,0)","v":5},{"$f":"AC6+AD6","v":85},null,4,{"$f":"IF(ISNUMBER(AG6),(VLOOKUP(AG6,$BP$6:$BQ$40,2)),0)","v":50},{"$f":"IF(AG6<>\"\",5,0)","v":5},{"$f":"AH6+AI6","v":55},null,4,{"$f":"IF(ISNUMBER(AL6),(VLOOKUP(AL6,$BP$6:$BQ$40,2)),0)","v":50},{"$f":"IF(AL6<>\"\",5,0)","v":5},{"$f":"AM6+AN6","v":55},null,null,{"$f":"IF(ISNUMBER(AQ6),(VLOOKUP(AQ6,$BP$6:$BQ$40,2)),0)","v":0},{"$f":"IF(AQ6<>\"\",5,0)","v":0},{"$f":"AR6+AS6","v":0},null,9,{"$f":"IF(ISNUMBER(AV6),(VLOOKUP(AV6,$BP$6:$BQ$40,2)),0)","v":29},{"$f":"IF(AV6<>\"\",5,0)","v":5},{"$f":"AW6+AX6","v":34},null,5,{"$f":"IF(ISNUMBER(BA6),(VLOOKUP(BA6,$BP$6:$BQ$40,2)),0)","v":45},{"$f":"IF(BA6<>\"\",5,0)","v":5},{"$f":"BB6+BC6","v":50},null,1,{"$f":"IF(ISNUMBER(BF6),(VLOOKUP(BF6,$BP$6:$BQ$40,2)),0)","v":100},{"$f":"IF(BF6<>\"\",5,0)","v":5},{"$f":"BG6+BH6","v":105},null,"DSQ",{"$f":"IF(ISNUMBER(BK6),(VLOOKUP(BK6,$BP$6:$BQ$40,2)),0)","v":0},{"$f":"IF(BK6<>\"\",5,0)","v":5},{"$f":"BL6+BM6","v":5},null,1,100,{"$f":"IF($G6=8,1,0)","v":0},{"$f":"IF($G6=7,1,0)","v":1},{"$f":"IF($G6=6,1,0)","v":0},{"$f":"IF($G6=5,1,0)","v":0},{"$f":"IF($G6=4,1,0)","v":0},{"$f":"IF($G6=3,1,0)","v":0},{"$f":"IF($G6=2,1,0)","v":0},{"$f":"IF($G6=1,1,0)","v":0}]
[2,2,"Falch","Joachim","Kjelsås",{"$f":"IF(G7<5,\"\",(R7-SUM(SMALL(S7:Z7,{1;2;3}))))","v":347},5,null,"","","",4,8,3,2,1,null,347,0,{"$f":"IF($G7>=5,IF(AH7=\"\",\"\",AH7),\"\")","v":0},{"$f":"IF($G7>=5,IF(AR7=\"\",\"\",AR7),\"\")","v":0},{"$f":"IF($G7>=5,IF(AW7=\"\",\"\",AW7),\"\")","v":50},{"$f":"IF($G7>=5,IF(BB7=\"\",\"\",BB7),\"\")","v":32},{"$f":"IF($G7>=5,IF(AM7=\"\",\"\",AM7),\"\")","v":60},{"$f":"IF($G7>=5,IF(BG7=\"\",\"\",BG7),\"\")","v":80},{"$f":"IF($G7>=5,IF(BL7=\"\",\"\",BL7),\"\")","v":100},null,null,0,{"$f":"IF(AB7<>\"\",5,0)","v":0},0,null,null,0,0,0,null,3,60,5,65,null,null,0,0,0,null,4,50,5,55,null,8,32,5,37,null,2,80,5,85,null,1,100,5,105,null,2,80,0,0,0,1,0,0,0,0]
[3,3,"Aadnesen","Jesper","Heming",{"$f":"IF(G8<5,\"\",(R8-SUM(SMALL(S8:Z8,{1;2;3}))))","v":325},5,null,"DNS","DNS","",1,1,1,"DNS","",null,325,0,0,0,100,100,100,0,0,null,"DNS",0,{"$f":"IF(AB7<>\"\",5,0)","v":0},0,null,"DNS",0,5,5,null,1,100,5,105,null,null,0,0,0,null,1,100,5,105,null,1,100,5,105,null,"DNS",0,5,5,null,null,0,0,0,null,3,60,0,0,0,1,0,0,0,0]
[3,null,"Wigsnæs Ulrichsen","Didrik","Heming",{"$f":"IF(G9<5,\"\",(R9-SUM(SMALL(S9:Z9,{1;2;3}))))","v":""},4,null,"DSQ",1,"",2,2,"","","",null,280,"","","","","","","","",null,"DSQ",0,{"$f":"IF(AB9<>\"\",5,0)","v":5},5,null,1,100,5,105,null,null,0,0,0,null,null,0,0,0,null,2,80,5,85,null,2,80,5,85,null,null,0,0,0,null,null,0,0,0,null,4,50,0,0,0,0,1,0,0,0]
[5,4,"Sandaas","Terkel","Heming",{"$f":"IF(G10<5,\"\",(R10-SUM(SMALL(S10:Z10,{1;2;3}))))","v":245},5,null,"DSQ",2,"","DNS",3,2,"","",null,245,0,80,0,0,60,80,0,0,null,"DSQ",0,{"$f":"IF(AB10<>\"\",5,0)","v":5},5,null,2,80,5,85,null,2,80,5,85,null,null,0,0,0,null,"DNS",0,5,5,null,3,60,5,65,null,null,0,0,0,null,null,0,0,0,null,5,45,0,0,0,1,0,0,0,0]
[6,5,"Kulseng-Hanssen","William","Heming",{"$f":"IF(G11<5,\"\",(R11-SUM(SMALL(S11:Z11,{1;2;3}))))","v":231},7,null,1,"DSQ","","DNS",7,"DNS",3,"DNS",null,231,100,0,0,0,36,0,60,0,null,1,100,{"$f":"IF(AB11<>\"\",5,0)","v":5},105,null,"DSQ",0,5,5,null,"DNS",0,5,5,null,null,0,0,0,null,"DNS",0,5,5,null,7,36,5,41,null,3,60,5,65,null,"DNS",0,5,5,null,6,40,0,1,0,0,0,0,0,0]
[7,6,"Swenson","Otto","Ljan",{"$f":"IF(G12<5,\"\",(R12-SUM(SMALL(S12:Z12,{1;2;3}))))","v":217},7,null,3,5,"",5,"DNS",8,"DNS","DNS",null,217,60,45,0,45,0,32,0,0,null,3,60,{"$f":"IF(AB12<>\"\",5,0)","v":5},65,null,5,45,5,50,null,8,32,5,37,null,null,0,0,0,null,5,45,5,50,null,"DNS",0,5,5,null,"DNS",0,5,5,null,"DNS",0,5,5,null,7,36,0,1,0,0,0,0,0,0]
[7,7,"Gautneb","Axel","Heming",{"$f":"IF(G13<5,\"\",(R13-SUM(SMALL(S13:Z13,{1;2;3}))))","v":250},7,null,{"$f":"IF(AB12=\"\",\"\",AB12)","v":3},"DSQ","",7,11,5,"DSQ",4,null,250,60,0,0,36,24,45,0,50,null,"DNS",{"$f":"IF(ISNUMBER(AB12),(VLOOKUP(AB12,$BP$6:$BQ$40,2)),0)","v":60},{"$f":"IF(AB12<>\"\",5,0)","v":5},65,null,"DSQ",0,5,5,null,5,45,5,50,null,null,0,0,0,null,7,36,5,41,null,11,24,5,29,null,"DSQ",0,5,5,null,4,50,5,55,null,8,32,0,1,0,0,0,0,0,0]
[9,8,"Bang-Hansen","Mats","Kjelsås",{"$f":"IF(G14<5,\"\",(R14-SUM(SMALL(S14:Z14,{1;2;3}))))","v":181},7,null,{"$f":"IF(AB14=\"\",\"\",AB14)","v":"DSQ"},"DSQ","",13,10,6,"DSQ",3,null,181,0,0,0,20,26,40,0,60,null,"DSQ",{"$f":"IF(ISNUMBER(AB14),(VLOOKUP(AB14,$BP$6:$BQ$40,2)),0)","v":0},{"$f":"IF(AB14<>\"\",5,0)","v":5},5,null,"DSQ",0,5,5,null,6,40,5,45,null,null,0,0,0,null,13,20,5,25,null,10,26,5,31,null,"DSQ",0,5,5,null,3,60,5,65,null,9,29,0,1,0,0,0,0,0,0]
[10,9,"Torvund","Albert","Ljan",{"$f":"IF(G15<5,\"\",(R15-SUM(SMALL(S15:Z15,{1;2;3}))))","v":156},6,null,{"$f":"IF(AB15=\"\",\"\",AB15)","v":"DSQ"},"DSQ","",6,"DNS",7,4,"",null,156,0,0,0,40,0,36,50,0,null,"DSQ",{"$f":"IF(ISNUMBER(AB15),(VLOOKUP(AB15,$BP$6:$BQ$40,2)),0)","v":0},{"$f":"IF(AB15<>\"\",5,0)","v":5},5,null,"DSQ",0,5,5,null,7,36,5,41,null,null,0,0,0,null,6,40,5,45,null,"DNS",0,5,5,null,4,50,5,55,null,null,0,0,0,null,10,26,0,0,1,0,0,0,0,0]
[11,10,"Helset","Mads","Heming",{"$f":"IF(G16<5,\"\",(R16-SUM(SMALL(S16:Z16,{1;2;3}))))","v":135},7,null,{"$f":"IF(AB16=\"\",\"\",AB16)","v":4},"DSQ","","DNS",4,"DSQ","DNS","DNS",null,135,50,0,0,0,50,0,0,0,null,4,{"$f":"IF(ISNUMBER(AB16),(VLOOKUP(AB16,$BP$6:$BQ$40,2)),0)","v":50},{"$f":"IF(AB16<>\"\",5,0)","v":5},55,null,"DSQ",0,5,5,null,"DSQ",0,5,5,null,null,0,0,0,null,"DNS",0,5,5,null,4,50,5,55,null,"DNS",0,5,5,null,"DNS",0,5,5,null,11,24,0,1,0,0,0,0,0,0]
[12,11,"Kokkim ","Oscar","Kjelsås",{"$f":"IF(G17<5,\"\",(R17-SUM(SMALL(S17:Z17,{1;2;3}))))","v":125},5,null,{"$f":"IF(AB17=\"\",\"\",AB17)","v":"DSQ"},"","","",13,"DSQ","DSQ",2,null,125,0,0,0,0,20,0,0,80,null,"DSQ",{"$f":"IF(ISNUMBER(AB17),(VLOOKUP(AB17,$BP$6:$BQ$40,2)),0)","v":0},{"$f":"IF(AB17<>\"\",5,0)","v":5},5,null,null,0,0,0,null,"DSQ",0,5,5,null,null,0,0,0,null,null,0,0,0,null,13,20,5,25,null,"DSQ",0,5,5,null,2,80,5,85,null,12,22,0,0,0,1,0,0,0,0]
[13,12,"Røsjø","Nicolai","Heming",{"$f":"IF(G18<5,\"\",(R18-SUM(SMALL(S18:Z18,{1;2;3}))))","v":114},5,null,{"$f":"IF(AB18=\"\",\"\",AB18)","v":"DSQ"},3,"","DNS",9,"DNS","","",null,114,0,60,0,0,29,0,0,0,null,"DSQ",{"$f":"IF(ISNUMBER(AB18),(VLOOKUP(AB18,$BP$6:$BQ$40,2)),0)","v":0},{"$f":"IF(AB18<>\"\",5,0)","v":5},5,null,3,60,5,65,null,"DNS",0,5,5,null,null,0,0,0,null,"DNS",0,5,5,null,9,29,5,34,null,null,0,0,0,null,null,0,0,0,null,13,20,0,0,0,1,0,0,0,0]
[14,13,"Wilhelmsen","Morten","Heming",{"$f":"IF(G19<5,\"\",(R19-SUM(SMALL(S19:Z19,{1;2;3}))))","v":110},5,null,{"$f":"IF(AB18=\"\",\"\",AB18)","v":"DSQ"},6,"","","DNS","","DNS",5,null,110,0,40,0,0,0,0,0,45,null,null,{"$f":"IF(ISNUMBER(AB18),(VLOOKUP(AB18,$BP$6:$BQ$40,2)),0)","v":0},{"$f":"IF(AB18<>\"\",5,0)","v":5},5,null,6,40,5,45,null,null,0,0,0,null,null,0,0,0,null,null,0,0,0,null,"DNS",0,5,5,null,"DNS",0,5,5,null,5,45,5,50,null,14,18,0,0,0,1,0,0,0,0]
[15,14,"Lien","Carl Oliver","Heming",{"$f":"IF(G20<5,\"\",(R20-SUM(SMALL(S20:Z20,{1;2;3}))))","v":95},7,null,{"$f":"IF(AB20=\"\",\"\",AB20)","v":"DNS"},"DNS","",3,"DNS","DNS","DNS","DNS",null,95,0,0,0,60,0,0,0,0,null,"DNS",{"$f":"IF(ISNUMBER(#REF!),(VLOOKUP(#REF!,$BP$6:$BQ$40,2)),0)","v":0},{"$f":"IF(AB20<>\"\",5,0)","v":5},5,null,"DNS",0,5,5,null,"DNS",0,5,5,null,null,0,0,0,null,3,60,5,65,null,"DNS",0,5,5,null,"DNS",0,5,5,null,"DNS",0,5,5,null,15,16,0,1,0,0,0,0,0,0]
[15,null,"Bratrud","Amund","Heming",{"$f":"IF(G21<5,\"\",(R21-SUM(SMALL(S21:Z21,{1;2;3}))))","v":""},2,null,{"$f":"IF(AB21=\"\",\"\",AB21)","v":""},"","",10,6,"","","",null,76,"","","","","","","","",null,null,{"$f":"IF(ISNUMBER(AB21),(VLOOKUP(AB21,$BP$6:$BQ$40,2)),0)","v":0},{"$f":"IF(AB21<>\"\",5,0)","v":0},0,null,null,0,0,0,null,null,0,0,0,null,null,0,0,0,null,10,26,5,31,null,6,40,5,45,null,null,0,0,0,null,null,0,0,0,null,16,15,0,0,0,0,0,0,1,0]
[15,null,"Rastad","Peder","Njård",{"$f":"IF(G22<5,\"\",(R22-SUM(SMALL(S22:Z22,{1;2;3}))))","v":""},3,null,{"$f":"IF(AB22=\"\",\"\",AB22)","v":"DSQ"},"","",8,12,"","","",null,69,"","","","","","","","",null,"DSQ",{"$f":"IF(ISNUMBER(AB22),(VLOOKUP(AB22,$BP$6:$BQ$40,2)),0)","v":0},{"$f":"IF(AB22<>\"\",5,0)","v":5},5,null,null,0,0,0,null,null,0,0,0,null,null,0,0,0,null,8,32,5,37,null,12,22,5,27,null,null,0,0,0,null,null,0,0,0,null,17,14,0,0,0,0,0,1,0,0]
[15,null,"Krogsrud","Sebastian","Ready",{"$f":"IF(G23<5,\"\",(R23-SUM(SMALL(S23:Z23,{1;2;3}))))","v":""},4,null,{"$f":"IF(AB23=\"\",\"\",AB23)","v":""},"DNS","",14,14,"DNS","","",null,56,"","","","","","","","",null,null,{"$f":"IF(ISNUMBER(AB23),(VLOOKUP(AB23,$BP$6:$BQ$40,2)),0)","v":0},{"$f":"IF(AB23<>\"\",5,0)","v":0},0,null,"DNS",0,5,5,null,"DNS",0,5,5,null,null,0,0,0,null,14,18,5,23,null,14,18,5,23,null,null,0,0,0,null,null,0,0,0,null,18,13,0,0,0,0,1,0,0,0]
[19,15,"Brekke","Andreas","Heming",{"$f":"IF(G24<5,\"\",(R24-SUM(SMALL(S24:Z24,{1;2;3}))))","v":54},6,null,{"$f":"IF(AB23=\"\",\"\",AB23)","v":""},"DNS","",11,"DNS","DSQ","DNS","DNS",null,54,0,0,0,24,0,0,0,0,null,"DNS",{"$f":"IF(ISNUMBER(AB23),(VLOOKUP(AB23,$BP$6:$BQ$40,2)),0)","v":0},{"$f":"IF(AB23<>\"\",5,0)","v":0},0,null,"DNS",0,5,5,null,"DSQ",0,5,5,null,null,0,0,0,null,11,24,5,29,null,"DNS",0,5,5,null,"DNS",0,5,5,null,"DNS",0,5,5,null,19,12,0,0,1,0,0,0,0,0]
[19,null,"Sivle","Victor","Ready",{"$f":"IF(G25<5,\"\",(R25-SUM(SMALL(S25:Z25,{1;2;3}))))","v":""},3,null,{"$f":"IF(AB25=\"\",\"\",AB25)","v":""},"","",12,15,"DNS","","",null,53,"","","","","","","","",null,null,{"$f":"IF(ISNUMBER(AB25),(VLOOKUP(AB25,$BP$6:$BQ$40,2)),0)","v":0},{"$f":"IF(AB25<>\"\",5,0)","v":0},0,null,null,0,0,0,null,"DNS",0,5,5,null,null,0,0,0,null,12,22,5,27,null,15,16,5,21,null,null,0,0,0,null,null,0,0,0,null,20,11,0,0,0,0,0,1,0,0]
[19,null,"Øgaard","Milan","Njård",{"$f":"IF(G26<5,\"\",(R26-SUM(SMALL(S26:Z26,{1;2;3}))))","v":""},2,null,"","","",15,17,"","","",null,40,"","","","","","","","",null,null,0,0,0,null,null,0,0,0,null,null,0,0,0,null,null,0,0,0,null,15,16,5,21,null,17,14,5,19,null,null,0,0,0,null,null,0,0,0,null,21,10,0,0,0,0,0,0,1,0]
[19,null,"Taugbøl","Njård","Njård",{"$f":"IF(G27<5,\"\",(R27-SUM(SMALL(S27:Z27,{1;2;3}))))","v":""},3,null,"","","",16,"DNS","DSQ","","",null,30,"","","","","","","","",null,null,0,0,0,null,null,0,0,0,null,"DSQ",0,5,5,null,null,0,0,0,null,16,15,5,20,null,"DNS",0,5,5,null,null,0,0,0,null,null,0,0,0,null,22,9,0,0,0,0,0,1,0,0]
[19,null,"Fure Andersen","Sebastian",null,{"$f":"IF(G28<5,\"\",(R28-SUM(SMALL(S28:Z28,{1;2;3}))))","v":""},1,null,"","","","",16,"","","",null,20,"","","","","","","","",null,null,0,0,0,null,null,0,0,0,null,null,0,0,0,null,null,0,0,0,null,null,0,0,0,null,16,15,5,20,null,null,0,0,0,null,null,0,0,0,null,23,8,0,0,0,0,0,0,0,1]
[19,null,"Ingebrigtsen","Ole Harald","Ready",{"$f":"IF(G29<5,\"\",(R29-SUM(SMALL(S29:Z29,{1;2;3}))))","v":""},3,null,"","","","","DNF","","DNS","DNS",null,15,"","","","","","","","",null,null,0,0,0,null,null,0,0,0,null,null,0,0,0,null,null,0,0,0,null,null,0,0,0,null,"DNF",0,5,5,null,"DNS",0,5,5,null,"DNS",0,5,5,null,24,7,0,0,0,0,0,1,0,0]
[19,null,"Andersen","Sebastian","Heming",{"$f":"IF(G30<5,\"\",(R30-SUM(SMALL(S30:Z30,{1;2;3}))))","v":""},1,null,"","","","DNS","","","","",null,5,"","","","","","","","",null,null,0,0,0,null,null,0,0,0,null,null,0,0,0,null,null,0,0,0,null,"DNS",0,5,5,null,null,0,0,0,null,null,0,0,0,null,null,0,0,0,null,25,6,0,0,0,0,0,0,0,1]
[19,null,"Hunstad","Magnus","Heming",{"$f":"IF(G31<5,\"\",(R31-SUM(SMALL(S31:Z31,{1;2;3}))))","v":""},1,null,"","","","","DNS","","","",null,5,"","","","","","","","",null,null,0,0,0,null,null,0,0,0,null,null,0,0,0,null,null,0,0,0,null,null,0,0,0,null,"DNS",0,5,5,null,null,0,0,0,null,null,0,0,0,null,26,5,0,0,0,0,0,0,0,1]
[19,null,"Sandvik","Philip","Heming",{"$f":"IF(G32<5,\"\",(R32-SUM(SMALL(S32:Z32,{1;2;3}))))","v":""},1,null,"","","","","DSQ","","","",null,5,"","","","","","","","",null,null,0,0,0,null,null,0,0,0,null,null,0,0,0,null,null,0,0,0,null,null,0,0,0,null,"DSQ",0,5,5,null,null,0,0,0,null,null,0,0,0,null,27,4,0,0,0,0,0,0,0,1]
[19,null,"Weisæth-Andersen","Lars","Heming",{"$f":"IF(G33<5,\"\",(R33-SUM(SMALL(S33:Z33,{1;2;3}))))","v":""},1,null,"","","","","DSQ","","","",null,5,"","","","","","","","",null,null,0,0,0,null,null,0,0,0,null,null,0,0,0,null,null,0,0,0,null,null,0,0,0,null,"DSQ",0,5,5,null,null,0,0,0,null,null,0,0,0,null,28,3,0,0,0,0,0,0,0,1]
[19,null,null,null,null,{"$f":"IF(G34<5,\"\",(R34-SUM(SMALL(S34:Z34,{1;2;3}))))","v":""},0,null,"","","","","","","","",null,0,"","","","","","","","",null,null,0,0,0,null,null,0,0,0,null,null,0,0,0,null,null,0,0,0,null,null,0,0,0,null,null,0,0,0,null,null,0,0,0,null,null,0,0,0,null,29,2,0,0,0,0,0,0,0,0]
[19,null,null,null,null,{"$f":"IF(G35<5,\"\",(R35-SUM(SMALL(S35:Z35,{1;2;3}))))","v":""},0,null,"","","","","","","","",null,0,"","","","","","","","",null,null,0,0,0,null,null,0,0,0,null,null,0,0,0,null,null,0,0,0,null,null,0,0,0,null,null,0,0,0,null,null,0,0,0,null,null,0,0,0,null,30,1,0,0,0,0,0,0,0,0]
[19,null,null,null,null,{"$f":"IF(G36<5,\"\",(R36-SUM(SMALL(S36:Z36,{1;2;3}))))","v":""},0,null,"","","","","","","","",null,0,"","","","","","","","",null,null,0,0,0,null,null,0,0,0,null,null,0,0,0,null,null,0,0,0,null,null,0,0,0,null,null,0,0,0,null,null,0,0,0,null,null,0,0,0,null,31,0,0,0,0,0,0,0,0,0]
[19,null,null,null,null,{"$f":"IF(G37<5,\"\",(R37-SUM(SMALL(S37:Z37,{1;2;3}))))","v":""},0,null,"","","","","","","","",null,0,"","","","","","","","",null,null,0,0,0,null,null,0,0,0,null,null,0,0,0,null,null,0,0,0,null,null,0,0,0,null,null,0,0,0,null,null,0,0,0,null,null,0,0,0,null,32,0,0,0,0,0,0,0,0,0]
[19,null,null,null,null,{"$f":"IF(G38<5,\"\",(R38-SUM(SMALL(S38:Z38,{1;2;3}))))","v":""},{"$f":"(IF(AD38=5,1,0)+IF(AI38=5,1,0)+IF(AS38=5,1,0)+IF(AX38=5,1,0)+IF(BC38=5,1,0)+IF(AN38=5,1,0)+IF(BH38=5,1,0)+IF(BM38=5,1,0))","v":0},null,"","","","","","","","",null,{"$f":"AE38+AJ38+AT38+AY38+BD38+AO38+BI38+BN38","v":0},"","","","","","","","",null,null,0,0,{"$f":"AC38+AD38","v":0},null,null,0,{"$f":"IF(AG38<>\"\",5,0)","v":0},{"$f":"AH38+AI38","v":0},null,null,0,{"$f":"IF(AL38<>\"\",5,0)","v":0},{"$f":"AM38+AN38","v":0},null,null,0,{"$f":"IF(AQ38<>\"\",5,0)","v":0},{"$f":"AR38+AS38","v":0},null,null,0,{"$f":"IF(AV38<>\"\",5,0)","v":0},{"$f":"AW38+AX38","v":0},null,null,0,{"$f":"IF(BA38<>\"\",5,0)","v":0},{"$f":"BB38+BC38","v":0},null,null,0,{"$f":"IF(BF38<>\"\",5,0)","v":0},{"$f":"BG38+BH38","v":0},null,null,0,{"$f":"IF(BK38<>\"\",5,0)","v":0},{"$f":"BL38+BM38","v":0},null,33,0,0,0,0,0,0,0,0,0]
[19,null,null,null,null,{"$f":"IF(G39<5,\"\",(R39-SUM(SMALL(S39:Z39,{1;2;3}))))","v":""},0,null,"","","","","","","","",null,0,"","","","","","","","",null,null,0,0,0,null,null,0,0,0,null,null,0,0,0,null,null,0,0,0,null,null,0,0,0,null,null,0,0,0,null,null,0,0,0,null,null,0,0,0,null,34,0,0,0,0,0,0,0,0,0]
[19,null,null,null,null,{"$f":"IF(G40<5,\"\",(R40-SUM(SMALL(S40:Z40,{1;2;3}))))","v":""},0,null,"","","","","","","","",null,0,"","","","","","","","",null,null,0,0,0,null,null,0,0,0,null,null,0,0,0,null,null,0,0,0,null,null,0,0,0,null,null,0,0,0,null,null,0,0,0,null,null,0,0,0,null,35,0,0,0,0,0,0,0,0,0]
[null,null,null,null,null,null,null,null,{"$f":"IF(AB41=\"\",\"\",AB41)","v":""},{"$f":"IF(AG41=\"\",\"\",AG41)","v":""},{"$f":"IF(AQ41=\"\",\"\",AQ41)","v":""},{"$f":"IF(AV41=\"\",\"\",AV41)","v":""},{"$f":"IF(BA41=\"\",\"\",BA41)","v":""},{"$f":"IF(AL41=\"\",\"\",AL41)","v":""},{"$f":"IF(BF41=\"\",\"\",BF41)","v":""},{"$f":"IF(BK41=\"\",\"\",BK41)","v":""},null,null,{"$f":"IF($G41>=7,IF(AC41=\"\",\"\",AC41),\"\")","v":""},{"$f":"IF($G41>=7,IF(AH41=\"\",\"\",AH41),\"\")","v":""},{"$f":"IF($G41>=7,IF(AR41=\"\",\"\",AR41),\"\")","v":""},{"$f":"IF($G41>=7,IF(AW41=\"\",\"\",AW41),\"\")","v":""},{"$f":"IF($G41>=7,IF(BB41=\"\",\"\",BB41),\"\")","v":""},{"$f":"IF($G41>=7,IF(AM41=\"\",\"\",AM41),\"\")","v":""},{"$f":"IF($G41>=7,IF(BG41=\"\",\"\",BG41),\"\")","v":""},{"$f":"IF($G41>=7,IF(BL41=\"\",\"\",BL41),\"\")","v":""}]
[null,null,null,null,null,null,null,null,"","","","","","","","",null,null,{"$f":"IF($G42>=7,IF(AC42=\"\",\"\",AC42),\"\")","v":""},{"$f":"IF($G42>=7,IF(AH42=\"\",\"\",AH42),\"\")","v":""},{"$f":"IF($G42>=7,IF(AR42=\"\",\"\",AR42),\"\")","v":""},{"$f":"IF($G42>=7,IF(AW42=\"\",\"\",AW42),\"\")","v":""},{"$f":"IF($G42>=7,IF(BB42=\"\",\"\",BB42),\"\")","v":""},{"$f":"IF($G42>=7,IF(AM42=\"\",\"\",AM42),\"\")","v":""},{"$f":"IF($G42>=7,IF(BG42=\"\",\"\",BG42),\"\")","v":""},{"$f":"IF($G42>=7,IF(BL42=\"\",\"\",BL42),\"\")","v":""}]
[null,null,null,null,null,null,null,null,"","","","","","","","",null,null,{"$f":"IF($G43>=7,IF(AC43=\"\",\"\",AC43),\"\")","v":""},{"$f":"IF($G43>=7,IF(AH43=\"\",\"\",AH43),\"\")","v":""},{"$f":"IF($G43>=7,IF(AR43=\"\",\"\",AR43),\"\")","v":""},{"$f":"IF($G43>=7,IF(AW43=\"\",\"\",AW43),\"\")","v":""},{"$f":"IF($G43>=7,IF(BB43=\"\",\"\",BB43),\"\")","v":""},{"$f":"IF($G43>=7,IF(AM43=\"\",\"\",AM43),\"\")","v":""},{"$f":"IF($G43>=7,IF(BG43=\"\",\"\",BG43),\"\")","v":""},{"$f":"IF($G43>=7,IF(BL43=\"\",\"\",BL43),\"\")","v":""}]
[null,null,null,null,null,null,null,null,"","","","","","","","",null,null,{"$f":"IF($G44>=7,IF(AC44=\"\",\"\",AC44),\"\")","v":""},{"$f":"IF($G44>=7,IF(AH44=\"\",\"\",AH44),\"\")","v":""},{"$f":"IF($G44>=7,IF(AR44=\"\",\"\",AR44),\"\")","v":""},{"$f":"IF($G44>=7,IF(AW44=\"\",\"\",AW44),\"\")","v":""},{"$f":"IF($G44>=7,IF(BB44=\"\",\"\",BB44),\"\")","v":""},{"$f":"IF($G44>=7,IF(AM44=\"\",\"\",AM44),\"\")","v":""},{"$f":"IF($G44>=7,IF(BG44=\"\",\"\",BG44),\"\")","v":""},{"$f":"IF($G44>=7,IF(BL44=\"\",\"\",BL44),\"\")","v":""}]
[null,null,null,null,null,null,null,null,"","","","","","","","",null,null,{"$f":"IF($G45>=7,IF(AC45=\"\",\"\",AC45),\"\")","v":""},{"$f":"IF($G45>=7,IF(AH45=\"\",\"\",AH45),\"\")","v":""},{"$f":"IF($G45>=7,IF(AR45=\"\",\"\",AR45),\"\")","v":""},{"$f":"IF($G45>=7,IF(AW45=\"\",\"\",AW45),\"\")","v":""},{"$f":"IF($G45>=7,IF(BB45=\"\",\"\",BB45),\"\")","v":""},{"$f":"IF($G45>=7,IF(AM45=\"\",\"\",AM45),\"\")","v":""},{"$f":"IF($G45>=7,IF(BG45=\"\",\"\",BG45),\"\")","v":""},{"$f":"IF($G45>=7,IF(BL45=\"\",\"\",BL45),\"\")","v":""}]