{"text_format":"1","workbook":"xlsx","n_sheets":20,"sheets":["K2","K5-K8","K 10","K15","K25 G","K25 J","K45 G","K45 J","K40 RCB G","K40 RCB J","K65 G","K65 J","Ledig (2)","Ledig (3)","Ledig (4)","Ledig (5)","Ledig (6)","K65 RCB G","K65 RCB J","Meterverdier"],"not_rendered":{"charts":0,"images":4,"macros":1,"external_links":0,"defined_names":38,"comments":0,"pivot_tables":0},"unopened":[],"bounds":{"document_bytes":16777216,"sheet_cells":100000,"rows_first":2000,"rows_last":500,"rows_between":2000,"halvings":0,"cell_chars":16384,"cell_head_chars":4096},"cells_cut":0,"cells_raw":0,"read":"whole","date_system":"1900"}

{"sheet":"K2","index":0,"n_rows":69,"n_cols":18,"rows_kept":69,"cut":false,"hidden":false,"merged":[[8,7,8,11],[8,12,8,16]]}
[]
[null,null,null,null,"Namsosrennet i hopp og kombinert 01.02.2026"]
[]
[]
[null,null,null,null,{"$f":"\"K\"&F6","v":"K2"},null,"Åpen klasse"]
[null,null,null,null,"K-punkt:",2,"meter"]
[null,null,null,null,"Meterverdi:",{"$f":"VLOOKUP(F6,Meterverdier!A:B,2,FALSE)","v":5.2},"poeng/meter"]
[]
[null,null,null,null,null,null,null,"1. omgang",null,null,null,null,"2. omgang"]
[null,null,"Start-",null,null,"Hopp/",null,null,null,null,null,null,null,null,null,null,null,"Poeng"]
[null,"Plassering","nr.","Navn","Klubb","Komb","F.år","Lengde","A","B","C","Poeng","Lengde","A","B","C","Poeng","totalt"]
[null,{"$f":"IF(R12=\"\",\"\",RANK(R12,$R$12:$R$12,0)+COUNTIFS($R$12:R12,R12)-1)","v":1},109,"Elvira Hanssen Otterbekk","Namsos Idrettslag hopp","Hopp","J7",4,null,null,null,{"$f":"IF(H12=\"\",0,60+$F$7*(H12-$F$6)+SUM(I12:K12))","v":70.400000000000006},5,null,null,null,{"$f":"IF(M12=\"\",\"\",60+'K5-K8'!$F$7*(M12-'K5-K8'!$F$6)+SUM(N12:P12))","v":44.4},{"$f":"IF(AND(ISNUMBER(L12),ISNUMBER(Q12)),L12+Q12,0)","v":114.80000000000001}]
[null,{"$f":"IF(R13=\"\",\"\",RANK(R13,$R$12:$R$27,0)+COUNTIFS($R$12:R13,R13)-1)","v":2},null,null,null,null,null,null,null,null,null,0,null,null,null,null,{"$f":"IF(M13=\"\",\"\",60+$F$7*(M13-$F$6)+SUM(N13:P13))","v":""},{"$f":"IF(AND(ISNUMBER(L13),ISNUMBER(Q13)),L13+Q13,0)","v":0}]
[null,{"$f":"IF(R14=\"\",\"\",RANK(R14,$R$12:$R$27,0)+COUNTIFS($R$12:R14,R14)-1)","v":3},null,null,null,null,null,null,null,null,null,0,null,null,null,null,"",0]
[null,{"$f":"IF(R15=\"\",\"\",RANK(R15,$R$12:$R$27,0)+COUNTIFS($R$12:R15,R15)-1)","v":4},null,null,null,null,null,null,null,null,null,0,null,null,null,null,"",0]
[null,{"$f":"IF(R16=\"\",\"\",RANK(R16,$R$12:$R$27,0)+COUNTIFS($R$12:R16,R16)-1)","v":5},null,null,null,null,null,null,null,null,null,0,null,null,null,null,"",0]
[null,{"$f":"IF(R17=\"\",\"\",RANK(R17,$R$12:$R$27,0)+COUNTIFS($R$12:R17,R17)-1)","v":6},null,null,null,null,null,null,null,null,null,0,null,null,null,null,"",0]
[null,{"$f":"IF(R18=\"\",\"\",RANK(R18,$R$12:$R$27,0)+COUNTIFS($R$12:R18,R18)-1)","v":7},null,null,null,null,null,null,null,null,null,0,null,null,null,null,"",0]
[null,{"$f":"IF(R19=\"\",\"\",RANK(R19,$R$12:$R$27,0)+COUNTIFS($R$12:R19,R19)-1)","v":8},null,null,null,null,null,null,null,null,null,0,null,null,null,null,"",0]
[null,{"$f":"IF(R20=\"\",\"\",RANK(R20,$R$12:$R$27,0)+COUNTIFS($R$12:R20,R20)-1)","v":9},null,null,null,null,null,null,null,null,null,0,null,null,null,null,"",0]
[null,{"$f":"IF(R21=\"\",\"\",RANK(R21,$R$12:$R$27,0)+COUNTIFS($R$12:R21,R21)-1)","v":10},null,null,null,null,null,null,null,null,null,0,null,null,null,null,"",0]
[null,{"$f":"IF(R22=\"\",\"\",RANK(R22,$R$12:$R$27,0)+COUNTIFS($R$12:R22,R22)-1)","v":11},null,null,null,null,null,null,null,null,null,0,null,null,null,null,"",0]
[null,{"$f":"IF(R23=\"\",\"\",RANK(R23,$R$12:$R$27,0)+COUNTIFS($R$12:R23,R23)-1)","v":12},null,null,null,null,null,null,null,null,null,0,null,null,null,null,"",0]
[null,{"$f":"IF(R24=\"\",\"\",RANK(R24,$R$12:$R$27,0)+COUNTIFS($R$12:R24,R24)-1)","v":13},null,null,null,null,null,null,null,null,null,0,null,null,null,null,"",0]
[null,{"$f":"IF(R25=\"\",\"\",RANK(R25,$R$12:$R$27,0)+COUNTIFS($R$12:R25,R25)-1)","v":14},null,null,null,null,null,null,null,null,null,0,null,null,null,null,"",0]
[null,{"$f":"IF(R26=\"\",\"\",RANK(R26,$R$12:$R$27,0)+COUNTIFS($R$12:R26,R26)-1)","v":15},null,null,null,null,null,null,null,null,null,0,null,null,null,null,"",0]
[null,{"$f":"IF(R27=\"\",\"\",RANK(R27,$R$12:$R$27,0)+COUNTIFS($R$12:R27,R27)-1)","v":16},null,null,null,null,null,null,null,null,null,0,null,null,null,null,"",0]
[null,null,null,null,null,null,null,null,null,null,{"$f":"IF(G28=\"\",\"\",60+$F$7*(G28-$F$6)+SUM(H28:J28))","v":""},null,null,null,null,{"$f":"IF(L28=\"\",\"\",60+$F$7*(L28-$F$6)+SUM(M28:O28))","v":""},{"$f":"IF(AND(ISNUMBER(K28),ISNUMBER(P28)),K28+P28,\"\")","v":""}]
[]
[null,null,null,null,"Startliste kombinert - individuell kompakt"]
[]
[null,"Plass. Hopp\n 1. omg","Start nr.","Navn","Klubb","F.år","Poeng hopp","Start tid","Tid i mål\nMM:SS,T",null,null,"Plassering"]
[null,{"$f":"IF(COUNTIF($F$12:$F$27,\"Komb\")>0,1,\"\")","v":""},{"$f":"_xlfn._xlws.SORT(_xlfn.HSTACK(_xlfn._xlws.FILTER($C$12:$E$27,$F$12:$F$27=\"Komb\",$L$12:$L$27>0),_xlfn._xlws.FILTER($G$12:$G$27,$F$12:$F$27=\"Komb\",$L$12:$L$27>0),_xlfn._xlws.FILTER($L$12:$L$27,$F$12:$F$27=\"Komb\",$L$12:$L$27>0)),5,-1)","v":{"$error":"#VALUE!"}},null,null,null,null,{"$f":"TIME(0,0,0)","v":"00:00:00"},"00:01:40.500",null,null,{"$f":"IF(C33=\"\",\"\",RANK(I33,$I$33:$I$48,1)+COUNTIF($I$33:I33,I33)-1)","v":{"$error":"#VALUE!"}}]
[null,{"$f":"IFERROR(IF(B33+1>COUNTIF($F$12:$F$27,\"Komb\"),\"\",B33+1),\"\")","v":""},null,null,null,null,null,{"$f":"IF(B34=\"\",\"\",H33+TIME(0,0,6))","v":""},"00:01:38",null,null,{"$f":"IF(C34=\"\",\"\",RANK(I34,$I$33:$I$48,1)+COUNTIF($I$33:I34,I34)-1)","v":""}]
[null,{"$f":"IFERROR(IF(B34+1>COUNTIF($F$12:$F$27,\"Komb\"),\"\",B34+1),\"\")","v":""},null,null,null,null,null,{"$f":"IF(B35=\"\",\"\",H34+TIME(0,0,6))","v":""},null,null,null,{"$f":"IF(C35=\"\",\"\",RANK(I35,$I$33:$I$48,1)+COUNTIF($I$33:I35,I35)-1)","v":""}]
[null,{"$f":"IFERROR(IF(B35+1>COUNTIF($F$12:$F$27,\"Komb\"),\"\",B35+1),\"\")","v":""},null,null,null,null,null,"",null,null,null,{"$f":"IF(C36=\"\",\"\",RANK(I36,$I$33:$I$48,1)+COUNTIF($I$33:I36,I36)-1)","v":""}]
[null,{"$f":"IFERROR(IF(B36+1>COUNTIF($F$12:$F$27,\"Komb\"),\"\",B36+1),\"\")","v":""},null,null,null,null,null,"",null,null,null,{"$f":"IF(C37=\"\",\"\",RANK(I37,$I$33:$I$48,1)+COUNTIF($I$33:I37,I37)-1)","v":""}]
[null,{"$f":"IFERROR(IF(B37+1>COUNTIF($F$12:$F$27,\"Komb\"),\"\",B37+1),\"\")","v":""},null,null,null,null,null,"",null,null,null,{"$f":"IF(C38=\"\",\"\",RANK(I38,$I$33:$I$48,1)+COUNTIF($I$33:I38,I38)-1)","v":""}]
[null,{"$f":"IFERROR(IF(B38+1>COUNTIF($F$12:$F$27,\"Komb\"),\"\",B38+1),\"\")","v":""},null,null,null,null,null,"",null,null,null,{"$f":"IF(C39=\"\",\"\",RANK(I39,$I$33:$I$48,1)+COUNTIF($I$33:I39,I39)-1)","v":""}]
[null,{"$f":"IFERROR(IF(B39+1>COUNTIF($F$12:$F$27,\"Komb\"),\"\",B39+1),\"\")","v":""},null,null,null,null,null,"",null,null,null,{"$f":"IF(C40=\"\",\"\",RANK(I40,$I$33:$I$48,1)+COUNTIF($I$33:I40,I40)-1)","v":""}]
[null,{"$f":"IFERROR(IF(B40+1>COUNTIF($F$12:$F$27,\"Komb\"),\"\",B40+1),\"\")","v":""},null,null,null,null,null,"",null,null,null,{"$f":"IF(C41=\"\",\"\",RANK(I41,$I$33:$I$48,1)+COUNTIF($I$33:I41,I41)-1)","v":""}]
[null,{"$f":"IFERROR(IF(B41+1>COUNTIF($F$12:$F$27,\"Komb\"),\"\",B41+1),\"\")","v":""},null,null,null,null,null,"",null,null,null,{"$f":"IF(C42=\"\",\"\",RANK(I42,$I$33:$I$48,1)+COUNTIF($I$33:I42,I42)-1)","v":""}]
[null,{"$f":"IFERROR(IF(B42+1>COUNTIF($F$12:$F$27,\"Komb\"),\"\",B42+1),\"\")","v":""},null,null,null,null,null,"",null,null,null,{"$f":"IF(C43=\"\",\"\",RANK(I43,$I$33:$I$48,1)+COUNTIF($I$33:I43,I43)-1)","v":""}]
[null,{"$f":"IFERROR(IF(B43+1>COUNTIF($F$12:$F$27,\"Komb\"),\"\",B43+1),\"\")","v":""},null,null,null,null,null,"",null,null,null,{"$f":"IF(C44=\"\",\"\",RANK(I44,$I$33:$I$48,1)+COUNTIF($I$33:I44,I44)-1)","v":""}]
[null,{"$f":"IFERROR(IF(B44+1>COUNTIF($F$12:$F$27,\"Komb\"),\"\",B44+1),\"\")","v":""},null,null,null,null,null,"",null,null,null,{"$f":"IF(C45=\"\",\"\",RANK(I45,$I$33:$I$48,1)+COUNTIF($I$33:I45,I45)-1)","v":""}]
[null,{"$f":"IFERROR(IF(B45+1>COUNTIF($F$12:$F$27,\"Komb\"),\"\",B45+1),\"\")","v":""},null,null,null,null,null,"",null,null,null,{"$f":"IF(C46=\"\",\"\",RANK(I46,$I$33:$I$48,1)+COUNTIF($I$33:I46,I46)-1)","v":""}]
[null,{"$f":"IFERROR(IF(B46+1>COUNTIF($F$12:$F$27,\"Komb\"),\"\",B46+1),\"\")","v":""},null,null,null,null,null,"",null,null,null,{"$f":"IF(C47=\"\",\"\",RANK(I47,$I$33:$I$48,1)+COUNTIF($I$33:I47,I47)-1)","v":""}]
[null,{"$f":"IFERROR(IF(B47+1>COUNTIF($F$12:$F$27,\"Komb\"),\"\",B47+1),\"\")","v":""},null,null,null,null,null,"",null,null,null,{"$f":"IF(C48=\"\",\"\",RANK(I48,$I$33:$I$48,1)+COUNTIF($I$33:I48,I48)-1)","v":""}]
[]
[]
[null,null,null,null,"Resultatliste kombinert - individuell kompakt"]
[]
[null,"Plass","Start nr.","Navn","Klubb","F.år","Lengde","A","B","C","Poeng\nHopp","Starttid\nlangrenn","Tid\nlangr",null,"Tid i mål"]
[null,{"$f":"IF(COUNT($I$33:$I$48)>0,1,\"\")","v":1},null,{"$f":"IF(C54=\"\",\"\",_xlfn.XLOOKUP($C54,$C$33:$C$48,D$33:D$48,\"\",0,1))","v":""},{"$f":"IF(D54=\"\",\"\",_xlfn.XLOOKUP($C54,$C$33:$C$48,E$33:E$48,\"\",0,1))","v":""},"",{"$f":"IF($C54=\"\",\"\",_xlfn.XLOOKUP($C54,$C$12:$C$27,H$12:H$27,\"\",0,1))","v":""},{"$f":"IF($C54=\"\",\"\",_xlfn.XLOOKUP($C54,$C$12:$C$27,I$12:I$27,\"\",0,1))","v":""},{"$f":"IF($C54=\"\",\"\",_xlfn.XLOOKUP($C54,$C$12:$C$27,J$12:J$27,\"\",0,1))","v":""},{"$f":"IF($C54=\"\",\"\",_xlfn.XLOOKUP($C54,$C$12:$C$27,K$12:K$27,\"\",0,1))","v":""},{"$f":"IF($C54=\"\",\"\",_xlfn.XLOOKUP($C54,$C$12:$C$27,L$12:L$27,\"\",0,1))","v":""},{"$f":"_xlfn.XLOOKUP(C54,$C$32:$C$48,$H$32:$H$48,\"\",0,1)","v":""},{"$f":"IF(C54=\"\",\"\",_xlfn.XLOOKUP(C54,$C$32:$C$48,$I$32:$I$48,\"\",0,1)-L54)","v":""},null,{"$f":"VLOOKUP(C54,C33:I48,7,FALSE)","v":{"$error":"#N/A"}}]
[null,{"$f":"IFERROR(IF(B54+1>COUNT($I$33:$I$48),\"\",B54+1),\"\")","v":2},null,"",{"$f":"IF(D55=\"\",\"\",_xlfn.XLOOKUP($C55,$C$33:$C$48,E$33:E$48,\"\",0,1))","v":""},"",{"$f":"IF($C55=\"\",\"\",_xlfn.XLOOKUP($C55,$C$12:$C$27,H$12:H$27,\"\",0,1))","v":""},{"$f":"IF($C55=\"\",\"\",_xlfn.XLOOKUP($C55,$C$12:$C$27,I$12:I$27,\"\",0,1))","v":""},{"$f":"IF($C55=\"\",\"\",_xlfn.XLOOKUP($C55,$C$12:$C$27,J$12:J$27,\"\",0,1))","v":""},{"$f":"IF($C55=\"\",\"\",_xlfn.XLOOKUP($C55,$C$12:$C$27,K$12:K$27,\"\",0,1))","v":""},{"$f":"IF($C55=\"\",\"\",_xlfn.XLOOKUP($C55,$C$12:$C$27,L$12:L$27,\"\",0,1))","v":""},{"$f":"_xlfn.XLOOKUP(C55,$C$32:$C$48,$H$32:$H$48,\"\",0,1)","v":""},{"$f":"IF(C55=\"\",\"\",_xlfn.XLOOKUP(C55,$C$32:$C$48,$I$32:$I$48,\"\",0,1)-L55)","v":""},{"$f":"IF(C55=\"\",\"\",\"+\")","v":""},{"$f":"IF(C55=\"\",\"\",VLOOKUP($C55,$C$33:$I$48,7,0)-VLOOKUP($C$54,$C$33:$I$48,7,0))","v":""}]
[null,{"$f":"IFERROR(IF(B55+1>COUNT($I$33:$I$48),\"\",B55+1),\"\")","v":""},{"$f":"IF(B56=\"\",\"\",_xlfn.XLOOKUP($B56,$L$33:$L$48,$C$33:$C$48,\"\",0,1))","v":""},"",{"$f":"IF(D56=\"\",\"\",_xlfn.XLOOKUP($C56,$C$33:$C$48,E$33:E$48,\"\",0,1))","v":""},"",{"$f":"IF($C56=\"\",\"\",_xlfn.XLOOKUP($C56,$C$12:$C$27,H$12:H$27,\"\",0,1))","v":""},{"$f":"IF($C56=\"\",\"\",_xlfn.XLOOKUP($C56,$C$12:$C$27,I$12:I$27,\"\",0,1))","v":""},{"$f":"IF($C56=\"\",\"\",_xlfn.XLOOKUP($C56,$C$12:$C$27,J$12:J$27,\"\",0,1))","v":""},{"$f":"IF($C56=\"\",\"\",_xlfn.XLOOKUP($C56,$C$12:$C$27,K$12:K$27,\"\",0,1))","v":""},{"$f":"IF($C56=\"\",\"\",_xlfn.XLOOKUP($C56,$C$12:$C$27,L$12:L$27,\"\",0,1))","v":""},"","","",{"$f":"IF(C56=\"\",\"\",VLOOKUP($C56,$C$33:$I$48,7,0)-VLOOKUP($C$54,$C$33:$I$48,7,0))","v":""}]
[null,"","","",{"$f":"IF(D57=\"\",\"\",_xlfn.XLOOKUP($C57,$C$33:$C$48,E$33:E$48,\"\",0,1))","v":""},"",{"$f":"IF($C57=\"\",\"\",_xlfn.XLOOKUP($C57,$C$12:$C$27,H$12:H$27,\"\",0,1))","v":""},{"$f":"IF($C57=\"\",\"\",_xlfn.XLOOKUP($C57,$C$12:$C$27,I$12:I$27,\"\",0,1))","v":""},{"$f":"IF($C57=\"\",\"\",_xlfn.XLOOKUP($C57,$C$12:$C$27,J$12:J$27,\"\",0,1))","v":""},{"$f":"IF($C57=\"\",\"\",_xlfn.XLOOKUP($C57,$C$12:$C$27,K$12:K$27,\"\",0,1))","v":""},{"$f":"IF($C57=\"\",\"\",_xlfn.XLOOKUP($C57,$C$12:$C$27,L$12:L$27,\"\",0,1))","v":""},"","","",""]
[null,"","","",{"$f":"IF(D58=\"\",\"\",_xlfn.XLOOKUP($C58,$C$33:$C$48,E$33:E$48,\"\",0,1))","v":""},"",{"$f":"IF($C58=\"\",\"\",_xlfn.XLOOKUP($C58,$C$12:$C$27,H$12:H$27,\"\",0,1))","v":""},{"$f":"IF($C58=\"\",\"\",_xlfn.XLOOKUP($C58,$C$12:$C$27,I$12:I$27,\"\",0,1))","v":""},{"$f":"IF($C58=\"\",\"\",_xlfn.XLOOKUP($C58,$C$12:$C$27,J$12:J$27,\"\",0,1))","v":""},{"$f":"IF($C58=\"\",\"\",_xlfn.XLOOKUP($C58,$C$12:$C$27,K$12:K$27,\"\",0,1))","v":""},{"$f":"IF($C58=\"\",\"\",_xlfn.XLOOKUP($C58,$C$12:$C$27,L$12:L$27,\"\",0,1))","v":""},"","","",""]
[null,"","","",{"$f":"IF(D59=\"\",\"\",_xlfn.XLOOKUP($C59,$C$33:$C$48,E$33:E$48,\"\",0,1))","v":""},"",{"$f":"IF($C59=\"\",\"\",_xlfn.XLOOKUP($C59,$C$12:$C$27,H$12:H$27,\"\",0,1))","v":""},{"$f":"IF($C59=\"\",\"\",_xlfn.XLOOKUP($C59,$C$12:$C$27,I$12:I$27,\"\",0,1))","v":""},{"$f":"IF($C59=\"\",\"\",_xlfn.XLOOKUP($C59,$C$12:$C$27,J$12:J$27,\"\",0,1))","v":""},{"$f":"IF($C59=\"\",\"\",_xlfn.XLOOKUP($C59,$C$12:$C$27,K$12:K$27,\"\",0,1))","v":""},{"$f":"IF($C59=\"\",\"\",_xlfn.XLOOKUP($C59,$C$12:$C$27,L$12:L$27,\"\",0,1))","v":""},"","","",""]
[null,"","","",{"$f":"IF(D60=\"\",\"\",_xlfn.XLOOKUP($C60,$C$33:$C$48,E$33:E$48,\"\",0,1))","v":""},"",{"$f":"IF($C60=\"\",\"\",_xlfn.XLOOKUP($C60,$C$12:$C$27,H$12:H$27,\"\",0,1))","v":""},{"$f":"IF($C60=\"\",\"\",_xlfn.XLOOKUP($C60,$C$12:$C$27,I$12:I$27,\"\",0,1))","v":""},{"$f":"IF($C60=\"\",\"\",_xlfn.XLOOKUP($C60,$C$12:$C$27,J$12:J$27,\"\",0,1))","v":""},{"$f":"IF($C60=\"\",\"\",_xlfn.XLOOKUP($C60,$C$12:$C$27,K$12:K$27,\"\",0,1))","v":""},{"$f":"IF($C60=\"\",\"\",_xlfn.XLOOKUP($C60,$C$12:$C$27,L$12:L$27,\"\",0,1))","v":""},"","","",""]
[null,"","","",{"$f":"IF(D61=\"\",\"\",_xlfn.XLOOKUP($C61,$C$33:$C$48,E$33:E$48,\"\",0,1))","v":""},"",{"$f":"IF($C61=\"\",\"\",_xlfn.XLOOKUP($C61,$C$12:$C$27,H$12:H$27,\"\",0,1))","v":""},{"$f":"IF($C61=\"\",\"\",_xlfn.XLOOKUP($C61,$C$12:$C$27,I$12:I$27,\"\",0,1))","v":""},{"$f":"IF($C61=\"\",\"\",_xlfn.XLOOKUP($C61,$C$12:$C$27,J$12:J$27,\"\",0,1))","v":""},{"$f":"IF($C61=\"\",\"\",_xlfn.XLOOKUP($C61,$C$12:$C$27,K$12:K$27,\"\",0,1))","v":""},{"$f":"IF($C61=\"\",\"\",_xlfn.XLOOKUP($C61,$C$12:$C$27,L$12:L$27,\"\",0,1))","v":""},"","","",""]
[null,"","","",{"$f":"IF(D62=\"\",\"\",_xlfn.XLOOKUP($C62,$C$33:$C$48,E$33:E$48,\"\",0,1))","v":""},"",{"$f":"IF($C62=\"\",\"\",_xlfn.XLOOKUP($C62,$C$12:$C$27,H$12:H$27,\"\",0,1))","v":""},{"$f":"IF($C62=\"\",\"\",_xlfn.XLOOKUP($C62,$C$12:$C$27,I$12:I$27,\"\",0,1))","v":""},{"$f":"IF($C62=\"\",\"\",_xlfn.XLOOKUP($C62,$C$12:$C$27,J$12:J$27,\"\",0,1))","v":""},{"$f":"IF($C62=\"\",\"\",_xlfn.XLOOKUP($C62,$C$12:$C$27,K$12:K$27,\"\",0,1))","v":""},{"$f":"IF($C62=\"\",\"\",_xlfn.XLOOKUP($C62,$C$12:$C$27,L$12:L$27,\"\",0,1))","v":""},"","","",""]
[null,"","","",{"$f":"IF(D63=\"\",\"\",_xlfn.XLOOKUP($C63,$C$33:$C$48,E$33:E$48,\"\",0,1))","v":""},"",{"$f":"IF($C63=\"\",\"\",_xlfn.XLOOKUP($C63,$C$12:$C$27,H$12:H$27,\"\",0,1))","v":""},{"$f":"IF($C63=\"\",\"\",_xlfn.XLOOKUP($C63,$C$12:$C$27,I$12:I$27,\"\",0,1))","v":""},{"$f":"IF($C63=\"\",\"\",_xlfn.XLOOKUP($C63,$C$12:$C$27,J$12:J$27,\"\",0,1))","v":""},{"$f":"IF($C63=\"\",\"\",_xlfn.XLOOKUP($C63,$C$12:$C$27,K$12:K$27,\"\",0,1))","v":""},{"$f":"IF($C63=\"\",\"\",_xlfn.XLOOKUP($C63,$C$12:$C$27,L$12:L$27,\"\",0,1))","v":""},"","","",""]
[null,"","","",{"$f":"IF(D64=\"\",\"\",_xlfn.XLOOKUP($C64,$C$33:$C$48,E$33:E$48,\"\",0,1))","v":""},"",{"$f":"IF($C64=\"\",\"\",_xlfn.XLOOKUP($C64,$C$12:$C$27,H$12:H$27,\"\",0,1))","v":""},{"$f":"IF($C64=\"\",\"\",_xlfn.XLOOKUP($C64,$C$12:$C$27,I$12:I$27,\"\",0,1))","v":""},{"$f":"IF($C64=\"\",\"\",_xlfn.XLOOKUP($C64,$C$12:$C$27,J$12:J$27,\"\",0,1))","v":""},{"$f":"IF($C64=\"\",\"\",_xlfn.XLOOKUP($C64,$C$12:$C$27,K$12:K$27,\"\",0,1))","v":""},{"$f":"IF($C64=\"\",\"\",_xlfn.XLOOKUP($C64,$C$12:$C$27,L$12:L$27,\"\",0,1))","v":""},"","","",""]
[null,"","","",{"$f":"IF(D65=\"\",\"\",_xlfn.XLOOKUP($C65,$C$33:$C$48,E$33:E$48,\"\",0,1))","v":""},"",{"$f":"IF($C65=\"\",\"\",_xlfn.XLOOKUP($C65,$C$12:$C$27,H$12:H$27,\"\",0,1))","v":""},{"$f":"IF($C65=\"\",\"\",_xlfn.XLOOKUP($C65,$C$12:$C$27,I$12:I$27,\"\",0,1))","v":""},{"$f":"IF($C65=\"\",\"\",_xlfn.XLOOKUP($C65,$C$12:$C$27,J$12:J$27,\"\",0,1))","v":""},{"$f":"IF($C65=\"\",\"\",_xlfn.XLOOKUP($C65,$C$12:$C$27,K$12:K$27,\"\",0,1))","v":""},{"$f":"IF($C65=\"\",\"\",_xlfn.XLOOKUP($C65,$C$12:$C$27,L$12:L$27,\"\",0,1))","v":""},"","","",""]
[null,"","","",{"$f":"IF(D66=\"\",\"\",_xlfn.XLOOKUP($C66,$C$33:$C$48,E$33:E$48,\"\",0,1))","v":""},"",{"$f":"IF($C66=\"\",\"\",_xlfn.XLOOKUP($C66,$C$12:$C$27,H$12:H$27,\"\",0,1))","v":""},{"$f":"IF($C66=\"\",\"\",_xlfn.XLOOKUP($C66,$C$12:$C$27,I$12:I$27,\"\",0,1))","v":""},{"$f":"IF($C66=\"\",\"\",_xlfn.XLOOKUP($C66,$C$12:$C$27,J$12:J$27,\"\",0,1))","v":""},{"$f":"IF($C66=\"\",\"\",_xlfn.XLOOKUP($C66,$C$12:$C$27,K$12:K$27,\"\",0,1))","v":""},{"$f":"IF($C66=\"\",\"\",_xlfn.XLOOKUP($C66,$C$12:$C$27,L$12:L$27,\"\",0,1))","v":""},"","","",""]
[null,"","","",{"$f":"IF(D67=\"\",\"\",_xlfn.XLOOKUP($C67,$C$33:$C$48,E$33:E$48,\"\",0,1))","v":""},"",{"$f":"IF($C67=\"\",\"\",_xlfn.XLOOKUP($C67,$C$12:$C$27,H$12:H$27,\"\",0,1))","v":""},{"$f":"IF($C67=\"\",\"\",_xlfn.XLOOKUP($C67,$C$12:$C$27,I$12:I$27,\"\",0,1))","v":""},{"$f":"IF($C67=\"\",\"\",_xlfn.XLOOKUP($C67,$C$12:$C$27,J$12:J$27,\"\",0,1))","v":""},{"$f":"IF($C67=\"\",\"\",_xlfn.XLOOKUP($C67,$C$12:$C$27,K$12:K$27,\"\",0,1))","v":""},{"$f":"IF($C67=\"\",\"\",_xlfn.XLOOKUP($C67,$C$12:$C$27,L$12:L$27,\"\",0,1))","v":""},"","","",""]
[null,"","","",{"$f":"IF(D68=\"\",\"\",_xlfn.XLOOKUP($C68,$C$33:$C$48,E$33:E$48,\"\",0,1))","v":""},"",{"$f":"IF($C68=\"\",\"\",_xlfn.XLOOKUP($C68,$C$12:$C$27,H$12:H$27,\"\",0,1))","v":""},{"$f":"IF($C68=\"\",\"\",_xlfn.XLOOKUP($C68,$C$12:$C$27,I$12:I$27,\"\",0,1))","v":""},{"$f":"IF($C68=\"\",\"\",_xlfn.XLOOKUP($C68,$C$12:$C$27,J$12:J$27,\"\",0,1))","v":""},{"$f":"IF($C68=\"\",\"\",_xlfn.XLOOKUP($C68,$C$12:$C$27,K$12:K$27,\"\",0,1))","v":""},{"$f":"IF($C68=\"\",\"\",_xlfn.XLOOKUP($C68,$C$12:$C$27,L$12:L$27,\"\",0,1))","v":""},"","","",""]
[null,"","","",{"$f":"IF(D69=\"\",\"\",_xlfn.XLOOKUP($C69,$C$33:$C$48,E$33:E$48,\"\",0,1))","v":""},"",{"$f":"IF($C69=\"\",\"\",_xlfn.XLOOKUP($C69,$C$12:$C$27,H$12:H$27,\"\",0,1))","v":""},{"$f":"IF($C69=\"\",\"\",_xlfn.XLOOKUP($C69,$C$12:$C$27,I$12:I$27,\"\",0,1))","v":""},{"$f":"IF($C69=\"\",\"\",_xlfn.XLOOKUP($C69,$C$12:$C$27,J$12:J$27,\"\",0,1))","v":""},{"$f":"IF($C69=\"\",\"\",_xlfn.XLOOKUP($C69,$C$12:$C$27,K$12:K$27,\"\",0,1))","v":""},{"$f":"IF($C69=\"\",\"\",_xlfn.XLOOKUP($C69,$C$12:$C$27,L$12:L$27,\"\",0,1))","v":""},"","","",""]

{"sheet":"K5-K8","index":1,"n_rows":72,"n_cols":18,"rows_kept":72,"cut":false,"hidden":false,"merged":[[8,7,8,11],[8,12,8,16]]}
[]
[null,null,null,null,{"$f":"+'K2'!E2","v":"Namsosrennet i hopp og kombinert 01.02.2026"}]
[]
[]
[null,null,null,null,{"$f":"\"K\"&F6","v":"K8"},null,"Åpen klasse"]
[null,null,null,null,"K-punkt:",8,"meter"]
[null,null,null,null,"Meterverdi:",{"$f":"VLOOKUP(F6,Meterverdier!A:B,2,FALSE)","v":5.2},"poeng/meter"]
[]
[null,null,null,null,null,null,null,"1. omgang",null,null,null,null,"2. omgang"]
[null,null,"Start-",null,null,"Hopp/",null,null,null,null,null,null,null,null,null,null,null,"Poeng"]
[null,"Plassering","nr.","Navn","Klubb","Komb","F.år","Lengde","A","B","C","Poeng","Lengde","A","B","C","Poeng","totalt"]
[null,{"$f":"IF(R12=\"\",\"\",RANK(R12,$R$12:$R$30,0)+COUNTIFS($R$12:R12,R12)-1)","v":8},108,"Ane Tranaas","Namsos IL Hopp","Komb","J5",null,null,null,null,{"$f":"IF(IH12=\"\",0,60+$F$7*(H12-$F$6)+SUM(I12:K12))","v":0},null,null,null,null,{"$f":"IF(M12=\"\",\"\",60+$F$7*(M12-$F$6)+SUM(N12:P12))","v":""},{"$f":"IF(AND(ISNUMBER(L12),ISNUMBER(Q12)),L12+Q12,0)","v":0}]
[null,{"$f":"IF(R13=\"\",\"\",RANK(R13,$R$12:$R$30,0)+COUNTIFS($R$12:R13,R13)-1)","v":3},112,"Katinka Tranaas","Namsos Idrettslag hopp","Komb","J7",5.5,null,null,null,{"$f":"IF(H13=\"\",0,60+$F$7*(H13-$F$6)+SUM(I13:K13))","v":47},6,null,null,null,{"$f":"IF(M13=\"\",\"\",60+$F$7*(M13-$F$6)+SUM(N13:P13))","v":49.6},{"$f":"IF(AND(ISNUMBER(L13),ISNUMBER(Q13)),L13+Q13,0)","v":96.6}]
[null,{"$f":"IF(R14=\"\",\"\",RANK(R14,$R$12:$R$30,0)+COUNTIFS($R$12:R14,R14)-1)","v":1},113,"Olivia Hanssen Otterbekk","Namsos Idrettslag hopp","Hopp","J9",6,null,null,null,{"$f":"IF(H14=\"\",0,60+$F$7*(H14-$F$6)+SUM(I14:K14))","v":49.6},6.5,null,null,null,{"$f":"IF(M14=\"\",\"\",60+$F$7*(M14-$F$6)+SUM(N14:P14))","v":52.2},{"$f":"IF(AND(ISNUMBER(L14),ISNUMBER(Q14)),L14+Q14,0)","v":101.80000000000001}]
[null,{"$f":"IF(R15=\"\",\"\",RANK(R15,$R$15:$R$15,0)+COUNTIFS($R$15:R15,R15)-1)","v":1},93,"Victoria Vøhn Fleischer","Skatval IL","Komb","J7",3.5,null,null,null,{"$f":"IF(H15=\"\",0,60+$F$7*(H15-$F$6)+SUM(I15:K15))","v":36.599999999999994},4,null,null,null,39.200000000000003,{"$f":"IF(AND(ISNUMBER(L15),ISNUMBER(Q15)),L15+Q15,0)","v":75.8}]
[null,{"$f":"IF(R16=\"\",\"\",RANK(R16,$R$16:$R$16,0)+COUNTIFS($R$16:R16,R16)-1)","v":1},91,"Enja Wesche Fossheim","Byåsen IL","Komb","J6",6,null,null,null,{"$f":"IF(H16=\"\",0,60+'K 10'!$F$7*(H16-'K 10'!$F$6)+SUM(I16:K16))","v":39.200000000000003},6.5,null,null,null,52.2,{"$f":"IF(AND(ISNUMBER(L16),ISNUMBER(Q16)),L16+Q16,0)","v":91.4}]
[null,{"$f":"IF(R17=\"\",\"\",RANK(R17,$R$17:$R$17,0)+COUNTIFS($R$17:R17,R17)-1)","v":1},92,"Even Krog","Byåsen IL","Komb","G6",6.5,null,null,null,{"$f":"IF(H17=\"\",0,60+'K 10'!$F$7*(H17-'K 10'!$F$6)+SUM(I17:K17))","v":41.8},7.5,null,null,null,57.4,{"$f":"IF(AND(ISNUMBER(L17),ISNUMBER(Q17)),L17+Q17,0)","v":99.199999999999989}]
[null,{"$f":"IF(R18=\"\",\"\",RANK(R18,$R$18:$R$18,0)+COUNTIFS($R$18:R18,R18)-1)","v":1},96,"Maja Hanem Bartnes","Ogndal IL","Komb","J9",4,null,null,null,{"$f":"IF(H18=\"\",0,60+'K 10'!$F$7*(H18-'K 10'!$F$6)+SUM(I18:K18))","v":28.799999999999997},4,null,null,null,39.200000000000003,{"$f":"IF(AND(ISNUMBER(L18),ISNUMBER(Q18)),L18+Q18,0)","v":68}]
[null,{"$f":"IF(R19=\"\",\"\",RANK(R19,$R$19:$R$19,0)+COUNTIFS($R$19:R19,R19)-1)","v":1},97,"Vilde Fredagsvik-Johansen","Skogn IL","Komb","J9",5,null,null,null,{"$f":"IF(H19=\"\",0,60+'K 10'!$F$7*(H19-'K 10'!$F$6)+SUM(I19:K19))","v":34},6,null,null,null,49.6,{"$f":"IF(AND(ISNUMBER(L19),ISNUMBER(Q19)),L19+Q19,0)","v":83.6}]
[null,{"$f":"IF(R20=\"\",\"\",RANK(R20,$R$12:$R$30,0)+COUNTIFS($R$12:R20,R20)-1)","v":9},115,null,null,null,null,null,null,null,null,{"$f":"IF(H20=\"\",0,60+$F$7*(H20-$F$6)+SUM(I20:K20))","v":0},null,null,null,null,{"$f":"IF(M20=\"\",\"\",60+$F$7*(M20-$F$6)+SUM(N20:P20))","v":""},{"$f":"IF(AND(ISNUMBER(L20),ISNUMBER(Q20)),L20+Q20,0)","v":0}]
[null,{"$f":"IF(R21=\"\",\"\",RANK(R21,$R$12:$R$30,0)+COUNTIFS($R$12:R21,R21)-1)","v":10},116,null,null,null,null,null,null,null,null,{"$f":"IF(H21=\"\",0,60+$F$7*(H21-$F$6)+SUM(I21:K21))","v":0},null,null,null,null,{"$f":"IF(M21=\"\",\"\",60+$F$7*(M21-$F$6)+SUM(N21:P21))","v":""},{"$f":"IF(AND(ISNUMBER(L21),ISNUMBER(Q21)),L21+Q21,0)","v":0}]
[null,{"$f":"IF(R22=\"\",\"\",RANK(R22,$R$12:$R$30,0)+COUNTIFS($R$12:R22,R22)-1)","v":11},null,null,null,null,null,null,null,null,null,{"$f":"IF(H22=\"\",0,60+$F$7*(H22-$F$6)+SUM(I22:K22))","v":0},null,null,null,null,{"$f":"IF(M22=\"\",\"\",60+$F$7*(M22-$F$6)+SUM(N22:P22))","v":""},{"$f":"IF(AND(ISNUMBER(L22),ISNUMBER(Q22)),L22+Q22,0)","v":0}]
[null,{"$f":"IF(R23=\"\",\"\",RANK(R23,$R$12:$R$30,0)+COUNTIFS($R$12:R23,R23)-1)","v":12},null,null,null,null,null,null,null,null,null,{"$f":"IF(H23=\"\",0,60+$F$7*(H23-$F$6)+SUM(I23:K23))","v":0},null,null,null,null,{"$f":"IF(M23=\"\",\"\",60+$F$7*(M23-$F$6)+SUM(N23:P23))","v":""},{"$f":"IF(AND(ISNUMBER(L23),ISNUMBER(Q23)),L23+Q23,0)","v":0}]
[null,{"$f":"IF(R24=\"\",\"\",RANK(R24,$R$12:$R$30,0)+COUNTIFS($R$12:R24,R24)-1)","v":13},null,null,null,null,null,null,null,null,null,{"$f":"IF(H24=\"\",0,60+$F$7*(H24-$F$6)+SUM(I24:K24))","v":0},null,null,null,null,{"$f":"IF(M24=\"\",\"\",60+$F$7*(M24-$F$6)+SUM(N24:P24))","v":""},{"$f":"IF(AND(ISNUMBER(L24),ISNUMBER(Q24)),L24+Q24,0)","v":0}]
[null,{"$f":"IF(R25=\"\",\"\",RANK(R25,$R$12:$R$30,0)+COUNTIFS($R$12:R25,R25)-1)","v":14},null,null,null,null,null,null,null,null,null,{"$f":"IF(H25=\"\",0,60+$F$7*(H25-$F$6)+SUM(I25:K25))","v":0},null,null,null,null,{"$f":"IF(M25=\"\",\"\",60+$F$7*(M25-$F$6)+SUM(N25:P25))","v":""},{"$f":"IF(AND(ISNUMBER(L25),ISNUMBER(Q25)),L25+Q25,0)","v":0}]
[null,{"$f":"IF(R26=\"\",\"\",RANK(R26,$R$12:$R$30,0)+COUNTIFS($R$12:R26,R26)-1)","v":15},null,null,null,null,null,null,null,null,null,{"$f":"IF(H26=\"\",0,60+$F$7*(H26-$F$6)+SUM(I26:K26))","v":0},null,null,null,null,{"$f":"IF(M26=\"\",\"\",60+$F$7*(M26-$F$6)+SUM(N26:P26))","v":""},{"$f":"IF(AND(ISNUMBER(L26),ISNUMBER(Q26)),L26+Q26,0)","v":0}]
[null,{"$f":"IF(R27=\"\",\"\",RANK(R27,$R$12:$R$30,0)+COUNTIFS($R$12:R27,R27)-1)","v":16},null,null,null,null,null,null,null,null,null,{"$f":"IF(H27=\"\",0,60+$F$7*(H27-$F$6)+SUM(I27:K27))","v":0},null,null,null,null,{"$f":"IF(M27=\"\",\"\",60+$F$7*(M27-$F$6)+SUM(N27:P27))","v":""},{"$f":"IF(AND(ISNUMBER(L27),ISNUMBER(Q27)),L27+Q27,0)","v":0}]
[null,{"$f":"IF(R28=\"\",\"\",RANK(R28,$R$12:$R$30,0)+COUNTIFS($R$12:R28,R28)-1)","v":17},null,null,null,null,null,null,null,null,null,{"$f":"IF(H28=\"\",0,60+$F$7*(H28-$F$6)+SUM(I28:K28))","v":0},null,null,null,null,{"$f":"IF(M28=\"\",\"\",60+$F$7*(M28-$F$6)+SUM(N28:P28))","v":""},{"$f":"IF(AND(ISNUMBER(L28),ISNUMBER(Q28)),L28+Q28,0)","v":0}]
[null,{"$f":"IF(R29=\"\",\"\",RANK(R29,$R$12:$R$30,0)+COUNTIFS($R$12:R29,R29)-1)","v":18},null,null,null,null,null,null,null,null,null,{"$f":"IF(H29=\"\",0,60+$F$7*(H29-$F$6)+SUM(I29:K29))","v":0},null,null,null,null,{"$f":"IF(M29=\"\",\"\",60+$F$7*(M29-$F$6)+SUM(N29:P29))","v":""},{"$f":"IF(AND(ISNUMBER(L29),ISNUMBER(Q29)),L29+Q29,0)","v":0}]
[null,{"$f":"IF(R30=\"\",\"\",RANK(R30,$R$12:$R$30,0)+COUNTIFS($R$12:R30,R30)-1)","v":19},null,null,null,null,null,null,null,null,null,{"$f":"IF(H30=\"\",0,60+$F$7*(H30-$F$6)+SUM(I30:K30))","v":0},null,null,null,null,{"$f":"IF(M30=\"\",\"\",60+$F$7*(M30-$F$6)+SUM(N30:P30))","v":""},{"$f":"IF(AND(ISNUMBER(L30),ISNUMBER(Q30)),L30+Q30,0)","v":0}]
[null,null,null,null,null,null,null,null,null,null,{"$f":"IF(G31=\"\",\"\",60+$F$7*(G31-$F$6)+SUM(H31:J31))","v":""},null,null,null,null,{"$f":"IF(L31=\"\",\"\",60+$F$7*(L31-$F$6)+SUM(M31:O31))","v":""},{"$f":"IF(AND(ISNUMBER(K31),ISNUMBER(P31)),K31+P31,\"\")","v":""}]
[]
[null,null,null,null,"Startliste kombinert - individuell kompakt"]
[]
[null,"Plass. Hopp\n 1. omg","Start nr.","Navn","Klubb","F.år","Poeng hopp","Start tid","Tid i mål\nMM:SS,T",null,null,"Plassering"]
[null,{"$f":"IF(COUNTIF($F$12:$F$32,\"Komb\")>0,1,\"\")","v":1},{"$f":"_xlfn._xlws.SORT(_xlfn.HSTACK(_xlfn._xlws.FILTER($C$12:$E$32,$F$12:$F$32=\"Komb\",$L$12:$L$32>0),_xlfn._xlws.FILTER($G$12:$G$32,$F$12:$F$32=\"Komb\",$L$12:$L$32>0),_xlfn._xlws.FILTER($L$12:$L$32,$F$12:$F$32=\"Komb\",$L$12:$L$32>0)),5,-1)","v":112},"Katinka Tranaas","Namsos Idrettslag hopp","J7",47,{"$f":"TIME(0,0,0)","v":"00:00:00"},null,null,null,{"$f":"IF(C36=\"\",\"\",RANK(I36,$I$36:$I$51,1)+COUNTIF($I36:I$36,I36)-1)","v":{"$error":"#N/A"}}]
[null,{"$f":"IFERROR(IF(B36+1>COUNTIF($F$12:$F$32,\"Komb\"),\"\",B36+1),\"\")","v":2},92,"Even Krog","Byåsen IL","G6",41.8,{"$f":"IF(B37=\"\",\"\",H36+TIME(0,0,6))","v":"00:00:06"},null,null,null,{"$f":"IF(C37=\"\",\"\",RANK(I37,$I$36:$I$51,1)+COUNTIF($I$36:I37,I37)-1)","v":{"$error":"#N/A"}}]
[null,{"$f":"IFERROR(IF(B37+1>COUNTIF($F$12:$F$32,\"Komb\"),\"\",B37+1),\"\")","v":3},91,"Enja Wesche Fossheim","Byåsen IL","J6",39.200000000000003,{"$f":"IF(B38=\"\",\"\",H37+TIME(0,0,6))","v":"00:00:12"},null,null,null,{"$f":"IF(C38=\"\",\"\",RANK(I38,$I$36:$I$51,1)+COUNTIF($I$36:I38,I38)-1)","v":{"$error":"#N/A"}}]
[null,{"$f":"IFERROR(IF(B38+1>COUNTIF($F$12:$F$32,\"Komb\"),\"\",B38+1),\"\")","v":4},93,"Victoria Vøhn Fleischer","Skatval IL","J7",36.599999999999994,{"$f":"IF(B39=\"\",\"\",H38+TIME(0,0,6))","v":"00:00:18"},null,null,null,{"$f":"IF(C39=\"\",\"\",RANK(I39,$I$36:$I$51,1)+COUNTIF($I$36:I39,I39)-1)","v":{"$error":"#N/A"}}]
[null,{"$f":"IFERROR(IF(B39+1>COUNTIF($F$12:$F$32,\"Komb\"),\"\",B39+1),\"\")","v":5},97,"Vilde Fredagsvik-Johansen","Skogn IL","J9",34,{"$f":"IF(B40=\"\",\"\",H39+TIME(0,0,6))","v":"00:00:24"},null,null,null,{"$f":"IF(C40=\"\",\"\",RANK(I40,$I$36:$I$51,1)+COUNTIF($I$36:I40,I40)-1)","v":{"$error":"#N/A"}}]
[null,{"$f":"IFERROR(IF(B40+1>COUNTIF($F$12:$F$32,\"Komb\"),\"\",B40+1),\"\")","v":6},96,"Maja Hanem Bartnes","Ogndal IL","J9",28.799999999999997,{"$f":"IF(B41=\"\",\"\",H40+TIME(0,0,6))","v":"00:00:30"},null,null,null,{"$f":"IF(C41=\"\",\"\",RANK(I41,$I$36:$I$51,1)+COUNTIF($I$36:I41,I41)-1)","v":{"$error":"#N/A"}}]
[null,{"$f":"IFERROR(IF(B41+1>COUNTIF($F$12:$F$32,\"Komb\"),\"\",B41+1),\"\")","v":7},108,"Ane Tranaas","Namsos IL Hopp","J5",0,{"$f":"IF(B42=\"\",\"\",H41+TIME(0,0,6))","v":"00:00:36"},null,null,null,{"$f":"IF(C42=\"\",\"\",RANK(I42,$I$36:$I$51,1)+COUNTIF($I$36:I42,I42)-1)","v":{"$error":"#N/A"}}]
[null,{"$f":"IFERROR(IF(B42+1>COUNTIF($F$12:$F$32,\"Komb\"),\"\",B42+1),\"\")","v":""},null,null,null,null,null,{"$f":"IF(B43=\"\",\"\",H42+TIME(0,0,6))","v":""},null,null,null,{"$f":"IF(C43=\"\",\"\",RANK(I43,$I$36:$I$51,1)+COUNTIF($I$36:I43,I43)-1)","v":""}]
[null,{"$f":"IFERROR(IF(B43+1>COUNTIF($F$12:$F$32,\"Komb\"),\"\",B43+1),\"\")","v":""},null,null,null,null,null,{"$f":"IF(B44=\"\",\"\",H43+TIME(0,0,6))","v":""},null,null,null,{"$f":"IF(C44=\"\",\"\",RANK(I44,$I$36:$I$51,1)+COUNTIF($I$36:I44,I44)-1)","v":""}]
[null,{"$f":"IFERROR(IF(B44+1>COUNTIF($F$12:$F$32,\"Komb\"),\"\",B44+1),\"\")","v":""},null,null,null,null,null,{"$f":"IF(B45=\"\",\"\",H44+TIME(0,0,6))","v":""},null,null,null,{"$f":"IF(C45=\"\",\"\",RANK(I45,$I$36:$I$51,1)+COUNTIF($I$36:I45,I45)-1)","v":""}]
[null,{"$f":"IFERROR(IF(B45+1>COUNTIF($F$12:$F$32,\"Komb\"),\"\",B45+1),\"\")","v":""},null,null,null,null,null,{"$f":"IF(B46=\"\",\"\",H45+TIME(0,0,6))","v":""},null,null,null,{"$f":"IF(C46=\"\",\"\",RANK(I46,$I$36:$I$51,1)+COUNTIF($I$36:I46,I46)-1)","v":""}]
[null,{"$f":"IFERROR(IF(B46+1>COUNTIF($F$12:$F$32,\"Komb\"),\"\",B46+1),\"\")","v":""},null,null,null,null,null,{"$f":"IF(B47=\"\",\"\",H46+TIME(0,0,6))","v":""},null,null,null,{"$f":"IF(C47=\"\",\"\",RANK(I47,$I$36:$I$51,1)+COUNTIF($I$36:I47,I47)-1)","v":""}]
[null,{"$f":"IFERROR(IF(B47+1>COUNTIF($F$12:$F$32,\"Komb\"),\"\",B47+1),\"\")","v":""},null,null,null,null,null,{"$f":"IF(B48=\"\",\"\",H47+TIME(0,0,6))","v":""},null,null,null,{"$f":"IF(C48=\"\",\"\",RANK(I48,$I$36:$I$51,1)+COUNTIF($I$36:I48,I48)-1)","v":""}]
[null,{"$f":"IFERROR(IF(B48+1>COUNTIF($F$12:$F$32,\"Komb\"),\"\",B48+1),\"\")","v":""},null,null,null,null,null,{"$f":"IF(B49=\"\",\"\",H48+TIME(0,0,6))","v":""},null,null,null,{"$f":"IF(C49=\"\",\"\",RANK(I49,$I$36:$I$51,1)+COUNTIF($I$36:I49,I49)-1)","v":""}]
[null,{"$f":"IFERROR(IF(B49+1>COUNTIF($F$12:$F$32,\"Komb\"),\"\",B49+1),\"\")","v":""},null,null,null,null,null,{"$f":"IF(B50=\"\",\"\",H49+TIME(0,0,6))","v":""},null,null,null,{"$f":"IF(C50=\"\",\"\",RANK(I50,$I$36:$I$51,1)+COUNTIF($I$36:I50,I50)-1)","v":""}]
[null,{"$f":"IFERROR(IF(B50+1>COUNTIF($F$12:$F$32,\"Komb\"),\"\",B50+1),\"\")","v":""},null,null,null,null,null,{"$f":"IF(B51=\"\",\"\",H50+TIME(0,0,6))","v":""},null,null,null,{"$f":"IF(C51=\"\",\"\",RANK(I51,$I$36:$I$51,1)+COUNTIF($I$36:I51,I51)-1)","v":""}]
[]
[]
[null,null,null,null,"Resultatliste kombinert - individuell kompakt"]
[]
[null,"Plass","Start nr.","Navn","Klubb","F.år","Lengde","A","B","C","Poeng\nHopp","Starttid\nlangrenn","Tid\nlangr",null,"Tid i mål"]
[null,{"$f":"IF(COUNT($I$36:$I$51)>0,1,\"\")","v":""},{"$f":"IF(B57=\"\",\"\",_xlfn.XLOOKUP($B57,$L$36:$L$51,$C$36:$C$51,\"\",0,1))","v":""},{"$f":"IF(C57=\"\",\"\",_xlfn.XLOOKUP($C57,$C$36:$C$51,D$36:D$51,\"\",0,1))","v":""},{"$f":"IF(D57=\"\",\"\",_xlfn.XLOOKUP($C57,$C$36:$C$51,E$36:E$51,\"\",0,1))","v":""},"",{"$f":"IF($C57=\"\",\"\",_xlfn.XLOOKUP($C57,$C$12:$C$30,H$12:H$30,\"\",0,1))","v":""},{"$f":"IF($C57=\"\",\"\",_xlfn.XLOOKUP($C57,$C$12:$C$30,I$12:I$30,\"\",0,1))","v":""},{"$f":"IF($C57=\"\",\"\",_xlfn.XLOOKUP($C57,$C$12:$C$30,J$12:J$30,\"\",0,1))","v":""},{"$f":"IF($C57=\"\",\"\",_xlfn.XLOOKUP($C57,$C$12:$C$30,K$12:K$30,\"\",0,1))","v":""},{"$f":"IF($C57=\"\",\"\",_xlfn.XLOOKUP($C57,$C$12:$C$30,L$12:L$30,\"\",0,1))","v":""},{"$f":"_xlfn.XLOOKUP(C57,$C$35:$C$51,$H$35:$H$51,\"\",0,1)","v":""},{"$f":"IF(C57=\"\",\"\",_xlfn.XLOOKUP(C57,$C$35:$C$51,$I$35:$I$51,\"\",0,1)-L57)","v":""},null,{"$f":"VLOOKUP(C57,C36:I51,7,FALSE)","v":{"$error":"#N/A"}}]
[null,{"$f":"IFERROR(IF(B57+1>COUNT($I$36:$I$51),\"\",B57+1),\"\")","v":""},{"$f":"IF(B58=\"\",\"\",_xlfn.XLOOKUP($B58,$L$36:$L$51,$C$36:$C$51,\"\",0,1))","v":""},"","","",{"$f":"IF($C58=\"\",\"\",_xlfn.XLOOKUP($C58,$C$12:$C$30,H$12:H$30,\"\",0,1))","v":""},{"$f":"IF($C58=\"\",\"\",_xlfn.XLOOKUP($C58,$C$12:$C$30,I$12:I$30,\"\",0,1))","v":""},{"$f":"IF($C58=\"\",\"\",_xlfn.XLOOKUP($C58,$C$12:$C$30,J$12:J$30,\"\",0,1))","v":""},{"$f":"IF($C58=\"\",\"\",_xlfn.XLOOKUP($C58,$C$12:$C$30,K$12:K$30,\"\",0,1))","v":""},{"$f":"IF($C58=\"\",\"\",_xlfn.XLOOKUP($C58,$C$12:$C$30,L$12:L$30,\"\",0,1))","v":""},{"$f":"_xlfn.XLOOKUP(C58,$C$35:$C$51,$H$35:$H$51,\"\",0,1)","v":""},{"$f":"IF(C58=\"\",\"\",_xlfn.XLOOKUP(C58,$C$35:$C$51,$I$35:$I$51,\"\",0,1)-L58)","v":""},{"$f":"IF(C58=\"\",\"\",\"+\")","v":""},{"$f":"IF(C58=\"\",\"\",VLOOKUP($C58,$C$36:$I$51,7,0)-VLOOKUP($C$57,$C$36:$I$51,7,0))","v":""}]
[null,{"$f":"IFERROR(IF(B58+1>COUNT($I$36:$I$51),\"\",B58+1),\"\")","v":""},"","","","",{"$f":"IF($C59=\"\",\"\",_xlfn.XLOOKUP($C59,$C$12:$C$30,H$12:H$30,\"\",0,1))","v":""},{"$f":"IF($C59=\"\",\"\",_xlfn.XLOOKUP($C59,$C$12:$C$30,I$12:I$30,\"\",0,1))","v":""},{"$f":"IF($C59=\"\",\"\",_xlfn.XLOOKUP($C59,$C$12:$C$30,J$12:J$30,\"\",0,1))","v":""},{"$f":"IF($C59=\"\",\"\",_xlfn.XLOOKUP($C59,$C$12:$C$30,K$12:K$30,\"\",0,1))","v":""},{"$f":"IF($C59=\"\",\"\",_xlfn.XLOOKUP($C59,$C$12:$C$30,L$12:L$30,\"\",0,1))","v":""},"","","",{"$f":"IF(C59=\"\",\"\",VLOOKUP($C59,$C$36:$I$51,7,0)-VLOOKUP($C$57,$C$36:$I$51,7,0))","v":""}]
[null,"","","","","",{"$f":"IF($C60=\"\",\"\",_xlfn.XLOOKUP($C60,$C$12:$C$30,H$12:H$30,\"\",0,1))","v":""},{"$f":"IF($C60=\"\",\"\",_xlfn.XLOOKUP($C60,$C$12:$C$30,I$12:I$30,\"\",0,1))","v":""},{"$f":"IF($C60=\"\",\"\",_xlfn.XLOOKUP($C60,$C$12:$C$30,J$12:J$30,\"\",0,1))","v":""},{"$f":"IF($C60=\"\",\"\",_xlfn.XLOOKUP($C60,$C$12:$C$30,K$12:K$30,\"\",0,1))","v":""},{"$f":"IF($C60=\"\",\"\",_xlfn.XLOOKUP($C60,$C$12:$C$30,L$12:L$30,\"\",0,1))","v":""},"","","",""]
[null,"","","","","",{"$f":"IF($C61=\"\",\"\",_xlfn.XLOOKUP($C61,$C$12:$C$30,H$12:H$30,\"\",0,1))","v":""},{"$f":"IF($C61=\"\",\"\",_xlfn.XLOOKUP($C61,$C$12:$C$30,I$12:I$30,\"\",0,1))","v":""},{"$f":"IF($C61=\"\",\"\",_xlfn.XLOOKUP($C61,$C$12:$C$30,J$12:J$30,\"\",0,1))","v":""},{"$f":"IF($C61=\"\",\"\",_xlfn.XLOOKUP($C61,$C$12:$C$30,K$12:K$30,\"\",0,1))","v":""},{"$f":"IF($C61=\"\",\"\",_xlfn.XLOOKUP($C61,$C$12:$C$30,L$12:L$30,\"\",0,1))","v":""},"","","",""]
[null,"","","","","",{"$f":"IF($C62=\"\",\"\",_xlfn.XLOOKUP($C62,$C$12:$C$30,H$12:H$30,\"\",0,1))","v":""},{"$f":"IF($C62=\"\",\"\",_xlfn.XLOOKUP($C62,$C$12:$C$30,I$12:I$30,\"\",0,1))","v":""},{"$f":"IF($C62=\"\",\"\",_xlfn.XLOOKUP($C62,$C$12:$C$30,J$12:J$30,\"\",0,1))","v":""},{"$f":"IF($C62=\"\",\"\",_xlfn.XLOOKUP($C62,$C$12:$C$30,K$12:K$30,\"\",0,1))","v":""},{"$f":"IF($C62=\"\",\"\",_xlfn.XLOOKUP($C62,$C$12:$C$30,L$12:L$30,\"\",0,1))","v":""},"","","",""]
[null,"","","","","",{"$f":"IF($C63=\"\",\"\",_xlfn.XLOOKUP($C63,$C$12:$C$30,H$12:H$30,\"\",0,1))","v":""},{"$f":"IF($C63=\"\",\"\",_xlfn.XLOOKUP($C63,$C$12:$C$30,I$12:I$30,\"\",0,1))","v":""},{"$f":"IF($C63=\"\",\"\",_xlfn.XLOOKUP($C63,$C$12:$C$30,J$12:J$30,\"\",0,1))","v":""},{"$f":"IF($C63=\"\",\"\",_xlfn.XLOOKUP($C63,$C$12:$C$30,K$12:K$30,\"\",0,1))","v":""},{"$f":"IF($C63=\"\",\"\",_xlfn.XLOOKUP($C63,$C$12:$C$30,L$12:L$30,\"\",0,1))","v":""},"","","",""]
[null,"","","","","",{"$f":"IF($C64=\"\",\"\",_xlfn.XLOOKUP($C64,$C$12:$C$30,H$12:H$30,\"\",0,1))","v":""},{"$f":"IF($C64=\"\",\"\",_xlfn.XLOOKUP($C64,$C$12:$C$30,I$12:I$30,\"\",0,1))","v":""},{"$f":"IF($C64=\"\",\"\",_xlfn.XLOOKUP($C64,$C$12:$C$30,J$12:J$30,\"\",0,1))","v":""},{"$f":"IF($C64=\"\",\"\",_xlfn.XLOOKUP($C64,$C$12:$C$30,K$12:K$30,\"\",0,1))","v":""},{"$f":"IF($C64=\"\",\"\",_xlfn.XLOOKUP($C64,$C$12:$C$30,L$12:L$30,\"\",0,1))","v":""},"","","",""]
[null,"","","","","",{"$f":"IF($C65=\"\",\"\",_xlfn.XLOOKUP($C65,$C$12:$C$30,H$12:H$30,\"\",0,1))","v":""},{"$f":"IF($C65=\"\",\"\",_xlfn.XLOOKUP($C65,$C$12:$C$30,I$12:I$30,\"\",0,1))","v":""},{"$f":"IF($C65=\"\",\"\",_xlfn.XLOOKUP($C65,$C$12:$C$30,J$12:J$30,\"\",0,1))","v":""},{"$f":"IF($C65=\"\",\"\",_xlfn.XLOOKUP($C65,$C$12:$C$30,K$12:K$30,\"\",0,1))","v":""},{"$f":"IF($C65=\"\",\"\",_xlfn.XLOOKUP($C65,$C$12:$C$30,L$12:L$30,\"\",0,1))","v":""},"","","",""]
[null,"","","","","",{"$f":"IF($C66=\"\",\"\",_xlfn.XLOOKUP($C66,$C$12:$C$30,H$12:H$30,\"\",0,1))","v":""},{"$f":"IF($C66=\"\",\"\",_xlfn.XLOOKUP($C66,$C$12:$C$30,I$12:I$30,\"\",0,1))","v":""},{"$f":"IF($C66=\"\",\"\",_xlfn.XLOOKUP($C66,$C$12:$C$30,J$12:J$30,\"\",0,1))","v":""},{"$f":"IF($C66=\"\",\"\",_xlfn.XLOOKUP($C66,$C$12:$C$30,K$12:K$30,\"\",0,1))","v":""},{"$f":"IF($C66=\"\",\"\",_xlfn.XLOOKUP($C66,$C$12:$C$30,L$12:L$30,\"\",0,1))","v":""},"","","",""]
[null,"","","","","",{"$f":"IF($C67=\"\",\"\",_xlfn.XLOOKUP($C67,$C$12:$C$30,H$12:H$30,\"\",0,1))","v":""},{"$f":"IF($C67=\"\",\"\",_xlfn.XLOOKUP($C67,$C$12:$C$30,I$12:I$30,\"\",0,1))","v":""},{"$f":"IF($C67=\"\",\"\",_xlfn.XLOOKUP($C67,$C$12:$C$30,J$12:J$30,\"\",0,1))","v":""},{"$f":"IF($C67=\"\",\"\",_xlfn.XLOOKUP($C67,$C$12:$C$30,K$12:K$30,\"\",0,1))","v":""},{"$f":"IF($C67=\"\",\"\",_xlfn.XLOOKUP($C67,$C$12:$C$30,L$12:L$30,\"\",0,1))","v":""},"","","",""]
[null,"","","","","",{"$f":"IF($C68=\"\",\"\",_xlfn.XLOOKUP($C68,$C$12:$C$30,H$12:H$30,\"\",0,1))","v":""},{"$f":"IF($C68=\"\",\"\",_xlfn.XLOOKUP($C68,$C$12:$C$30,I$12:I$30,\"\",0,1))","v":""},{"$f":"IF($C68=\"\",\"\",_xlfn.XLOOKUP($C68,$C$12:$C$30,J$12:J$30,\"\",0,1))","v":""},{"$f":"IF($C68=\"\",\"\",_xlfn.XLOOKUP($C68,$C$12:$C$30,K$12:K$30,\"\",0,1))","v":""},{"$f":"IF($C68=\"\",\"\",_xlfn.XLOOKUP($C68,$C$12:$C$30,L$12:L$30,\"\",0,1))","v":""},"","","",""]
[null,"","","","","",{"$f":"IF($C69=\"\",\"\",_xlfn.XLOOKUP($C69,$C$12:$C$30,H$12:H$30,\"\",0,1))","v":""},{"$f":"IF($C69=\"\",\"\",_xlfn.XLOOKUP($C69,$C$12:$C$30,I$12:I$30,\"\",0,1))","v":""},{"$f":"IF($C69=\"\",\"\",_xlfn.XLOOKUP($C69,$C$12:$C$30,J$12:J$30,\"\",0,1))","v":""},{"$f":"IF($C69=\"\",\"\",_xlfn.XLOOKUP($C69,$C$12:$C$30,K$12:K$30,\"\",0,1))","v":""},{"$f":"IF($C69=\"\",\"\",_xlfn.XLOOKUP($C69,$C$12:$C$30,L$12:L$30,\"\",0,1))","v":""},"","","",""]
[null,"","","","","",{"$f":"IF($C70=\"\",\"\",_xlfn.XLOOKUP($C70,$C$12:$C$30,H$12:H$30,\"\",0,1))","v":""},{"$f":"IF($C70=\"\",\"\",_xlfn.XLOOKUP($C70,$C$12:$C$30,I$12:I$30,\"\",0,1))","v":""},{"$f":"IF($C70=\"\",\"\",_xlfn.XLOOKUP($C70,$C$12:$C$30,J$12:J$30,\"\",0,1))","v":""},{"$f":"IF($C70=\"\",\"\",_xlfn.XLOOKUP($C70,$C$12:$C$30,K$12:K$30,\"\",0,1))","v":""},{"$f":"IF($C70=\"\",\"\",_xlfn.XLOOKUP($C70,$C$12:$C$30,L$12:L$30,\"\",0,1))","v":""},"","","",""]
[null,"","","","","",{"$f":"IF($C71=\"\",\"\",_xlfn.XLOOKUP($C71,$C$12:$C$30,H$12:H$30,\"\",0,1))","v":""},{"$f":"IF($C71=\"\",\"\",_xlfn.XLOOKUP($C71,$C$12:$C$30,I$12:I$30,\"\",0,1))","v":""},{"$f":"IF($C71=\"\",\"\",_xlfn.XLOOKUP($C71,$C$12:$C$30,J$12:J$30,\"\",0,1))","v":""},{"$f":"IF($C71=\"\",\"\",_xlfn.XLOOKUP($C71,$C$12:$C$30,K$12:K$30,\"\",0,1))","v":""},{"$f":"IF($C71=\"\",\"\",_xlfn.XLOOKUP($C71,$C$12:$C$30,L$12:L$30,\"\",0,1))","v":""},"","","",""]
[null,"","","","","",{"$f":"IF($C72=\"\",\"\",_xlfn.XLOOKUP($C72,$C$12:$C$30,H$12:H$30,\"\",0,1))","v":""},{"$f":"IF($C72=\"\",\"\",_xlfn.XLOOKUP($C72,$C$12:$C$30,I$12:I$30,\"\",0,1))","v":""},{"$f":"IF($C72=\"\",\"\",_xlfn.XLOOKUP($C72,$C$12:$C$30,J$12:J$30,\"\",0,1))","v":""},{"$f":"IF($C72=\"\",\"\",_xlfn.XLOOKUP($C72,$C$12:$C$30,K$12:K$30,\"\",0,1))","v":""},{"$f":"IF($C72=\"\",\"\",_xlfn.XLOOKUP($C72,$C$12:$C$30,L$12:L$30,\"\",0,1))","v":""},"","","",""]

{"sheet":"K 10","index":2,"n_rows":68,"n_cols":18,"rows_kept":68,"cut":false,"hidden":false,"merged":[[8,7,8,11],[8,12,8,16]]}
[]
[null,null,null,null,{"$f":"+'K2'!E2","v":"Namsosrennet i hopp og kombinert 01.02.2026"}]
[]
[]
[null,null,null,null,{"$f":"\"K\"&F6","v":"K10"},null,"Åpen klasse"]
[null,null,null,null,"K-punkt:",10,"meter"]
[null,null,null,null,"Meterverdi:",5.2,"poeng/meter"]
[]
[null,null,null,null,null,null,null,"1. omgang",null,null,null,null,"2. omgang"]
[null,null,"Start-",null,null,"Hopp/",null,null,null,null,null,null,null,null,null,null,null,"Poeng"]
[null,"Plassering","nr.","Navn","Klubb","Komb","F.år","Lengde","A","B","C","Poeng","Lengde","A","B","C","Poeng","totalt"]
[null,{"$f":"IF(R12=\"\",\"\",RANK(R12,$R$12:$R$26,0)+COUNTIFS($R$12:R12,R12)-1)","v":""}]
[null,{"$f":"IF(R13=\"\",\"\",RANK(R13,$R$12:$R$26,0)+COUNTIFS($R$12:R13,R13)-1)","v":3},94,"Trygve Sæther","Namsos IL Hopp","Hopp","G7",3,null,null,null,{"$f":"IF(H13=\"\",0,60+$F$7*(H13-$F$6)+SUM(I13:K13))","v":23.6},4,null,null,null,{"$f":"IF(M13=\"\",\"\",60+$F$7*(M13-$F$6)+SUM(N13:P13))","v":28.799999999999997},{"$f":"IF(AND(ISNUMBER(L13),ISNUMBER(Q13)),L13+Q13,0)","v":52.4}]
[null,{"$f":"IF(R14=\"\",\"\",RANK(R14,$R$12:$R$26,0)+COUNTIFS($R$12:R14,R14)-1)","v":1},95,"Sigve Olai Bolås","Ogndal IL","Komb","G8",4,null,null,null,{"$f":"IF(H14=\"\",0,60+$F$7*(H14-$F$6)+SUM(I14:K14))","v":28.799999999999997},4.5,null,null,null,{"$f":"IF(M14=\"\",\"\",60+$F$7*(M14-$F$6)+SUM(N14:P14))","v":31.4},{"$f":"IF(AND(ISNUMBER(L14),ISNUMBER(Q14)),L14+Q14,0)","v":60.199999999999996}]
[null,{"$f":"IF(R15=\"\",\"\",RANK(R15,$R$12:$R$26,0)+COUNTIFS($R$12:R15,R15)-1)","v":4},98,"William Abrahamsen Geving","Namsos IL Hopp","Hopp","G10",3,null,null,null,{"$f":"IF(H15=\"\",0,60+$F$7*(H15-$F$6)+SUM(I15:K15))","v":23.6},3,null,null,null,{"$f":"IF(M15=\"\",\"\",60+$F$7*(M15-$F$6)+SUM(N15:P15))","v":23.6},{"$f":"IF(AND(ISNUMBER(L15),ISNUMBER(Q15)),L15+Q15,0)","v":47.2}]
[null,{"$f":"IF(R16=\"\",\"\",RANK(R16,$R$12:$R$26,0)+COUNTIFS($R$12:R16,R16)-1)","v":5},99,"Othelie Bolås","Ogndal IL","Komb","J11",2.5,null,null,null,{"$f":"IF(H16=\"\",0,60+$F$7*(H16-$F$6)+SUM(I16:K16))","v":21},3,null,null,null,{"$f":"IF(M16=\"\",\"\",60+$F$7*(M16-$F$6)+SUM(N16:P16))","v":23.6},{"$f":"IF(AND(ISNUMBER(L16),ISNUMBER(Q16)),L16+Q16,0)","v":44.6}]
[null,{"$f":"IF(R17=\"\",\"\",RANK(R17,$R$12:$R$26,0)+COUNTIFS($R$12:R17,R17)-1)","v":2},101,"Amalie Hanem Bolås","Ogndal IL","Komb","J12",3.5,null,null,null,{"$f":"IF(H17=\"\",0,60+$F$7*(H17-$F$6)+SUM(I17:K17))","v":26.199999999999996},4.5,null,null,null,{"$f":"IF(M17=\"\",\"\",60+$F$7*(M17-$F$6)+SUM(N17:P17))","v":31.4},{"$f":"IF(AND(ISNUMBER(L17),ISNUMBER(Q17)),L17+Q17,0)","v":57.599999999999994}]
[null,{"$f":"IF(R18=\"\",\"\",RANK(R18,$R$12:$R$26,0)+COUNTIFS($R$12:R18,R18)-1)","v":6},102,null,null,null,null,null,null,null,null,{"$f":"IF(H18=\"\",0,60+$F$7*(H18-$F$6)+SUM(I18:K18))","v":0},null,null,null,null,{"$f":"IF(M18=\"\",\"\",60+$F$7*(M18-$F$6)+SUM(N18:P18))","v":""},{"$f":"IF(AND(ISNUMBER(L18),ISNUMBER(Q18)),L18+Q18,0)","v":0}]
[null,{"$f":"IF(R19=\"\",\"\",RANK(R19,$R$12:$R$26,0)+COUNTIFS($R$12:R19,R19)-1)","v":7},106,null,null,null,null,null,null,null,null,{"$f":"IF(H19=\"\",0,60+$F$7*(H19-$F$6)+SUM(I19:K19))","v":0},null,null,null,null,{"$f":"IF(M19=\"\",\"\",60+$F$7*(M19-$F$6)+SUM(N19:P19))","v":""},{"$f":"IF(AND(ISNUMBER(L19),ISNUMBER(Q19)),L19+Q19,0)","v":0}]
[null,{"$f":"IF(R20=\"\",\"\",RANK(R20,$R$12:$R$26,0)+COUNTIFS($R$12:R20,R20)-1)","v":8},107,null,null,null,null,null,null,null,null,{"$f":"IF(H20=\"\",0,60+$F$7*(H20-$F$6)+SUM(I20:K20))","v":0},null,null,null,null,{"$f":"IF(M20=\"\",\"\",60+$F$7*(M20-$F$6)+SUM(N20:P20))","v":""},{"$f":"IF(AND(ISNUMBER(L20),ISNUMBER(Q20)),L20+Q20,0)","v":0}]
[null,{"$f":"IF(R21=\"\",\"\",RANK(R21,$R$12:$R$26,0)+COUNTIFS($R$12:R21,R21)-1)","v":9},null,null,null,null,null,null,null,null,null,{"$f":"IF(H21=\"\",0,60+$F$7*(H21-$F$6)+SUM(I21:K21))","v":0},null,null,null,null,{"$f":"IF(M21=\"\",\"\",60+$F$7*(M21-$F$6)+SUM(N21:P21))","v":""},{"$f":"IF(AND(ISNUMBER(L21),ISNUMBER(Q21)),L21+Q21,0)","v":0}]
[null,{"$f":"IF(R22=\"\",\"\",RANK(R22,$R$12:$R$26,0)+COUNTIFS($R$12:R22,R22)-1)","v":10},null,null,null,null,null,null,null,null,null,{"$f":"IF(H22=\"\",0,60+$F$7*(H22-$F$6)+SUM(I22:K22))","v":0},null,null,null,null,{"$f":"IF(M22=\"\",\"\",60+$F$7*(M22-$F$6)+SUM(N22:P22))","v":""},{"$f":"IF(AND(ISNUMBER(L22),ISNUMBER(Q22)),L22+Q22,0)","v":0}]
[null,{"$f":"IF(R23=\"\",\"\",RANK(R23,$R$12:$R$26,0)+COUNTIFS($R$12:R23,R23)-1)","v":11},null,null,null,null,null,null,null,null,null,{"$f":"IF(H23=\"\",0,60+$F$7*(H23-$F$6)+SUM(I23:K23))","v":0},null,null,null,null,{"$f":"IF(M23=\"\",\"\",60+$F$7*(M23-$F$6)+SUM(N23:P23))","v":""},{"$f":"IF(AND(ISNUMBER(L23),ISNUMBER(Q23)),L23+Q23,0)","v":0}]
[null,{"$f":"IF(R24=\"\",\"\",RANK(R24,$R$12:$R$26,0)+COUNTIFS($R$12:R24,R24)-1)","v":12},null,null,null,null,null,null,null,null,null,{"$f":"IF(H24=\"\",0,60+$F$7*(H24-$F$6)+SUM(I24:K24))","v":0},null,null,null,null,{"$f":"IF(M24=\"\",\"\",60+$F$7*(M24-$F$6)+SUM(N24:P24))","v":""},{"$f":"IF(AND(ISNUMBER(L24),ISNUMBER(Q24)),L24+Q24,0)","v":0}]
[null,{"$f":"IF(R25=\"\",\"\",RANK(R25,$R$12:$R$26,0)+COUNTIFS($R$12:R25,R25)-1)","v":13},null,null,null,null,null,null,null,null,null,{"$f":"IF(H25=\"\",0,60+$F$7*(H25-$F$6)+SUM(I25:K25))","v":0},null,null,null,null,{"$f":"IF(M25=\"\",\"\",60+$F$7*(M25-$F$6)+SUM(N25:P25))","v":""},{"$f":"IF(AND(ISNUMBER(L25),ISNUMBER(Q25)),L25+Q25,0)","v":0}]
[null,{"$f":"IF(R26=\"\",\"\",RANK(R26,$R$12:$R$26,0)+COUNTIFS($R$12:R26,R26)-1)","v":14},null,null,null,null,null,null,null,null,null,{"$f":"IF(H26=\"\",0,60+$F$7*(H26-$F$6)+SUM(I26:K26))","v":0},null,null,null,null,{"$f":"IF(M26=\"\",\"\",60+$F$7*(M26-$F$6)+SUM(N26:P26))","v":""},{"$f":"IF(AND(ISNUMBER(L26),ISNUMBER(Q26)),L26+Q26,0)","v":0}]
[null,null,null,null,null,null,null,null,null,null,{"$f":"IF(G27=\"\",\"\",60+$F$7*(G27-$F$6)+SUM(H27:J27))","v":""},null,null,null,null,{"$f":"IF(L27=\"\",\"\",60+$F$7*(L27-$F$6)+SUM(M27:O27))","v":""},{"$f":"IF(AND(ISNUMBER(K27),ISNUMBER(P27)),K27+P27,\"\")","v":""}]
[]
[null,null,null,null,"Startliste kombinert - individuell kompakt"]
[]
[null,"Plass. Hopp\n 1. omg","Start nr.","Navn","Klubb","F.år","Poeng hopp","Start tid","Tid i mål\nMM:SS,T",null,null,"Plassering"]
[null,{"$f":"IF(COUNTIF($F$12:$F$26,\"Komb\")>0,1,\"\")","v":1},{"$f":"_xlfn._xlws.SORT(_xlfn.HSTACK(_xlfn._xlws.FILTER($C$12:$E$26,$F$12:$F$26=\"Komb\",$L$12:$L$26>0),_xlfn._xlws.FILTER($G$12:$G$26,$F$12:$F$26=\"Komb\",$L$12:$L$26>0),_xlfn._xlws.FILTER($L$12:$L$26,$F$12:$F$26=\"Komb\",$L$12:$L$26>0)),5,-1)","v":95},"Sigve Olai Bolås","Ogndal IL","G8",28.799999999999997,{"$f":"TIME(0,0,0)","v":"00:00:00"},null,null,null,{"$f":"IF(C32=\"\",\"\",RANK(I32,$I$32:$I$47,1)+COUNTIF($I$32:I32,I32)-1)","v":{"$error":"#N/A"}}]
[null,{"$f":"IFERROR(IF(B32+1>COUNTIF($F$12:$F$26,\"Komb\"),\"\",B32+1),\"\")","v":2},101,"Amalie Hanem Bolås","Ogndal IL","J12",26.199999999999996,{"$f":"IF(B33=\"\",\"\",H32+TIME(0,0,6))","v":"00:00:06"},null,null,null,{"$f":"IF(C33=\"\",\"\",RANK(I33,$I$32:$I$47,1)+COUNTIF($I$32:I33,I33)-1)","v":{"$error":"#N/A"}}]
[null,{"$f":"IFERROR(IF(B33+1>COUNTIF($F$12:$F$26,\"Komb\"),\"\",B33+1),\"\")","v":3},99,"Othelie Bolås","Ogndal IL","J11",21,{"$f":"IF(B34=\"\",\"\",H33+TIME(0,0,6))","v":"00:00:12"},null,null,null,{"$f":"IF(C34=\"\",\"\",RANK(I34,$I$32:$I$47,1)+COUNTIF($I$32:I34,I34)-1)","v":{"$error":"#N/A"}}]
[null,{"$f":"IFERROR(IF(B34+1>COUNTIF($F$12:$F$26,\"Komb\"),\"\",B34+1),\"\")","v":""},null,null,null,null,null,"",null,null,null,{"$f":"IF(C35=\"\",\"\",RANK(I35,$I$32:$I$47,1)+COUNTIF($I$32:I35,I35)-1)","v":""}]
[null,{"$f":"IFERROR(IF(B35+1>COUNTIF($F$12:$F$26,\"Komb\"),\"\",B35+1),\"\")","v":""},null,null,null,null,null,"",null,null,null,{"$f":"IF(C36=\"\",\"\",RANK(I36,$I$32:$I$47,1)+COUNTIF($I$32:I36,I36)-1)","v":""}]
[null,{"$f":"IFERROR(IF(B36+1>COUNTIF($F$12:$F$26,\"Komb\"),\"\",B36+1),\"\")","v":""},null,null,null,null,null,"",null,null,null,{"$f":"IF(C37=\"\",\"\",RANK(I37,$I$32:$I$47,1)+COUNTIF($I$32:I37,I37)-1)","v":""}]
[null,{"$f":"IFERROR(IF(B37+1>COUNTIF($F$12:$F$26,\"Komb\"),\"\",B37+1),\"\")","v":""},null,null,null,null,null,"",null,null,null,{"$f":"IF(C38=\"\",\"\",RANK(I38,$I$32:$I$47,1)+COUNTIF($I$32:I38,I38)-1)","v":""}]
[null,{"$f":"IFERROR(IF(B38+1>COUNTIF($F$12:$F$26,\"Komb\"),\"\",B38+1),\"\")","v":""},null,null,null,null,null,"",null,null,null,{"$f":"IF(C39=\"\",\"\",RANK(I39,$I$32:$I$47,1)+COUNTIF($I$32:I39,I39)-1)","v":""}]
[null,{"$f":"IFERROR(IF(B39+1>COUNTIF($F$12:$F$26,\"Komb\"),\"\",B39+1),\"\")","v":""},null,null,null,null,null,"",null,null,null,{"$f":"IF(C40=\"\",\"\",RANK(I40,$I$32:$I$47,1)+COUNTIF($I$32:I40,I40)-1)","v":""}]
[null,{"$f":"IFERROR(IF(B40+1>COUNTIF($F$12:$F$26,\"Komb\"),\"\",B40+1),\"\")","v":""},null,null,null,null,null,"",null,null,null,{"$f":"IF(C41=\"\",\"\",RANK(I41,$I$32:$I$47,1)+COUNTIF($I$32:I41,I41)-1)","v":""}]
[null,{"$f":"IFERROR(IF(B41+1>COUNTIF($F$12:$F$26,\"Komb\"),\"\",B41+1),\"\")","v":""},null,null,null,null,null,"",null,null,null,{"$f":"IF(C42=\"\",\"\",RANK(I42,$I$32:$I$47,1)+COUNTIF($I$32:I42,I42)-1)","v":""}]
[null,{"$f":"IFERROR(IF(B42+1>COUNTIF($F$12:$F$26,\"Komb\"),\"\",B42+1),\"\")","v":""},null,null,null,null,null,"",null,null,null,{"$f":"IF(C43=\"\",\"\",RANK(I43,$I$32:$I$47,1)+COUNTIF($I$32:I43,I43)-1)","v":""}]
[null,{"$f":"IFERROR(IF(B43+1>COUNTIF($F$12:$F$26,\"Komb\"),\"\",B43+1),\"\")","v":""},null,null,null,null,null,"",null,null,null,{"$f":"IF(C44=\"\",\"\",RANK(I44,$I$32:$I$47,1)+COUNTIF($I$32:I44,I44)-1)","v":""}]
[null,{"$f":"IFERROR(IF(B44+1>COUNTIF($F$12:$F$26,\"Komb\"),\"\",B44+1),\"\")","v":""},null,null,null,null,null,"",null,null,null,{"$f":"IF(C45=\"\",\"\",RANK(I45,$I$32:$I$47,1)+COUNTIF($I$32:I45,I45)-1)","v":""}]
[null,{"$f":"IFERROR(IF(B45+1>COUNTIF($F$12:$F$26,\"Komb\"),\"\",B45+1),\"\")","v":""},null,null,null,null,null,"",null,null,null,{"$f":"IF(C46=\"\",\"\",RANK(I46,$I$32:$I$47,1)+COUNTIF($I$32:I46,I46)-1)","v":""}]
[null,{"$f":"IFERROR(IF(B46+1>COUNTIF($F$12:$F$26,\"Komb\"),\"\",B46+1),\"\")","v":""},null,null,null,null,null,"",null,null,null,{"$f":"IF(C47=\"\",\"\",RANK(I47,$I$32:$I$47,1)+COUNTIF($I$32:I47,I47)-1)","v":""}]
[]
[]
[null,null,null,null,"Resultatliste kombinert - individuell kompakt"]
[]
[null,"Plass","Start nr.","Navn","Klubb","F.år","Lengde","A","B","C","Poeng\nHopp","Starttid\nlangrenn","Tid\nlangr",null,"Tid i mål"]
[null,{"$f":"IF(COUNT($I$32:$I$47)>0,1,\"\")","v":""},{"$f":"IF(B53=\"\",\"\",_xlfn.XLOOKUP($B53,$L$32:$L$47,$C$32:$C$47,\"\",0,1))","v":""},{"$f":"IF(C53=\"\",\"\",_xlfn.XLOOKUP($C53,$C$32:$C$47,D$32:D$47,\"\",0,1))","v":""},"","",{"$f":"IF($C53=\"\",\"\",_xlfn.XLOOKUP($C53,$C$12:$C$26,H$12:H$26,\"\",0,1))","v":""},{"$f":"IF($C53=\"\",\"\",_xlfn.XLOOKUP($C53,$C$12:$C$26,I$12:I$26,\"\",0,1))","v":""},{"$f":"IF($C53=\"\",\"\",_xlfn.XLOOKUP($C53,$C$12:$C$26,J$12:J$26,\"\",0,1))","v":""},{"$f":"IF($C53=\"\",\"\",_xlfn.XLOOKUP($C53,$C$12:$C$26,K$12:K$26,\"\",0,1))","v":""},{"$f":"IF($C53=\"\",\"\",_xlfn.XLOOKUP($C53,$C$12:$C$26,L$12:L$26,\"\",0,1))","v":""},{"$f":"_xlfn.XLOOKUP(C53,$C$31:$C$47,$H$31:$H$47,\"\",0,1)","v":""},{"$f":"IF(C53=\"\",\"\",_xlfn.XLOOKUP(C53,$C$31:$C$47,$I$31:$I$47,\"\",0,1)-L53)","v":""},null,{"$f":"VLOOKUP(C53,C32:I47,7,FALSE)","v":{"$error":"#N/A"}}]
[null,{"$f":"IFERROR(IF(B53+1>COUNT($I$32:$I$47),\"\",B53+1),\"\")","v":""},{"$f":"IF(B54=\"\",\"\",_xlfn.XLOOKUP($B54,$L$32:$L$47,$C$32:$C$47,\"\",0,1))","v":""},"","","",{"$f":"IF($C54=\"\",\"\",_xlfn.XLOOKUP($C54,$C$12:$C$26,H$12:H$26,\"\",0,1))","v":""},{"$f":"IF($C54=\"\",\"\",_xlfn.XLOOKUP($C54,$C$12:$C$26,I$12:I$26,\"\",0,1))","v":""},{"$f":"IF($C54=\"\",\"\",_xlfn.XLOOKUP($C54,$C$12:$C$26,J$12:J$26,\"\",0,1))","v":""},{"$f":"IF($C54=\"\",\"\",_xlfn.XLOOKUP($C54,$C$12:$C$26,K$12:K$26,\"\",0,1))","v":""},{"$f":"IF($C54=\"\",\"\",_xlfn.XLOOKUP($C54,$C$12:$C$26,L$12:L$26,\"\",0,1))","v":""},{"$f":"_xlfn.XLOOKUP(C54,$C$31:$C$47,$H$31:$H$47,\"\",0,1)","v":""},{"$f":"IF(C54=\"\",\"\",_xlfn.XLOOKUP(C54,$C$31:$C$47,$I$31:$I$47,\"\",0,1)-L54)","v":""},{"$f":"IF(C54=\"\",\"\",\"+\")","v":""},{"$f":"IF(C54=\"\",\"\",VLOOKUP($C54,$C$32:$I$47,7,0)-VLOOKUP($C$53,$C$32:$I$47,7,0))","v":""}]
[null,{"$f":"IFERROR(IF(B54+1>COUNT($I$32:$I$47),\"\",B54+1),\"\")","v":""},"","","","",{"$f":"IF($C55=\"\",\"\",_xlfn.XLOOKUP($C55,$C$12:$C$26,H$12:H$26,\"\",0,1))","v":""},{"$f":"IF($C55=\"\",\"\",_xlfn.XLOOKUP($C55,$C$12:$C$26,I$12:I$26,\"\",0,1))","v":""},{"$f":"IF($C55=\"\",\"\",_xlfn.XLOOKUP($C55,$C$12:$C$26,J$12:J$26,\"\",0,1))","v":""},{"$f":"IF($C55=\"\",\"\",_xlfn.XLOOKUP($C55,$C$12:$C$26,K$12:K$26,\"\",0,1))","v":""},{"$f":"IF($C55=\"\",\"\",_xlfn.XLOOKUP($C55,$C$12:$C$26,L$12:L$26,\"\",0,1))","v":""},"","","",{"$f":"IF(C55=\"\",\"\",VLOOKUP($C55,$C$32:$I$47,7,0)-VLOOKUP($C$53,$C$32:$I$47,7,0))","v":""}]
[null,"","","","","",{"$f":"IF($C56=\"\",\"\",_xlfn.XLOOKUP($C56,$C$12:$C$26,H$12:H$26,\"\",0,1))","v":""},{"$f":"IF($C56=\"\",\"\",_xlfn.XLOOKUP($C56,$C$12:$C$26,I$12:I$26,\"\",0,1))","v":""},{"$f":"IF($C56=\"\",\"\",_xlfn.XLOOKUP($C56,$C$12:$C$26,J$12:J$26,\"\",0,1))","v":""},{"$f":"IF($C56=\"\",\"\",_xlfn.XLOOKUP($C56,$C$12:$C$26,K$12:K$26,\"\",0,1))","v":""},{"$f":"IF($C56=\"\",\"\",_xlfn.XLOOKUP($C56,$C$12:$C$26,L$12:L$26,\"\",0,1))","v":""},"","","",""]
[null,"","","","","",{"$f":"IF($C57=\"\",\"\",_xlfn.XLOOKUP($C57,$C$12:$C$26,H$12:H$26,\"\",0,1))","v":""},{"$f":"IF($C57=\"\",\"\",_xlfn.XLOOKUP($C57,$C$12:$C$26,I$12:I$26,\"\",0,1))","v":""},{"$f":"IF($C57=\"\",\"\",_xlfn.XLOOKUP($C57,$C$12:$C$26,J$12:J$26,\"\",0,1))","v":""},{"$f":"IF($C57=\"\",\"\",_xlfn.XLOOKUP($C57,$C$12:$C$26,K$12:K$26,\"\",0,1))","v":""},{"$f":"IF($C57=\"\",\"\",_xlfn.XLOOKUP($C57,$C$12:$C$26,L$12:L$26,\"\",0,1))","v":""},"","","",""]
[null,"","","","","",{"$f":"IF($C58=\"\",\"\",_xlfn.XLOOKUP($C58,$C$12:$C$26,H$12:H$26,\"\",0,1))","v":""},{"$f":"IF($C58=\"\",\"\",_xlfn.XLOOKUP($C58,$C$12:$C$26,I$12:I$26,\"\",0,1))","v":""},{"$f":"IF($C58=\"\",\"\",_xlfn.XLOOKUP($C58,$C$12:$C$26,J$12:J$26,\"\",0,1))","v":""},{"$f":"IF($C58=\"\",\"\",_xlfn.XLOOKUP($C58,$C$12:$C$26,K$12:K$26,\"\",0,1))","v":""},{"$f":"IF($C58=\"\",\"\",_xlfn.XLOOKUP($C58,$C$12:$C$26,L$12:L$26,\"\",0,1))","v":""},"","","",""]
[null,"","","","","",{"$f":"IF($C59=\"\",\"\",_xlfn.XLOOKUP($C59,$C$12:$C$26,H$12:H$26,\"\",0,1))","v":""},{"$f":"IF($C59=\"\",\"\",_xlfn.XLOOKUP($C59,$C$12:$C$26,I$12:I$26,\"\",0,1))","v":""},{"$f":"IF($C59=\"\",\"\",_xlfn.XLOOKUP($C59,$C$12:$C$26,J$12:J$26,\"\",0,1))","v":""},{"$f":"IF($C59=\"\",\"\",_xlfn.XLOOKUP($C59,$C$12:$C$26,K$12:K$26,\"\",0,1))","v":""},{"$f":"IF($C59=\"\",\"\",_xlfn.XLOOKUP($C59,$C$12:$C$26,L$12:L$26,\"\",0,1))","v":""},"","","",""]
[null,"","","","","",{"$f":"IF($C60=\"\",\"\",_xlfn.XLOOKUP($C60,$C$12:$C$26,H$12:H$26,\"\",0,1))","v":""},{"$f":"IF($C60=\"\",\"\",_xlfn.XLOOKUP($C60,$C$12:$C$26,I$12:I$26,\"\",0,1))","v":""},{"$f":"IF($C60=\"\",\"\",_xlfn.XLOOKUP($C60,$C$12:$C$26,J$12:J$26,\"\",0,1))","v":""},{"$f":"IF($C60=\"\",\"\",_xlfn.XLOOKUP($C60,$C$12:$C$26,K$12:K$26,\"\",0,1))","v":""},{"$f":"IF($C60=\"\",\"\",_xlfn.XLOOKUP($C60,$C$12:$C$26,L$12:L$26,\"\",0,1))","v":""},"","","",""]
[null,"","","","","",{"$f":"IF($C61=\"\",\"\",_xlfn.XLOOKUP($C61,$C$12:$C$26,H$12:H$26,\"\",0,1))","v":""},{"$f":"IF($C61=\"\",\"\",_xlfn.XLOOKUP($C61,$C$12:$C$26,I$12:I$26,\"\",0,1))","v":""},{"$f":"IF($C61=\"\",\"\",_xlfn.XLOOKUP($C61,$C$12:$C$26,J$12:J$26,\"\",0,1))","v":""},{"$f":"IF($C61=\"\",\"\",_xlfn.XLOOKUP($C61,$C$12:$C$26,K$12:K$26,\"\",0,1))","v":""},{"$f":"IF($C61=\"\",\"\",_xlfn.XLOOKUP($C61,$C$12:$C$26,L$12:L$26,\"\",0,1))","v":""},"","","",""]
[null,"","","","","",{"$f":"IF($C62=\"\",\"\",_xlfn.XLOOKUP($C62,$C$12:$C$26,H$12:H$26,\"\",0,1))","v":""},{"$f":"IF($C62=\"\",\"\",_xlfn.XLOOKUP($C62,$C$12:$C$26,I$12:I$26,\"\",0,1))","v":""},{"$f":"IF($C62=\"\",\"\",_xlfn.XLOOKUP($C62,$C$12:$C$26,J$12:J$26,\"\",0,1))","v":""},{"$f":"IF($C62=\"\",\"\",_xlfn.XLOOKUP($C62,$C$12:$C$26,K$12:K$26,\"\",0,1))","v":""},{"$f":"IF($C62=\"\",\"\",_xlfn.XLOOKUP($C62,$C$12:$C$26,L$12:L$26,\"\",0,1))","v":""},"","","",""]
[null,"","","","","",{"$f":"IF($C63=\"\",\"\",_xlfn.XLOOKUP($C63,$C$12:$C$26,H$12:H$26,\"\",0,1))","v":""},{"$f":"IF($C63=\"\",\"\",_xlfn.XLOOKUP($C63,$C$12:$C$26,I$12:I$26,\"\",0,1))","v":""},{"$f":"IF($C63=\"\",\"\",_xlfn.XLOOKUP($C63,$C$12:$C$26,J$12:J$26,\"\",0,1))","v":""},{"$f":"IF($C63=\"\",\"\",_xlfn.XLOOKUP($C63,$C$12:$C$26,K$12:K$26,\"\",0,1))","v":""},{"$f":"IF($C63=\"\",\"\",_xlfn.XLOOKUP($C63,$C$12:$C$26,L$12:L$26,\"\",0,1))","v":""},"","","",""]
[null,"","","","","",{"$f":"IF($C64=\"\",\"\",_xlfn.XLOOKUP($C64,$C$12:$C$26,H$12:H$26,\"\",0,1))","v":""},{"$f":"IF($C64=\"\",\"\",_xlfn.XLOOKUP($C64,$C$12:$C$26,I$12:I$26,\"\",0,1))","v":""},{"$f":"IF($C64=\"\",\"\",_xlfn.XLOOKUP($C64,$C$12:$C$26,J$12:J$26,\"\",0,1))","v":""},{"$f":"IF($C64=\"\",\"\",_xlfn.XLOOKUP($C64,$C$12:$C$26,K$12:K$26,\"\",0,1))","v":""},{"$f":"IF($C64=\"\",\"\",_xlfn.XLOOKUP($C64,$C$12:$C$26,L$12:L$26,\"\",0,1))","v":""},"","","",""]
[null,"","","","","",{"$f":"IF($C65=\"\",\"\",_xlfn.XLOOKUP($C65,$C$12:$C$26,H$12:H$26,\"\",0,1))","v":""},{"$f":"IF($C65=\"\",\"\",_xlfn.XLOOKUP($C65,$C$12:$C$26,I$12:I$26,\"\",0,1))","v":""},{"$f":"IF($C65=\"\",\"\",_xlfn.XLOOKUP($C65,$C$12:$C$26,J$12:J$26,\"\",0,1))","v":""},{"$f":"IF($C65=\"\",\"\",_xlfn.XLOOKUP($C65,$C$12:$C$26,K$12:K$26,\"\",0,1))","v":""},{"$f":"IF($C65=\"\",\"\",_xlfn.XLOOKUP($C65,$C$12:$C$26,L$12:L$26,\"\",0,1))","v":""},"","","",""]
[null,"","","","","",{"$f":"IF($C66=\"\",\"\",_xlfn.XLOOKUP($C66,$C$12:$C$26,H$12:H$26,\"\",0,1))","v":""},{"$f":"IF($C66=\"\",\"\",_xlfn.XLOOKUP($C66,$C$12:$C$26,I$12:I$26,\"\",0,1))","v":""},{"$f":"IF($C66=\"\",\"\",_xlfn.XLOOKUP($C66,$C$12:$C$26,J$12:J$26,\"\",0,1))","v":""},{"$f":"IF($C66=\"\",\"\",_xlfn.XLOOKUP($C66,$C$12:$C$26,K$12:K$26,\"\",0,1))","v":""},{"$f":"IF($C66=\"\",\"\",_xlfn.XLOOKUP($C66,$C$12:$C$26,L$12:L$26,\"\",0,1))","v":""},"","","",""]
[null,"","","","","",{"$f":"IF($C67=\"\",\"\",_xlfn.XLOOKUP($C67,$C$12:$C$26,H$12:H$26,\"\",0,1))","v":""},{"$f":"IF($C67=\"\",\"\",_xlfn.XLOOKUP($C67,$C$12:$C$26,I$12:I$26,\"\",0,1))","v":""},{"$f":"IF($C67=\"\",\"\",_xlfn.XLOOKUP($C67,$C$12:$C$26,J$12:J$26,\"\",0,1))","v":""},{"$f":"IF($C67=\"\",\"\",_xlfn.XLOOKUP($C67,$C$12:$C$26,K$12:K$26,\"\",0,1))","v":""},{"$f":"IF($C67=\"\",\"\",_xlfn.XLOOKUP($C67,$C$12:$C$26,L$12:L$26,\"\",0,1))","v":""},"","","",""]
[null,"","","","","",{"$f":"IF($C68=\"\",\"\",_xlfn.XLOOKUP($C68,$C$12:$C$26,H$12:H$26,\"\",0,1))","v":""},{"$f":"IF($C68=\"\",\"\",_xlfn.XLOOKUP($C68,$C$12:$C$26,I$12:I$26,\"\",0,1))","v":""},{"$f":"IF($C68=\"\",\"\",_xlfn.XLOOKUP($C68,$C$12:$C$26,J$12:J$26,\"\",0,1))","v":""},{"$f":"IF($C68=\"\",\"\",_xlfn.XLOOKUP($C68,$C$12:$C$26,K$12:K$26,\"\",0,1))","v":""},{"$f":"IF($C68=\"\",\"\",_xlfn.XLOOKUP($C68,$C$12:$C$26,L$12:L$26,\"\",0,1))","v":""},"","","",""]

{"sheet":"K15","index":3,"n_rows":68,"n_cols":18,"rows_kept":68,"cut":false,"hidden":false,"merged":[[8,7,8,11],[8,12,8,16]]}
[]
[null,null,null,null,{"$f":"+'K2'!E2","v":"Namsosrennet i hopp og kombinert 01.02.2026"}]
[]
[]
[null,null,null,null,{"$f":"\"K\"&F6","v":"K15"},null,"Åpen klasse"]
[null,null,null,null,"K-punkt:",15,"meter"]
[null,null,null,null,"Meterverdi:",{"$f":"VLOOKUP(F6,Meterverdier!A:B,2,FALSE)","v":5.2},"poeng/meter"]
[]
[null,null,null,null,null,null,null,"1. omgang",null,null,null,null,"2. omgang"]
[null,null,"Start-",null,null,"Hopp/",null,null,null,null,null,null,null,null,null,null,null,"Poeng"]
[null,"Plassering","nr.","Navn","Klubb","Komb","F.år","Lengde","A","B","C","Poeng","Lengde","A","B","C","Poeng","totalt"]
[null,{"$f":"IF(R12=\"\",\"\",RANK(R12,$R$12:$R$26,0)+COUNTIFS($R$12:R12,R12)-1)","v":3},85,"Niklas Hanem Bartnes","Ogndal IL","Komb","G8",12,null,null,null,{"$f":"IF(H12=\"\",0,60+$F$7*(H12-$F$6)+SUM(I12:K12))","v":44.4},12,null,null,null,{"$f":"IF(M12=\"\",\"\",60+$F$7*(M12-$F$6)+SUM(N12:P12))","v":44.4},{"$f":"IF(AND(ISNUMBER(L12),ISNUMBER(Q12)),L12+Q12,0)","v":88.8}]
[null,{"$f":"IF(R13=\"\",\"\",RANK(R13,$R$12:$R$26,0)+COUNTIFS($R$12:R13,R13)-1)","v":2},86,"Inga Eliassen","Namsos IL Hopp","Hopp","J10",12.5,null,null,null,{"$f":"IF(H13=\"\",0,60+$F$7*(H13-$F$6)+SUM(I13:K13))","v":47},13,null,null,null,{"$f":"IF(M13=\"\",\"\",60+$F$7*(M13-$F$6)+SUM(N13:P13))","v":49.6},{"$f":"IF(AND(ISNUMBER(L13),ISNUMBER(Q13)),L13+Q13,0)","v":96.6}]
[null,{"$f":"IF(R14=\"\",\"\",RANK(R14,$R$12:$R$26,0)+COUNTIFS($R$12:R14,R14)-1)","v":1},87,"Chrisander Sakarias B Kirknes","Namsos IL Hopp","Komb","G11",15,null,null,null,{"$f":"IF(H14=\"\",0,60+$F$7*(H14-$F$6)+SUM(I14:K14))","v":60},15.5,null,null,null,{"$f":"IF(M14=\"\",\"\",60+$F$7*(M14-$F$6)+SUM(N14:P14))","v":62.6},{"$f":"IF(AND(ISNUMBER(L14),ISNUMBER(Q14)),L14+Q14,0)","v":122.6}]
[null,null,89]
[null,null,90]
[null,{"$f":"IF(R17=\"\",\"\",RANK(R17,$R$12:$R$26,0)+COUNTIFS($R$12:R17,R17)-1)","v":4},null,null,null,null,null,null,null,null,null,{"$f":"IF(H17=\"\",0,60+$F$7*(H17-$F$6)+SUM(I17:K17))","v":0},null,null,null,null,{"$f":"IF(M17=\"\",\"\",60+$F$7*(M17-$F$6)+SUM(N17:P17))","v":""},{"$f":"IF(AND(ISNUMBER(L17),ISNUMBER(Q17)),L17+Q17,0)","v":0}]
[null,{"$f":"IF(R18=\"\",\"\",RANK(R18,$R$12:$R$26,0)+COUNTIFS($R$12:R18,R18)-1)","v":5},null,null,null,null,null,null,null,null,null,{"$f":"IF(H18=\"\",0,60+$F$7*(H18-$F$6)+SUM(I18:K18))","v":0},null,null,null,null,{"$f":"IF(M18=\"\",\"\",60+$F$7*(M18-$F$6)+SUM(N18:P18))","v":""},0]
[null,{"$f":"IF(R19=\"\",\"\",RANK(R19,$R$12:$R$26,0)+COUNTIFS($R$12:R19,R19)-1)","v":6},null,null,null,null,null,null,null,null,null,{"$f":"IF(H19=\"\",0,60+$F$7*(H19-$F$6)+SUM(I19:K19))","v":0},null,null,null,null,{"$f":"IF(M19=\"\",\"\",60+$F$7*(M19-$F$6)+SUM(N19:P19))","v":""},0]
[null,{"$f":"IF(R20=\"\",\"\",RANK(R20,$R$12:$R$26,0)+COUNTIFS($R$12:R20,R20)-1)","v":7},null,null,null,null,null,null,null,null,null,{"$f":"IF(H20=\"\",0,60+$F$7*(H20-$F$6)+SUM(I20:K20))","v":0},null,null,null,null,{"$f":"IF(M20=\"\",\"\",60+$F$7*(M20-$F$6)+SUM(N20:P20))","v":""},{"$f":"IF(AND(ISNUMBER(L20),ISNUMBER(Q20)),L20+Q20,0)","v":0}]
[null,{"$f":"IF(R21=\"\",\"\",RANK(R21,$R$12:$R$26,0)+COUNTIFS($R$12:R21,R21)-1)","v":8},null,null,null,null,null,null,null,null,null,{"$f":"IF(H21=\"\",0,60+$F$7*(H21-$F$6)+SUM(I21:K21))","v":0},null,null,null,null,{"$f":"IF(M21=\"\",\"\",60+$F$7*(M21-$F$6)+SUM(N21:P21))","v":""},0]
[null,{"$f":"IF(R22=\"\",\"\",RANK(R22,$R$12:$R$26,0)+COUNTIFS($R$12:R22,R22)-1)","v":9},null,null,null,null,null,null,null,null,null,{"$f":"IF(H22=\"\",0,60+$F$7*(H22-$F$6)+SUM(I22:K22))","v":0},null,null,null,null,{"$f":"IF(M22=\"\",\"\",60+$F$7*(M22-$F$6)+SUM(N22:P22))","v":""},0]
[null,{"$f":"IF(R23=\"\",\"\",RANK(R23,$R$12:$R$26,0)+COUNTIFS($R$12:R23,R23)-1)","v":10},null,null,null,null,null,null,null,null,null,{"$f":"IF(H23=\"\",0,60+$F$7*(H23-$F$6)+SUM(I23:K23))","v":0},null,null,null,null,{"$f":"IF(M23=\"\",\"\",60+$F$7*(M23-$F$6)+SUM(N23:P23))","v":""},0]
[null,{"$f":"IF(R24=\"\",\"\",RANK(R24,$R$12:$R$26,0)+COUNTIFS($R$12:R24,R24)-1)","v":11},null,null,null,null,null,null,null,null,null,{"$f":"IF(H24=\"\",0,60+$F$7*(H24-$F$6)+SUM(I24:K24))","v":0},null,null,null,null,{"$f":"IF(M24=\"\",\"\",60+$F$7*(M24-$F$6)+SUM(N24:P24))","v":""},0]
[null,{"$f":"IF(R25=\"\",\"\",RANK(R25,$R$12:$R$26,0)+COUNTIFS($R$12:R25,R25)-1)","v":12},null,null,null,null,null,null,null,null,null,{"$f":"IF(H25=\"\",0,60+$F$7*(H25-$F$6)+SUM(I25:K25))","v":0},null,null,null,null,{"$f":"IF(M25=\"\",\"\",60+$F$7*(M25-$F$6)+SUM(N25:P25))","v":""},0]
[null,{"$f":"IF(R26=\"\",\"\",RANK(R26,$R$12:$R$26,0)+COUNTIFS($R$12:R26,R26)-1)","v":13},null,null,null,null,null,null,null,null,null,{"$f":"IF(H26=\"\",0,60+$F$7*(H26-$F$6)+SUM(I26:K26))","v":0},null,null,null,null,{"$f":"IF(M26=\"\",\"\",60+$F$7*(M26-$F$6)+SUM(N26:P26))","v":""},0]
[null,null,null,null,null,null,null,null,null,null,{"$f":"IF(G27=\"\",\"\",60+$F$7*(G27-$F$6)+SUM(H27:J27))","v":""},null,null,null,null,{"$f":"IF(L27=\"\",\"\",60+$F$7*(L27-$F$6)+SUM(M27:O27))","v":""},{"$f":"IF(AND(ISNUMBER(K27),ISNUMBER(P27)),K27+P27,\"\")","v":""}]
[]
[null,null,null,null,"Startliste kombinert - individuell kompakt"]
[]
[null,"Plass. Hopp\n 1. omg","Start nr.","Navn","Klubb","F.år","Poeng hopp","Start tid","Tid i mål\nMM:SS,T",null,null,"Plassering"]
[null,{"$f":"IF(COUNTIF($F$12:$F$26,\"Komb\")>0,1,\"\")","v":1},{"$f":"_xlfn._xlws.SORT(_xlfn.HSTACK(_xlfn._xlws.FILTER($C$12:$E$26,$F$12:$F$26=\"Komb\",$L$12:$L$26>0),_xlfn._xlws.FILTER($G$12:$G$26,$F$12:$F$26=\"Komb\",$L$12:$L$26>0),_xlfn._xlws.FILTER($L$12:$L$26,$F$12:$F$26=\"Komb\",$L$12:$L$26>0)),5,-1)","v":87},"Chrisander Sakarias B Kirknes","Namsos IL Hopp","G11",60,{"$f":"TIME(0,0,0)","v":"00:00:00"},null,null,null,{"$f":"IF(C32=\"\",\"\",RANK(I32,$I$32:$I$47,1)+COUNTIF($I$32:I32,I32)-1)","v":{"$error":"#N/A"}}]
[null,{"$f":"IFERROR(IF(B32+1>COUNTIF($F$12:$F$26,\"Komb\"),\"\",B32+1),\"\")","v":2},85,"Niklas Hanem Bartnes","Ogndal IL","G8",44.4,{"$f":"IF(B33=\"\",\"\",H32+TIME(0,0,6))","v":"00:00:06"},null,null,null,{"$f":"IF(C33=\"\",\"\",RANK(I33,$I$32:$I$47,1)+COUNTIF($I$32:I33,I33)-1)","v":{"$error":"#N/A"}}]
[null,{"$f":"IFERROR(IF(B33+1>COUNTIF($F$12:$F$26,\"Komb\"),\"\",B33+1),\"\")","v":""},null,null,null,null,null,{"$f":"IF(B34=\"\",\"\",H33+TIME(0,0,6))","v":""},null,null,null,{"$f":"IF(C34=\"\",\"\",RANK(I34,$I$32:$I$47,1)+COUNTIF($I$32:I34,I34)-1)","v":""}]
[null,{"$f":"IFERROR(IF(B34+1>COUNTIF($F$12:$F$26,\"Komb\"),\"\",B34+1),\"\")","v":""},null,null,null,null,null,"",null,null,null,{"$f":"IF(C35=\"\",\"\",RANK(I35,$I$32:$I$47,1)+COUNTIF($I$32:I35,I35)-1)","v":""}]
[null,{"$f":"IFERROR(IF(B35+1>COUNTIF($F$12:$F$26,\"Komb\"),\"\",B35+1),\"\")","v":""},null,null,null,null,null,"",null,null,null,{"$f":"IF(C36=\"\",\"\",RANK(I36,$I$32:$I$47,1)+COUNTIF($I$32:I36,I36)-1)","v":""}]
[null,{"$f":"IFERROR(IF(B36+1>COUNTIF($F$12:$F$26,\"Komb\"),\"\",B36+1),\"\")","v":""},null,null,null,null,null,"",null,null,null,{"$f":"IF(C37=\"\",\"\",RANK(I37,$I$32:$I$47,1)+COUNTIF($I$32:I37,I37)-1)","v":""}]
[null,{"$f":"IFERROR(IF(B37+1>COUNTIF($F$12:$F$26,\"Komb\"),\"\",B37+1),\"\")","v":""},null,null,null,null,null,"",null,null,null,{"$f":"IF(C38=\"\",\"\",RANK(I38,$I$32:$I$47,1)+COUNTIF($I$32:I38,I38)-1)","v":""}]
[null,{"$f":"IFERROR(IF(B38+1>COUNTIF($F$12:$F$26,\"Komb\"),\"\",B38+1),\"\")","v":""},null,null,null,null,null,"",null,null,null,{"$f":"IF(C39=\"\",\"\",RANK(I39,$I$32:$I$47,1)+COUNTIF($I$32:I39,I39)-1)","v":""}]
[null,{"$f":"IFERROR(IF(B39+1>COUNTIF($F$12:$F$26,\"Komb\"),\"\",B39+1),\"\")","v":""},null,null,null,null,null,"",null,null,null,{"$f":"IF(C40=\"\",\"\",RANK(I40,$I$32:$I$47,1)+COUNTIF($I$32:I40,I40)-1)","v":""}]
[null,{"$f":"IFERROR(IF(B40+1>COUNTIF($F$12:$F$26,\"Komb\"),\"\",B40+1),\"\")","v":""},null,null,null,null,null,"",null,null,null,{"$f":"IF(C41=\"\",\"\",RANK(I41,$I$32:$I$47,1)+COUNTIF($I$32:I41,I41)-1)","v":""}]
[null,{"$f":"IFERROR(IF(B41+1>COUNTIF($F$12:$F$26,\"Komb\"),\"\",B41+1),\"\")","v":""},null,null,null,null,null,"",null,null,null,{"$f":"IF(C42=\"\",\"\",RANK(I42,$I$32:$I$47,1)+COUNTIF($I$32:I42,I42)-1)","v":""}]
[null,{"$f":"IFERROR(IF(B42+1>COUNTIF($F$12:$F$26,\"Komb\"),\"\",B42+1),\"\")","v":""},null,null,null,null,null,"",null,null,null,{"$f":"IF(C43=\"\",\"\",RANK(I43,$I$32:$I$47,1)+COUNTIF($I$32:I43,I43)-1)","v":""}]
[null,{"$f":"IFERROR(IF(B43+1>COUNTIF($F$12:$F$26,\"Komb\"),\"\",B43+1),\"\")","v":""},null,null,null,null,null,"",null,null,null,{"$f":"IF(C44=\"\",\"\",RANK(I44,$I$32:$I$47,1)+COUNTIF($I$32:I44,I44)-1)","v":""}]
[null,{"$f":"IFERROR(IF(B44+1>COUNTIF($F$12:$F$26,\"Komb\"),\"\",B44+1),\"\")","v":""},null,null,null,null,null,"",null,null,null,{"$f":"IF(C45=\"\",\"\",RANK(I45,$I$32:$I$47,1)+COUNTIF($I$32:I45,I45)-1)","v":""}]
[null,{"$f":"IFERROR(IF(B45+1>COUNTIF($F$12:$F$26,\"Komb\"),\"\",B45+1),\"\")","v":""},null,null,null,null,null,"",null,null,null,{"$f":"IF(C46=\"\",\"\",RANK(I46,$I$32:$I$47,1)+COUNTIF($I$32:I46,I46)-1)","v":""}]
[null,{"$f":"IFERROR(IF(B46+1>COUNTIF($F$12:$F$26,\"Komb\"),\"\",B46+1),\"\")","v":""},null,null,null,null,null,"",null,null,null,{"$f":"IF(C47=\"\",\"\",RANK(I47,$I$32:$I$47,1)+COUNTIF($I$32:I47,I47)-1)","v":""}]
[]
[]
[null,null,null,null,"Resultatliste kombinert - individuell kompakt"]
[]
[null,"Plass","Start nr.","Navn","Klubb","F.år","Lengde","A","B","C","Poeng\nHopp","Starttid\nlangrenn","Tid\nlangr",null,"Tid i mål"]
[null,{"$f":"IF(COUNT($I$32:$I$47)>0,1,\"\")","v":""},{"$f":"IF(B53=\"\",\"\",_xlfn.XLOOKUP($B53,$L$32:$L$47,$C$32:$C$47,\"\",0,1))","v":""},{"$f":"IF(C53=\"\",\"\",_xlfn.XLOOKUP($C53,$C$32:$C$47,D$32:D$47,\"\",0,1))","v":""},{"$f":"IF(D53=\"\",\"\",_xlfn.XLOOKUP($C53,$C$32:$C$47,E$32:E$47,\"\",0,1))","v":""},"",{"$f":"IF($C53=\"\",\"\",_xlfn.XLOOKUP($C53,$C$12:$C$26,H$12:H$26,\"\",0,1))","v":""},{"$f":"IF($C53=\"\",\"\",_xlfn.XLOOKUP($C53,$C$12:$C$26,I$12:I$26,\"\",0,1))","v":""},{"$f":"IF($C53=\"\",\"\",_xlfn.XLOOKUP($C53,$C$12:$C$26,J$12:J$26,\"\",0,1))","v":""},{"$f":"IF($C53=\"\",\"\",_xlfn.XLOOKUP($C53,$C$12:$C$26,K$12:K$26,\"\",0,1))","v":""},{"$f":"IF($C53=\"\",\"\",_xlfn.XLOOKUP($C53,$C$12:$C$26,L$12:L$26,\"\",0,1))","v":""},{"$f":"_xlfn.XLOOKUP(C53,$C$31:$C$47,$H$31:$H$47,\"\",0,1)","v":""},{"$f":"IF(C53=\"\",\"\",_xlfn.XLOOKUP(C53,$C$31:$C$47,$I$31:$I$47,\"\",0,1)-L53)","v":""},null,{"$f":"VLOOKUP(C53,C32:I47,7,FALSE)","v":{"$error":"#N/A"}}]
[null,{"$f":"IFERROR(IF(B53+1>COUNT($I$32:$I$47),\"\",B53+1),\"\")","v":""},{"$f":"IF(B54=\"\",\"\",_xlfn.XLOOKUP($B54,$L$32:$L$47,$C$32:$C$47,\"\",0,1))","v":""},"","","",{"$f":"IF($C54=\"\",\"\",_xlfn.XLOOKUP($C54,$C$12:$C$26,H$12:H$26,\"\",0,1))","v":""},{"$f":"IF($C54=\"\",\"\",_xlfn.XLOOKUP($C54,$C$12:$C$26,I$12:I$26,\"\",0,1))","v":""},{"$f":"IF($C54=\"\",\"\",_xlfn.XLOOKUP($C54,$C$12:$C$26,J$12:J$26,\"\",0,1))","v":""},{"$f":"IF($C54=\"\",\"\",_xlfn.XLOOKUP($C54,$C$12:$C$26,K$12:K$26,\"\",0,1))","v":""},{"$f":"IF($C54=\"\",\"\",_xlfn.XLOOKUP($C54,$C$12:$C$26,L$12:L$26,\"\",0,1))","v":""},{"$f":"_xlfn.XLOOKUP(C54,$C$31:$C$47,$H$31:$H$47,\"\",0,1)","v":""},{"$f":"IF(C54=\"\",\"\",_xlfn.XLOOKUP(C54,$C$31:$C$47,$I$31:$I$47,\"\",0,1)-L54)","v":""},{"$f":"IF(C54=\"\",\"\",\"+\")","v":""},{"$f":"IF(C54=\"\",\"\",VLOOKUP($C54,$C$32:$I$47,7,0)-VLOOKUP($C$53,$C$32:$I$47,7,0))","v":""}]
[null,{"$f":"IFERROR(IF(B54+1>COUNT($I$32:$I$47),\"\",B54+1),\"\")","v":""},"","","","",{"$f":"IF($C55=\"\",\"\",_xlfn.XLOOKUP($C55,$C$12:$C$26,H$12:H$26,\"\",0,1))","v":""},{"$f":"IF($C55=\"\",\"\",_xlfn.XLOOKUP($C55,$C$12:$C$26,I$12:I$26,\"\",0,1))","v":""},{"$f":"IF($C55=\"\",\"\",_xlfn.XLOOKUP($C55,$C$12:$C$26,J$12:J$26,\"\",0,1))","v":""},{"$f":"IF($C55=\"\",\"\",_xlfn.XLOOKUP($C55,$C$12:$C$26,K$12:K$26,\"\",0,1))","v":""},{"$f":"IF($C55=\"\",\"\",_xlfn.XLOOKUP($C55,$C$12:$C$26,L$12:L$26,\"\",0,1))","v":""},"","","",{"$f":"IF(C55=\"\",\"\",VLOOKUP($C55,$C$32:$I$47,7,0)-VLOOKUP($C$53,$C$32:$I$47,7,0))","v":""}]
[null,"","","","","",{"$f":"IF($C56=\"\",\"\",_xlfn.XLOOKUP($C56,$C$12:$C$26,H$12:H$26,\"\",0,1))","v":""},{"$f":"IF($C56=\"\",\"\",_xlfn.XLOOKUP($C56,$C$12:$C$26,I$12:I$26,\"\",0,1))","v":""},{"$f":"IF($C56=\"\",\"\",_xlfn.XLOOKUP($C56,$C$12:$C$26,J$12:J$26,\"\",0,1))","v":""},{"$f":"IF($C56=\"\",\"\",_xlfn.XLOOKUP($C56,$C$12:$C$26,K$12:K$26,\"\",0,1))","v":""},{"$f":"IF($C56=\"\",\"\",_xlfn.XLOOKUP($C56,$C$12:$C$26,L$12:L$26,\"\",0,1))","v":""},"","","",""]
[null,"","","","","",{"$f":"IF($C57=\"\",\"\",_xlfn.XLOOKUP($C57,$C$12:$C$26,H$12:H$26,\"\",0,1))","v":""},{"$f":"IF($C57=\"\",\"\",_xlfn.XLOOKUP($C57,$C$12:$C$26,I$12:I$26,\"\",0,1))","v":""},{"$f":"IF($C57=\"\",\"\",_xlfn.XLOOKUP($C57,$C$12:$C$26,J$12:J$26,\"\",0,1))","v":""},{"$f":"IF($C57=\"\",\"\",_xlfn.XLOOKUP($C57,$C$12:$C$26,K$12:K$26,\"\",0,1))","v":""},{"$f":"IF($C57=\"\",\"\",_xlfn.XLOOKUP($C57,$C$12:$C$26,L$12:L$26,\"\",0,1))","v":""},"","","",""]
[null,"","","","","",{"$f":"IF($C58=\"\",\"\",_xlfn.XLOOKUP($C58,$C$12:$C$26,H$12:H$26,\"\",0,1))","v":""},{"$f":"IF($C58=\"\",\"\",_xlfn.XLOOKUP($C58,$C$12:$C$26,I$12:I$26,\"\",0,1))","v":""},{"$f":"IF($C58=\"\",\"\",_xlfn.XLOOKUP($C58,$C$12:$C$26,J$12:J$26,\"\",0,1))","v":""},{"$f":"IF($C58=\"\",\"\",_xlfn.XLOOKUP($C58,$C$12:$C$26,K$12:K$26,\"\",0,1))","v":""},{"$f":"IF($C58=\"\",\"\",_xlfn.XLOOKUP($C58,$C$12:$C$26,L$12:L$26,\"\",0,1))","v":""},"","","",""]
[null,"","","","","",{"$f":"IF($C59=\"\",\"\",_xlfn.XLOOKUP($C59,$C$12:$C$26,H$12:H$26,\"\",0,1))","v":""},{"$f":"IF($C59=\"\",\"\",_xlfn.XLOOKUP($C59,$C$12:$C$26,I$12:I$26,\"\",0,1))","v":""},{"$f":"IF($C59=\"\",\"\",_xlfn.XLOOKUP($C59,$C$12:$C$26,J$12:J$26,\"\",0,1))","v":""},{"$f":"IF($C59=\"\",\"\",_xlfn.XLOOKUP($C59,$C$12:$C$26,K$12:K$26,\"\",0,1))","v":""},{"$f":"IF($C59=\"\",\"\",_xlfn.XLOOKUP($C59,$C$12:$C$26,L$12:L$26,\"\",0,1))","v":""},"","","",""]
[null,"","","","","",{"$f":"IF($C60=\"\",\"\",_xlfn.XLOOKUP($C60,$C$12:$C$26,H$12:H$26,\"\",0,1))","v":""},{"$f":"IF($C60=\"\",\"\",_xlfn.XLOOKUP($C60,$C$12:$C$26,I$12:I$26,\"\",0,1))","v":""},{"$f":"IF($C60=\"\",\"\",_xlfn.XLOOKUP($C60,$C$12:$C$26,J$12:J$26,\"\",0,1))","v":""},{"$f":"IF($C60=\"\",\"\",_xlfn.XLOOKUP($C60,$C$12:$C$26,K$12:K$26,\"\",0,1))","v":""},{"$f":"IF($C60=\"\",\"\",_xlfn.XLOOKUP($C60,$C$12:$C$26,L$12:L$26,\"\",0,1))","v":""},"","","",""]
[null,"","","","","",{"$f":"IF($C61=\"\",\"\",_xlfn.XLOOKUP($C61,$C$12:$C$26,H$12:H$26,\"\",0,1))","v":""},{"$f":"IF($C61=\"\",\"\",_xlfn.XLOOKUP($C61,$C$12:$C$26,I$12:I$26,\"\",0,1))","v":""},{"$f":"IF($C61=\"\",\"\",_xlfn.XLOOKUP($C61,$C$12:$C$26,J$12:J$26,\"\",0,1))","v":""},{"$f":"IF($C61=\"\",\"\",_xlfn.XLOOKUP($C61,$C$12:$C$26,K$12:K$26,\"\",0,1))","v":""},{"$f":"IF($C61=\"\",\"\",_xlfn.XLOOKUP($C61,$C$12:$C$26,L$12:L$26,\"\",0,1))","v":""},"","","",""]
[null,"","","","","",{"$f":"IF($C62=\"\",\"\",_xlfn.XLOOKUP($C62,$C$12:$C$26,H$12:H$26,\"\",0,1))","v":""},{"$f":"IF($C62=\"\",\"\",_xlfn.XLOOKUP($C62,$C$12:$C$26,I$12:I$26,\"\",0,1))","v":""},{"$f":"IF($C62=\"\",\"\",_xlfn.XLOOKUP($C62,$C$12:$C$26,J$12:J$26,\"\",0,1))","v":""},{"$f":"IF($C62=\"\",\"\",_xlfn.XLOOKUP($C62,$C$12:$C$26,K$12:K$26,\"\",0,1))","v":""},{"$f":"IF($C62=\"\",\"\",_xlfn.XLOOKUP($C62,$C$12:$C$26,L$12:L$26,\"\",0,1))","v":""},"","","",""]
[null,"","","","","",{"$f":"IF($C63=\"\",\"\",_xlfn.XLOOKUP($C63,$C$12:$C$26,H$12:H$26,\"\",0,1))","v":""},{"$f":"IF($C63=\"\",\"\",_xlfn.XLOOKUP($C63,$C$12:$C$26,I$12:I$26,\"\",0,1))","v":""},{"$f":"IF($C63=\"\",\"\",_xlfn.XLOOKUP($C63,$C$12:$C$26,J$12:J$26,\"\",0,1))","v":""},{"$f":"IF($C63=\"\",\"\",_xlfn.XLOOKUP($C63,$C$12:$C$26,K$12:K$26,\"\",0,1))","v":""},{"$f":"IF($C63=\"\",\"\",_xlfn.XLOOKUP($C63,$C$12:$C$26,L$12:L$26,\"\",0,1))","v":""},"","","",""]
[null,"","","","","",{"$f":"IF($C64=\"\",\"\",_xlfn.XLOOKUP($C64,$C$12:$C$26,H$12:H$26,\"\",0,1))","v":""},{"$f":"IF($C64=\"\",\"\",_xlfn.XLOOKUP($C64,$C$12:$C$26,I$12:I$26,\"\",0,1))","v":""},{"$f":"IF($C64=\"\",\"\",_xlfn.XLOOKUP($C64,$C$12:$C$26,J$12:J$26,\"\",0,1))","v":""},{"$f":"IF($C64=\"\",\"\",_xlfn.XLOOKUP($C64,$C$12:$C$26,K$12:K$26,\"\",0,1))","v":""},{"$f":"IF($C64=\"\",\"\",_xlfn.XLOOKUP($C64,$C$12:$C$26,L$12:L$26,\"\",0,1))","v":""},"","","",""]
[null,"","","","","",{"$f":"IF($C65=\"\",\"\",_xlfn.XLOOKUP($C65,$C$12:$C$26,H$12:H$26,\"\",0,1))","v":""},{"$f":"IF($C65=\"\",\"\",_xlfn.XLOOKUP($C65,$C$12:$C$26,I$12:I$26,\"\",0,1))","v":""},{"$f":"IF($C65=\"\",\"\",_xlfn.XLOOKUP($C65,$C$12:$C$26,J$12:J$26,\"\",0,1))","v":""},{"$f":"IF($C65=\"\",\"\",_xlfn.XLOOKUP($C65,$C$12:$C$26,K$12:K$26,\"\",0,1))","v":""},{"$f":"IF($C65=\"\",\"\",_xlfn.XLOOKUP($C65,$C$12:$C$26,L$12:L$26,\"\",0,1))","v":""},"","","",""]
[null,"","","","","",{"$f":"IF($C66=\"\",\"\",_xlfn.XLOOKUP($C66,$C$12:$C$26,H$12:H$26,\"\",0,1))","v":""},{"$f":"IF($C66=\"\",\"\",_xlfn.XLOOKUP($C66,$C$12:$C$26,I$12:I$26,\"\",0,1))","v":""},{"$f":"IF($C66=\"\",\"\",_xlfn.XLOOKUP($C66,$C$12:$C$26,J$12:J$26,\"\",0,1))","v":""},{"$f":"IF($C66=\"\",\"\",_xlfn.XLOOKUP($C66,$C$12:$C$26,K$12:K$26,\"\",0,1))","v":""},{"$f":"IF($C66=\"\",\"\",_xlfn.XLOOKUP($C66,$C$12:$C$26,L$12:L$26,\"\",0,1))","v":""},"","","",""]
[null,"","","","","",{"$f":"IF($C67=\"\",\"\",_xlfn.XLOOKUP($C67,$C$12:$C$26,H$12:H$26,\"\",0,1))","v":""},{"$f":"IF($C67=\"\",\"\",_xlfn.XLOOKUP($C67,$C$12:$C$26,I$12:I$26,\"\",0,1))","v":""},{"$f":"IF($C67=\"\",\"\",_xlfn.XLOOKUP($C67,$C$12:$C$26,J$12:J$26,\"\",0,1))","v":""},{"$f":"IF($C67=\"\",\"\",_xlfn.XLOOKUP($C67,$C$12:$C$26,K$12:K$26,\"\",0,1))","v":""},{"$f":"IF($C67=\"\",\"\",_xlfn.XLOOKUP($C67,$C$12:$C$26,L$12:L$26,\"\",0,1))","v":""},"","","",""]
[null,"","","","","",{"$f":"IF($C68=\"\",\"\",_xlfn.XLOOKUP($C68,$C$12:$C$26,H$12:H$26,\"\",0,1))","v":""},{"$f":"IF($C68=\"\",\"\",_xlfn.XLOOKUP($C68,$C$12:$C$26,I$12:I$26,\"\",0,1))","v":""},{"$f":"IF($C68=\"\",\"\",_xlfn.XLOOKUP($C68,$C$12:$C$26,J$12:J$26,\"\",0,1))","v":""},{"$f":"IF($C68=\"\",\"\",_xlfn.XLOOKUP($C68,$C$12:$C$26,K$12:K$26,\"\",0,1))","v":""},{"$f":"IF($C68=\"\",\"\",_xlfn.XLOOKUP($C68,$C$12:$C$26,L$12:L$26,\"\",0,1))","v":""},"","","",""]

{"sheet":"K25 G","index":4,"n_rows":69,"n_cols":18,"rows_kept":69,"cut":false,"hidden":false,"merged":[[8,7,8,11],[8,12,8,16]]}
[]
[null,null,null,null,{"$f":"+'K2'!E2","v":"Namsosrennet i hopp og kombinert 01.02.2026"}]
[]
[]
[null,null,null,null,{"$f":"\"K\"&F6","v":"K25"},null,"Gutter"]
[null,null,null,null,"K-punkt:",25,"meter"]
[null,null,null,null,"Meterverdi:",{"$f":"VLOOKUP(F6,Meterverdier!A:B,2,FALSE)","v":4.4000000000000004},"poeng/meter"]
[]
[null,null,null,null,null,null,null,"1. omgang",null,null,null,null,"2. omgang"]
[null,null,"Start-",null,null,"Hopp/",null,null,null,null,null,null,null,null,null,null,null,"Poeng"]
[null,"Plassering","nr.","Navn","Klubb","Komb","F.år","Lengde","A","B","C","Poeng","Lengde","A","B","C","Poeng","totalt"]
[null,null,null,null,null,null,null,null,null,null,null,{"$f":"IF(H12=\"\",0,60+$F$7*(H12-$F$6)+SUM(I12:K12))","v":0},null,null,null,null,{"$f":"IF(M12=\"\",\"\",60+$F$7*(M12-$F$6)+SUM(N12:P12))","v":""},{"$f":"IF(AND(ISNUMBER(L12),ISNUMBER(Q12)),L12+Q12,0)","v":0}]
[null,null,null,null,null,null,null,null,null,null,null,0,null,null,null,null,"",0]
[null,{"$f":"IF(R14=\"\",\"\",RANK(R14,$R$14:$R$27,0)+COUNTIFS($R14:R$14,R14)-1)","v":5},73,"Anker Wesche Fossheim","Byåsen IL","Komb","G9",15,11.5,11,12,{"$f":"IF(H14=\"\",0,60+$F$7*(H14-$F$6)+SUM(I14:K14))","v":50.5},14.5,11,11.5,11.5,{"$f":"IF(M14=\"\",\"\",60+$F$7*(M14-$F$6)+SUM(N14:P14))","v":47.8},{"$f":"IF(AND(ISNUMBER(L14),ISNUMBER(Q14)),L14+Q14,0)","v":98.3}]
[null,{"$f":"IF(R15=\"\",\"\",RANK(R15,$R$14:$R$27,0)+COUNTIFS($R$14:R15,R15)-1)","v":6},74,"Erik Hermstad Mccrae","Byaasen Skiklub","Komb","G9",13.5,11.5,11,11.5,{"$f":"IF(H15=\"\",0,60+$F$7*(H15-$F$6)+SUM(I15:K15))","v":43.4},13.5,11.5,11.5,11,{"$f":"IF(M15=\"\",\"\",60+$F$7*(M15-$F$6)+SUM(N15:P15))","v":43.4},{"$f":"IF(AND(ISNUMBER(L15),ISNUMBER(Q15)),L15+Q15,0)","v":86.8}]
[null,{"$f":"IF(R16=\"\",\"\",RANK(R16,$R$14:$R$27,0)+COUNTIFS($R$14:R16,R16)-1)","v":3},75,"Casper Boldermo Rian","Byåsen IL","Komb","G9",15.5,12.5,12.5,13,{"$f":"IF(H16=\"\",0,60+$F$7*(H16-$F$6)+SUM(I16:K16))","v":56.199999999999996},19,12,13,12.5,{"$f":"IF(M16=\"\",\"\",60+$F$7*(M16-$F$6)+SUM(N16:P16))","v":71.099999999999994},{"$f":"IF(AND(ISNUMBER(L16),ISNUMBER(Q16)),L16+Q16,0)","v":127.29999999999998}]
[null,{"$f":"IF(R17=\"\",\"\",RANK(R17,$R$14:$R$27,0)+COUNTIFS($R$14:R17,R17)-1)","v":1},77,"Håkon Vien","Byåsen IL","Komb","G10",18,12,11.5,12,{"$f":"IF(H17=\"\",0,60+$F$7*(H17-$F$6)+SUM(I17:K17))","v":64.699999999999989},22,11.5,12,12,{"$f":"IF(M17=\"\",\"\",60+$F$7*(M17-$F$6)+SUM(N17:P17))","v":82.3},{"$f":"IF(AND(ISNUMBER(L17),ISNUMBER(Q17)),L17+Q17,0)","v":147}]
[null,{"$f":"IF(R18=\"\",\"\",RANK(R18,$R$14:$R$27,0)+COUNTIFS($R$14:R18,R18)-1)","v":2},78,"Odin Krog","Byåsen IL","Komb","G10",20,12.5,13,12.5,{"$f":"IF(H18=\"\",0,60+$F$7*(H18-$F$6)+SUM(I18:K18))","v":76},18.5,11.5,12.5,11.5,{"$f":"IF(M18=\"\",\"\",60+$F$7*(M18-$F$6)+SUM(N18:P18))","v":66.900000000000006},{"$f":"IF(AND(ISNUMBER(L18),ISNUMBER(Q18)),L18+Q18,0)","v":142.9}]
[null,{"$f":"IF(R19=\"\",\"\",RANK(R19,$R$14:$R$27,0)+COUNTIFS($R$14:R19,R19)-1)","v":4},79,"Edvard Eidem","Byåsen IL","Komb","G11",16,11.5,12,11,{"$f":"IF(H19=\"\",0,60+$F$7*(H19-$F$6)+SUM(I19:K19))","v":54.9},18.5,11.5,12.5,12,{"$f":"IF(M19=\"\",\"\",60+$F$7*(M19-$F$6)+SUM(N19:P19))","v":67.400000000000006},{"$f":"IF(AND(ISNUMBER(L19),ISNUMBER(Q19)),L19+Q19,0)","v":122.30000000000001}]
[null,null,82]
[null,{"$f":"IF(R21=\"\",\"\",RANK(R21,$R$14:$R$27,0)+COUNTIFS($R$14:R21,R21)-1)","v":7},83,null,null,null,null,null,null,null,null,{"$f":"IF(H21=\"\",0,60+$F$7*(H21-$F$6)+SUM(I21:K21))","v":0},null,null,null,null,{"$f":"IF(M21=\"\",\"\",60+$F$7*(M21-$F$6)+SUM(N21:P21))","v":""},{"$f":"IF(AND(ISNUMBER(L21),ISNUMBER(Q21)),L21+Q21,0)","v":0}]
[null,{"$f":"IF(R22=\"\",\"\",RANK(R22,$R$14:$R$27,0)+COUNTIFS($R$14:R22,R22)-1)","v":8},84,null,null,null,null,null,null,null,null,{"$f":"IF(H22=\"\",0,60+$F$7*(H22-$F$6)+SUM(I22:K22))","v":0},null,null,null,null,{"$f":"IF(M22=\"\",\"\",60+$F$7*(M22-$F$6)+SUM(N22:P22))","v":""},0]
[null,{"$f":"IF(R23=\"\",\"\",RANK(R23,$R$14:$R$27,0)+COUNTIFS($R$14:R23,R23)-1)","v":9},null,null,null,null,null,null,null,null,null,{"$f":"IF(H23=\"\",0,60+$F$7*(H23-$F$6)+SUM(I23:K23))","v":0},null,null,null,null,{"$f":"IF(M23=\"\",\"\",60+$F$7*(M23-$F$6)+SUM(N23:P23))","v":""},0]
[null,{"$f":"IF(R24=\"\",\"\",RANK(R24,$R$14:$R$27,0)+COUNTIFS($R$14:R24,R24)-1)","v":10},null,null,null,null,null,null,null,null,null,{"$f":"IF(H24=\"\",0,60+$F$7*(H24-$F$6)+SUM(I24:K24))","v":0},null,null,null,null,{"$f":"IF(M24=\"\",\"\",60+$F$7*(M24-$F$6)+SUM(N24:P24))","v":""},0]
[null,{"$f":"IF(R25=\"\",\"\",RANK(R25,$R$14:$R$27,0)+COUNTIFS($R$14:R25,R25)-1)","v":11},null,null,null,null,null,null,null,null,null,{"$f":"IF(H25=\"\",0,60+$F$7*(H25-$F$6)+SUM(I25:K25))","v":0},null,null,null,null,{"$f":"IF(M25=\"\",\"\",60+$F$7*(M25-$F$6)+SUM(N25:P25))","v":""},0]
[null,{"$f":"IF(R26=\"\",\"\",RANK(R26,$R$14:$R$27,0)+COUNTIFS($R$14:R26,R26)-1)","v":12},null,null,null,null,null,null,null,null,null,{"$f":"IF(H26=\"\",0,60+$F$7*(H26-$F$6)+SUM(I26:K26))","v":0},null,null,null,null,{"$f":"IF(M26=\"\",\"\",60+$F$7*(M26-$F$6)+SUM(N26:P26))","v":""},0]
[null,{"$f":"IF(R27=\"\",\"\",RANK(R27,$R$14:$R$27,0)+COUNTIFS($R$14:R27,R27)-1)","v":13},null,null,null,null,null,null,null,null,null,{"$f":"IF(H27=\"\",0,60+$F$7*(H27-$F$6)+SUM(I27:K27))","v":0},null,null,null,null,{"$f":"IF(M27=\"\",\"\",60+$F$7*(M27-$F$6)+SUM(N27:P27))","v":""},0]
[null,null,null,null,null,null,null,null,null,null,{"$f":"IF(G28=\"\",\"\",60+$F$7*(G28-$F$6)+SUM(H28:J28))","v":""},null,null,null,null,{"$f":"IF(L28=\"\",\"\",60+$F$7*(L28-$F$6)+SUM(M28:O28))","v":""},{"$f":"IF(AND(ISNUMBER(K28),ISNUMBER(P28)),K28+P28,\"\")","v":""}]
[]
[null,null,null,null,"Startliste kombinert - individuell kompakt"]
[null,null,null,null,null,null,null,"00:00:06"]
[null,"Plass. Hopp\n 1. omg","Start nr.","Navn","Klubb","F.år","Poeng hopp","Start tid","Tid i mål\nMM:SS,T",null,null,"Plassering"]
[null,{"$f":"IF(COUNTIF($F$14:$F$27,\"Komb\")>0,1,\"\")","v":1},{"$f":"_xlfn._xlws.SORT(_xlfn.HSTACK(_xlfn._xlws.FILTER($C$14:$E$27,$F$14:$F$27=\"Komb\",$L$14:$L$27>0),_xlfn._xlws.FILTER($G$14:$G$27,$F$14:$F$27=\"Komb\",$L$14:$L$27>0),_xlfn._xlws.FILTER($L$14:$L$27,$F$14:$F$27=\"Komb\",$L$14:$L$27>0)),5,-1)","v":78},"Odin Krog","Byåsen IL","G10",76,{"$f":"TIME(0,0,0)","v":"00:00:00"},"00:04:34",null,null,{"$f":"IF(C33=\"\",\"\",RANK(I33,$I$33:$I$48,1)+COUNTIF($I$33:I33,I33)-1)","v":1}]
[null,{"$f":"IFERROR(IF(B33+1>COUNTIF($F$14:$F$27,\"Komb\"),\"\",B33+1),\"\")","v":2},77,"Håkon Vien","Byåsen IL","G10",64.699999999999989,{"$f":"IF(B34=\"\",\"\",H33+TIME(0,0,6))","v":"00:00:06"},"00:05:17",null,null,{"$f":"IF(C34=\"\",\"\",RANK(I34,$I$33:$I$48,1)+COUNTIF($I$33:I34,I34)-1)","v":3}]
[null,{"$f":"IFERROR(IF(B34+1>COUNTIF($F$14:$F$27,\"Komb\"),\"\",B34+1),\"\")","v":3},75,"Casper Boldermo Rian","Byåsen IL","G9",56.199999999999996,{"$f":"IF(B35=\"\",\"\",H34+TIME(0,0,6))","v":"00:00:12"},"00:05:11",null,null,{"$f":"IF(C35=\"\",\"\",RANK(I35,$I$33:$I$48,1)+COUNTIF($I$33:I35,I35)-1)","v":2}]
[null,{"$f":"IFERROR(IF(B35+1>COUNTIF($F$14:$F$27,\"Komb\"),\"\",B35+1),\"\")","v":4},79,"Edvard Eidem","Byåsen IL","G11",54.9,"00:00:18","00:05:44",null,null,{"$f":"IF(C36=\"\",\"\",RANK(I36,$I$33:$I$48,1)+COUNTIF($I$33:I36,I36)-1)","v":4}]
[null,{"$f":"IFERROR(IF(B36+1>COUNTIF($F$14:$F$27,\"Komb\"),\"\",B36+1),\"\")","v":5},73,"Anker Wesche Fossheim","Byåsen IL","G9",50.5,"00:00:24","05;45,0",null,null,{"$f":"IF(C37=\"\",\"\",RANK(I37,$I$33:$I$48,1)+COUNTIF($I$33:I37,I37)-1)","v":{"$error":"#VALUE!"}}]
[null,{"$f":"IFERROR(IF(B37+1>COUNTIF($F$14:$F$27,\"Komb\"),\"\",B37+1),\"\")","v":6},74,"Erik Hermstad Mccrae","Byaasen Skiklub","G9",43.4,"00:00:30","00:09:52",null,null,{"$f":"IF(C38=\"\",\"\",RANK(I38,$I$33:$I$48,1)+COUNTIF($I$33:I38,I38)-1)","v":5}]
[null,{"$f":"IFERROR(IF(B38+1>COUNTIF($F$14:$F$27,\"Komb\"),\"\",B38+1),\"\")","v":""},null,null,null,null,null,"",null,null,null,{"$f":"IF(C39=\"\",\"\",RANK(I39,$I$33:$I$48,1)+COUNTIF($I$33:I39,I39)-1)","v":""}]
[null,{"$f":"IFERROR(IF(B39+1>COUNTIF($F$14:$F$27,\"Komb\"),\"\",B39+1),\"\")","v":""},null,null,null,null,null,"",null,null,null,{"$f":"IF(C40=\"\",\"\",RANK(I40,$I$33:$I$48,1)+COUNTIF($I$33:I40,I40)-1)","v":""}]
[null,{"$f":"IFERROR(IF(B40+1>COUNTIF($F$14:$F$27,\"Komb\"),\"\",B40+1),\"\")","v":""},null,null,null,null,null,"",null,null,null,{"$f":"IF(C41=\"\",\"\",RANK(I41,$I$33:$I$48,1)+COUNTIF($I$33:I41,I41)-1)","v":""}]
[null,{"$f":"IFERROR(IF(B41+1>COUNTIF($F$14:$F$27,\"Komb\"),\"\",B41+1),\"\")","v":""},null,null,null,null,null,"",null,null,null,{"$f":"IF(C42=\"\",\"\",RANK(I42,$I$33:$I$48,1)+COUNTIF($I$33:I42,I42)-1)","v":""}]
[null,{"$f":"IFERROR(IF(B42+1>COUNTIF($F$14:$F$27,\"Komb\"),\"\",B42+1),\"\")","v":""},null,null,null,null,null,"",null,null,null,{"$f":"IF(C43=\"\",\"\",RANK(I43,$I$33:$I$48,1)+COUNTIF($I$33:I43,I43)-1)","v":""}]
[null,{"$f":"IFERROR(IF(B43+1>COUNTIF($F$14:$F$27,\"Komb\"),\"\",B43+1),\"\")","v":""},null,null,null,null,null,"",null,null,null,{"$f":"IF(C44=\"\",\"\",RANK(I44,$I$33:$I$48,1)+COUNTIF($I$33:I44,I44)-1)","v":""}]
[null,{"$f":"IFERROR(IF(B44+1>COUNTIF($F$14:$F$27,\"Komb\"),\"\",B44+1),\"\")","v":""},null,null,null,null,null,"",null,null,null,{"$f":"IF(C45=\"\",\"\",RANK(I45,$I$33:$I$48,1)+COUNTIF($I$33:I45,I45)-1)","v":""}]
[null,{"$f":"IFERROR(IF(B45+1>COUNTIF($F$14:$F$27,\"Komb\"),\"\",B45+1),\"\")","v":""},null,null,null,null,null,"",null,null,null,{"$f":"IF(C46=\"\",\"\",RANK(I46,$I$33:$I$48,1)+COUNTIF($I$33:I46,I46)-1)","v":""}]
[null,{"$f":"IFERROR(IF(B46+1>COUNTIF($F$14:$F$27,\"Komb\"),\"\",B46+1),\"\")","v":""},null,null,null,null,null,"",null,null,null,{"$f":"IF(C47=\"\",\"\",RANK(I47,$I$33:$I$48,1)+COUNTIF($I$33:I47,I47)-1)","v":""}]
[null,{"$f":"IFERROR(IF(B47+1>COUNTIF($F$14:$F$27,\"Komb\"),\"\",B47+1),\"\")","v":""},null,null,null,null,null,"",null,null,null,{"$f":"IF(C48=\"\",\"\",RANK(I48,$I$33:$I$48,1)+COUNTIF($I$33:I48,I48)-1)","v":""}]
[]
[]
[null,null,null,null,"Resultatliste kombinert - individuell kompakt"]
[]
[null,"Plass","Start nr.","Navn","Klubb","F.år","Lengde","A","B","C","Poeng\nHopp","Starttid\nlangrenn","Tid\nlangr",null,"Tid i mål"]
[null,{"$f":"IF(COUNT($I$33:$I$48)>0,1,\"\")","v":1},{"$f":"IF(B54=\"\",\"\",_xlfn.XLOOKUP($B54,$L$33:$L$48,$C$33:$C$48,\"\",0,1))","v":78},{"$f":"IF(C54=\"\",\"\",_xlfn.XLOOKUP($C54,$C$33:$C$48,D$33:D$48,\"\",0,1))","v":"Odin Krog"},{"$f":"IF(D54=\"\",\"\",_xlfn.XLOOKUP($C54,$C$33:$C$48,E$33:E$48,\"\",0,1))","v":"Byåsen IL"},"G10",{"$f":"IF($C54=\"\",\"\",_xlfn.XLOOKUP($C54,$C$14:$C$27,H$14:H$27,\"\",0,1))","v":20},{"$f":"IF($C54=\"\",\"\",_xlfn.XLOOKUP($C54,$C$14:$C$27,I$14:I$27,\"\",0,1))","v":12.5},{"$f":"IF($C54=\"\",\"\",_xlfn.XLOOKUP($C54,$C$14:$C$27,J$14:J$27,\"\",0,1))","v":13},{"$f":"IF($C54=\"\",\"\",_xlfn.XLOOKUP($C54,$C$14:$C$27,K$14:K$27,\"\",0,1))","v":12.5},{"$f":"IF($C54=\"\",\"\",_xlfn.XLOOKUP($C54,$C$14:$C$27,L$14:L$27,\"\",0,1))","v":76},{"$f":"_xlfn.XLOOKUP(C54,$C$32:$C$48,$H$32:$H$48,\"\",0,1)","v":"00:00:00"},{"$f":"IF(C54=\"\",\"\",_xlfn.XLOOKUP(C54,$C$32:$C$48,$I$32:$I$48,\"\",0,1)-L54)","v":"00:04:34"},null,{"$f":"VLOOKUP(C54,C33:I48,7,FALSE)","v":"00:04:34"}]
[null,{"$f":"IFERROR(IF(B54+1>COUNT($I$33:$I$48),\"\",B54+1),\"\")","v":2},{"$f":"IF(B55=\"\",\"\",_xlfn.XLOOKUP($B55,$L$33:$L$48,$C$33:$C$48,\"\",0,1))","v":75},"Casper Boldermo Rian","Byåsen IL","G9",{"$f":"IF($C55=\"\",\"\",_xlfn.XLOOKUP($C55,$C$14:$C$27,H$14:H$27,\"\",0,1))","v":15.5},{"$f":"IF($C55=\"\",\"\",_xlfn.XLOOKUP($C55,$C$14:$C$27,I$14:I$27,\"\",0,1))","v":12.5},{"$f":"IF($C55=\"\",\"\",_xlfn.XLOOKUP($C55,$C$14:$C$27,J$14:J$27,\"\",0,1))","v":12.5},{"$f":"IF($C55=\"\",\"\",_xlfn.XLOOKUP($C55,$C$14:$C$27,K$14:K$27,\"\",0,1))","v":13},{"$f":"IF($C55=\"\",\"\",_xlfn.XLOOKUP($C55,$C$14:$C$27,L$14:L$27,\"\",0,1))","v":56.199999999999996},{"$f":"_xlfn.XLOOKUP(C55,$C$32:$C$48,$H$32:$H$48,\"\",0,1)","v":"00:00:12"},{"$f":"IF(C55=\"\",\"\",_xlfn.XLOOKUP(C55,$C$32:$C$48,$I$32:$I$48,\"\",0,1)-L55)","v":"00:04:59"},{"$f":"IF(C55=\"\",\"\",\"+\")","v":"+"},{"$f":"IF(C55=\"\",\"\",VLOOKUP($C55,$C$33:$I$48,7,0)-VLOOKUP($C$54,$C$33:$I$48,7,0))","v":"00:00:37"}]
[null,{"$f":"IFERROR(IF(B55+1>COUNT($I$33:$I$48),\"\",B55+1),\"\")","v":3},77,"Håkon Vien","Byåsen IL","G10",{"$f":"IF($C56=\"\",\"\",_xlfn.XLOOKUP($C56,$C$14:$C$27,H$14:H$27,\"\",0,1))","v":18},{"$f":"IF($C56=\"\",\"\",_xlfn.XLOOKUP($C56,$C$14:$C$27,I$14:I$27,\"\",0,1))","v":12},{"$f":"IF($C56=\"\",\"\",_xlfn.XLOOKUP($C56,$C$14:$C$27,J$14:J$27,\"\",0,1))","v":11.5},{"$f":"IF($C56=\"\",\"\",_xlfn.XLOOKUP($C56,$C$14:$C$27,K$14:K$27,\"\",0,1))","v":12},{"$f":"IF($C56=\"\",\"\",_xlfn.XLOOKUP($C56,$C$14:$C$27,L$14:L$27,\"\",0,1))","v":64.699999999999989},"00:00:06","00:05:11","+",{"$f":"IF(C56=\"\",\"\",VLOOKUP($C56,$C$33:$I$48,7,0)-VLOOKUP($C$54,$C$33:$I$48,7,0))","v":"00:00:43"}]
[null,4,79,"Edvard Eidem","Byåsen IL","G11",{"$f":"IF($C57=\"\",\"\",_xlfn.XLOOKUP($C57,$C$14:$C$27,H$14:H$27,\"\",0,1))","v":16},{"$f":"IF($C57=\"\",\"\",_xlfn.XLOOKUP($C57,$C$14:$C$27,I$14:I$27,\"\",0,1))","v":11.5},{"$f":"IF($C57=\"\",\"\",_xlfn.XLOOKUP($C57,$C$14:$C$27,J$14:J$27,\"\",0,1))","v":12},{"$f":"IF($C57=\"\",\"\",_xlfn.XLOOKUP($C57,$C$14:$C$27,K$14:K$27,\"\",0,1))","v":11},{"$f":"IF($C57=\"\",\"\",_xlfn.XLOOKUP($C57,$C$14:$C$27,L$14:L$27,\"\",0,1))","v":54.9},"00:00:18","00:05:26","+","00:01:10"]
[null,5,74,"Erik Hermstad Mccrae","Byaasen Skiklub","G9",{"$f":"IF($C58=\"\",\"\",_xlfn.XLOOKUP($C58,$C$14:$C$27,H$14:H$27,\"\",0,1))","v":13.5},{"$f":"IF($C58=\"\",\"\",_xlfn.XLOOKUP($C58,$C$14:$C$27,I$14:I$27,\"\",0,1))","v":11.5},{"$f":"IF($C58=\"\",\"\",_xlfn.XLOOKUP($C58,$C$14:$C$27,J$14:J$27,\"\",0,1))","v":11},{"$f":"IF($C58=\"\",\"\",_xlfn.XLOOKUP($C58,$C$14:$C$27,K$14:K$27,\"\",0,1))","v":11.5},{"$f":"IF($C58=\"\",\"\",_xlfn.XLOOKUP($C58,$C$14:$C$27,L$14:L$27,\"\",0,1))","v":43.4},"00:00:30","00:09:22","+","00:05:18"]
[null,"","","","","",{"$f":"IF($C59=\"\",\"\",_xlfn.XLOOKUP($C59,$C$14:$C$27,H$14:H$27,\"\",0,1))","v":""},{"$f":"IF($C59=\"\",\"\",_xlfn.XLOOKUP($C59,$C$14:$C$27,I$14:I$27,\"\",0,1))","v":""},{"$f":"IF($C59=\"\",\"\",_xlfn.XLOOKUP($C59,$C$14:$C$27,J$14:J$27,\"\",0,1))","v":""},{"$f":"IF($C59=\"\",\"\",_xlfn.XLOOKUP($C59,$C$14:$C$27,K$14:K$27,\"\",0,1))","v":""},{"$f":"IF($C59=\"\",\"\",_xlfn.XLOOKUP($C59,$C$14:$C$27,L$14:L$27,\"\",0,1))","v":""},"","","",""]
[null,"","","","","",{"$f":"IF($C60=\"\",\"\",_xlfn.XLOOKUP($C60,$C$14:$C$27,H$14:H$27,\"\",0,1))","v":""},{"$f":"IF($C60=\"\",\"\",_xlfn.XLOOKUP($C60,$C$14:$C$27,I$14:I$27,\"\",0,1))","v":""},{"$f":"IF($C60=\"\",\"\",_xlfn.XLOOKUP($C60,$C$14:$C$27,J$14:J$27,\"\",0,1))","v":""},{"$f":"IF($C60=\"\",\"\",_xlfn.XLOOKUP($C60,$C$14:$C$27,K$14:K$27,\"\",0,1))","v":""},{"$f":"IF($C60=\"\",\"\",_xlfn.XLOOKUP($C60,$C$14:$C$27,L$14:L$27,\"\",0,1))","v":""},"","","",""]
[null,"","","","","",{"$f":"IF($C61=\"\",\"\",_xlfn.XLOOKUP($C61,$C$14:$C$27,H$14:H$27,\"\",0,1))","v":""},{"$f":"IF($C61=\"\",\"\",_xlfn.XLOOKUP($C61,$C$14:$C$27,I$14:I$27,\"\",0,1))","v":""},{"$f":"IF($C61=\"\",\"\",_xlfn.XLOOKUP($C61,$C$14:$C$27,J$14:J$27,\"\",0,1))","v":""},{"$f":"IF($C61=\"\",\"\",_xlfn.XLOOKUP($C61,$C$14:$C$27,K$14:K$27,\"\",0,1))","v":""},{"$f":"IF($C61=\"\",\"\",_xlfn.XLOOKUP($C61,$C$14:$C$27,L$14:L$27,\"\",0,1))","v":""},"","","",""]
[null,"","","","","",{"$f":"IF($C62=\"\",\"\",_xlfn.XLOOKUP($C62,$C$14:$C$27,H$14:H$27,\"\",0,1))","v":""},{"$f":"IF($C62=\"\",\"\",_xlfn.XLOOKUP($C62,$C$14:$C$27,I$14:I$27,\"\",0,1))","v":""},{"$f":"IF($C62=\"\",\"\",_xlfn.XLOOKUP($C62,$C$14:$C$27,J$14:J$27,\"\",0,1))","v":""},{"$f":"IF($C62=\"\",\"\",_xlfn.XLOOKUP($C62,$C$14:$C$27,K$14:K$27,\"\",0,1))","v":""},{"$f":"IF($C62=\"\",\"\",_xlfn.XLOOKUP($C62,$C$14:$C$27,L$14:L$27,\"\",0,1))","v":""},"","","",""]
[null,"","","","","",{"$f":"IF($C63=\"\",\"\",_xlfn.XLOOKUP($C63,$C$14:$C$27,H$14:H$27,\"\",0,1))","v":""},{"$f":"IF($C63=\"\",\"\",_xlfn.XLOOKUP($C63,$C$14:$C$27,I$14:I$27,\"\",0,1))","v":""},{"$f":"IF($C63=\"\",\"\",_xlfn.XLOOKUP($C63,$C$14:$C$27,J$14:J$27,\"\",0,1))","v":""},{"$f":"IF($C63=\"\",\"\",_xlfn.XLOOKUP($C63,$C$14:$C$27,K$14:K$27,\"\",0,1))","v":""},{"$f":"IF($C63=\"\",\"\",_xlfn.XLOOKUP($C63,$C$14:$C$27,L$14:L$27,\"\",0,1))","v":""},"","","",""]
[null,"","","","","",{"$f":"IF($C64=\"\",\"\",_xlfn.XLOOKUP($C64,$C$14:$C$27,H$14:H$27,\"\",0,1))","v":""},{"$f":"IF($C64=\"\",\"\",_xlfn.XLOOKUP($C64,$C$14:$C$27,I$14:I$27,\"\",0,1))","v":""},{"$f":"IF($C64=\"\",\"\",_xlfn.XLOOKUP($C64,$C$14:$C$27,J$14:J$27,\"\",0,1))","v":""},{"$f":"IF($C64=\"\",\"\",_xlfn.XLOOKUP($C64,$C$14:$C$27,K$14:K$27,\"\",0,1))","v":""},{"$f":"IF($C64=\"\",\"\",_xlfn.XLOOKUP($C64,$C$14:$C$27,L$14:L$27,\"\",0,1))","v":""},"","","",""]
[null,"","","","","",{"$f":"IF($C65=\"\",\"\",_xlfn.XLOOKUP($C65,$C$14:$C$27,H$14:H$27,\"\",0,1))","v":""},{"$f":"IF($C65=\"\",\"\",_xlfn.XLOOKUP($C65,$C$14:$C$27,I$14:I$27,\"\",0,1))","v":""},{"$f":"IF($C65=\"\",\"\",_xlfn.XLOOKUP($C65,$C$14:$C$27,J$14:J$27,\"\",0,1))","v":""},{"$f":"IF($C65=\"\",\"\",_xlfn.XLOOKUP($C65,$C$14:$C$27,K$14:K$27,\"\",0,1))","v":""},{"$f":"IF($C65=\"\",\"\",_xlfn.XLOOKUP($C65,$C$14:$C$27,L$14:L$27,\"\",0,1))","v":""},"","","",""]
[null,"","","","","",{"$f":"IF($C66=\"\",\"\",_xlfn.XLOOKUP($C66,$C$14:$C$27,H$14:H$27,\"\",0,1))","v":""},{"$f":"IF($C66=\"\",\"\",_xlfn.XLOOKUP($C66,$C$14:$C$27,I$14:I$27,\"\",0,1))","v":""},{"$f":"IF($C66=\"\",\"\",_xlfn.XLOOKUP($C66,$C$14:$C$27,J$14:J$27,\"\",0,1))","v":""},{"$f":"IF($C66=\"\",\"\",_xlfn.XLOOKUP($C66,$C$14:$C$27,K$14:K$27,\"\",0,1))","v":""},{"$f":"IF($C66=\"\",\"\",_xlfn.XLOOKUP($C66,$C$14:$C$27,L$14:L$27,\"\",0,1))","v":""},"","","",""]
[null,"","","","","",{"$f":"IF($C67=\"\",\"\",_xlfn.XLOOKUP($C67,$C$14:$C$27,H$14:H$27,\"\",0,1))","v":""},{"$f":"IF($C67=\"\",\"\",_xlfn.XLOOKUP($C67,$C$14:$C$27,I$14:I$27,\"\",0,1))","v":""},{"$f":"IF($C67=\"\",\"\",_xlfn.XLOOKUP($C67,$C$14:$C$27,J$14:J$27,\"\",0,1))","v":""},{"$f":"IF($C67=\"\",\"\",_xlfn.XLOOKUP($C67,$C$14:$C$27,K$14:K$27,\"\",0,1))","v":""},{"$f":"IF($C67=\"\",\"\",_xlfn.XLOOKUP($C67,$C$14:$C$27,L$14:L$27,\"\",0,1))","v":""},"","","",""]
[null,"","","","","",{"$f":"IF($C68=\"\",\"\",_xlfn.XLOOKUP($C68,$C$14:$C$27,H$14:H$27,\"\",0,1))","v":""},{"$f":"IF($C68=\"\",\"\",_xlfn.XLOOKUP($C68,$C$14:$C$27,I$14:I$27,\"\",0,1))","v":""},{"$f":"IF($C68=\"\",\"\",_xlfn.XLOOKUP($C68,$C$14:$C$27,J$14:J$27,\"\",0,1))","v":""},{"$f":"IF($C68=\"\",\"\",_xlfn.XLOOKUP($C68,$C$14:$C$27,K$14:K$27,\"\",0,1))","v":""},{"$f":"IF($C68=\"\",\"\",_xlfn.XLOOKUP($C68,$C$14:$C$27,L$14:L$27,\"\",0,1))","v":""},"","","",""]
[null,"","","","","",{"$f":"IF($C69=\"\",\"\",_xlfn.XLOOKUP($C69,$C$14:$C$27,H$14:H$27,\"\",0,1))","v":""},{"$f":"IF($C69=\"\",\"\",_xlfn.XLOOKUP($C69,$C$14:$C$27,I$14:I$27,\"\",0,1))","v":""},{"$f":"IF($C69=\"\",\"\",_xlfn.XLOOKUP($C69,$C$14:$C$27,J$14:J$27,\"\",0,1))","v":""},{"$f":"IF($C69=\"\",\"\",_xlfn.XLOOKUP($C69,$C$14:$C$27,K$14:K$27,\"\",0,1))","v":""},{"$f":"IF($C69=\"\",\"\",_xlfn.XLOOKUP($C69,$C$14:$C$27,L$14:L$27,\"\",0,1))","v":""},"","","",""]

{"sheet":"K25 J","index":5,"n_rows":69,"n_cols":18,"rows_kept":69,"cut":false,"hidden":false,"merged":[[8,7,8,11],[8,12,8,16]]}
[]
[null,null,null,null,{"$f":"+'K2'!E2","v":"Namsosrennet i hopp og kombinert 01.02.2026"}]
[]
[]
[null,null,null,null,{"$f":"\"K\"&F6","v":"K25"},null,"Jenter"]
[null,null,null,null,"K-punkt:",25,"meter"]
[null,null,null,null,"Meterverdi:",{"$f":"VLOOKUP(F6,Meterverdier!A:B,2,FALSE)","v":4.4000000000000004},"poeng/meter"]
[]
[null,null,null,null,null,null,null,"1. omgang",null,null,null,null,"2. omgang"]
[null,null,"Start-",null,null,"Hopp/",null,null,null,null,null,null,null,null,null,null,null,"Poeng"]
[null,"Plassering","nr.","Navn","Klubb","Komb","F.år","Lengde","A","B","C","Poeng","Lengde","A","B","C","Poeng","totalt"]
[null,{"$f":"IF(R12=\"\",\"\",RANK(R12,$R$12:$R$27,0)+COUNTIFS($R$12:R12,R12)-1)","v":1},71,"Carmina Petrine B Kirknes","Namsos IL Hopp","Komb","J11",16.5,12,12,12.5,{"$f":"IF(H12=\"\",0,60+$F$7*(H12-$F$6)+SUM(I12:K12))","v":59.099999999999994},15.5,12.5,12.5,12.5,{"$f":"IF(M12=\"\",\"\",60+$F$7*(M12-$F$6)+SUM(N12:P12))","v":55.699999999999996},{"$f":"IF(AND(ISNUMBER(L12),ISNUMBER(Q12)),L12+Q12,0)","v":114.79999999999998}]
[null,{"$f":"IF(R13=\"\",\"\",RANK(R13,$R$12:$R$27,0)+COUNTIFS($R$12:R13,R13)-1)","v":2},72,"Charlotte Heldor Bach","Byåsen IL","Komb","J11",12,12,10,11,35.799999999999997,12.5,11.5,10.5,11,37.999999999999993,73.799999999999983]
[null,{"$f":"IF(R14=\"\",\"\",RANK(R14,$R$12:$R$27,0)+COUNTIFS($R$12:R14,R14)-1)","v":3},null,null,null,null,null,null,null,null,null,0,null,null,null,null,"",0]
[null,{"$f":"IF(R15=\"\",\"\",RANK(R15,$R$12:$R$27,0)+COUNTIFS($R$12:R15,R15)-1)","v":4},null,null,null,null,null,null,null,null,null,0,null,null,null,null,"",0]
[null,{"$f":"IF(R16=\"\",\"\",RANK(R16,$R$12:$R$27,0)+COUNTIFS($R$12:R16,R16)-1)","v":5},null,null,null,null,null,null,null,null,null,0,null,null,null,null,"",0]
[null,{"$f":"IF(R17=\"\",\"\",RANK(R17,$R$12:$R$27,0)+COUNTIFS($R$12:R17,R17)-1)","v":6},null,null,null,null,null,null,null,null,null,0,null,null,null,null,"",0]
[null,{"$f":"IF(R18=\"\",\"\",RANK(R18,$R$12:$R$27,0)+COUNTIFS($R$12:R18,R18)-1)","v":7},null,null,null,null,null,null,null,null,null,0,null,null,null,null,"",0]
[null,{"$f":"IF(R19=\"\",\"\",RANK(R19,$R$12:$R$27,0)+COUNTIFS($R$12:R19,R19)-1)","v":8},null,null,null,null,null,null,null,null,null,0,null,null,null,null,"",0]
[null,{"$f":"IF(R20=\"\",\"\",RANK(R20,$R$12:$R$27,0)+COUNTIFS($R$12:R20,R20)-1)","v":9},null,null,null,null,null,null,null,null,null,0,null,null,null,null,"",0]
[null,{"$f":"IF(R21=\"\",\"\",RANK(R21,$R$12:$R$27,0)+COUNTIFS($R$12:R21,R21)-1)","v":10},null,null,null,null,null,null,null,null,null,0,null,null,null,null,"",0]
[null,{"$f":"IF(R22=\"\",\"\",RANK(R22,$R$12:$R$27,0)+COUNTIFS($R$12:R22,R22)-1)","v":11},null,null,null,null,null,null,null,null,null,0,null,null,null,null,"",0]
[null,{"$f":"IF(R23=\"\",\"\",RANK(R23,$R$12:$R$27,0)+COUNTIFS($R$12:R23,R23)-1)","v":12},null,null,null,null,null,null,null,null,null,0,null,null,null,null,"",0]
[null,{"$f":"IF(R24=\"\",\"\",RANK(R24,$R$12:$R$27,0)+COUNTIFS($R$12:R24,R24)-1)","v":13},null,null,null,null,null,null,null,null,null,0,null,null,null,null,"",0]
[null,{"$f":"IF(R25=\"\",\"\",RANK(R25,$R$12:$R$27,0)+COUNTIFS($R$12:R25,R25)-1)","v":14},null,null,null,null,null,null,null,null,null,0,null,null,null,null,"",0]
[null,{"$f":"IF(R26=\"\",\"\",RANK(R26,$R$12:$R$27,0)+COUNTIFS($R$12:R26,R26)-1)","v":15},null,null,null,null,null,null,null,null,null,0,null,null,null,null,"",0]
[null,{"$f":"IF(R27=\"\",\"\",RANK(R27,$R$12:$R$27,0)+COUNTIFS($R$12:R27,R27)-1)","v":16},null,null,null,null,null,null,null,null,null,0,null,null,null,null,"",0]
[null,null,null,null,null,null,null,null,null,null,{"$f":"IF(G28=\"\",\"\",60+$F$7*(G28-$F$6)+SUM(H28:J28))","v":""},null,null,null,null,{"$f":"IF(L28=\"\",\"\",60+$F$7*(L28-$F$6)+SUM(M28:O28))","v":""},{"$f":"IF(AND(ISNUMBER(K28),ISNUMBER(P28)),K28+P28,\"\")","v":""}]
[]
[null,null,null,null,"Startliste kombinert - individuell kompakt"]
[]
[null,"Plass. Hopp\n 1. omg","Start nr.","Navn","Klubb","F.år","Poeng hopp","Start tid","Tid i mål\nMM:SS,T",null,null,"Plassering"]
[null,{"$f":"IF(COUNTIF($F$12:$F$27,\"Komb\")>0,1,\"\")","v":1},{"$f":"_xlfn._xlws.SORT(_xlfn.HSTACK(_xlfn._xlws.FILTER($C$12:$E$27,$F$12:$F$27=\"Komb\",$L$12:$L$27>0),_xlfn._xlws.FILTER($G$12:$G$27,$F$12:$F$27=\"Komb\",$L$12:$L$27>0),_xlfn._xlws.FILTER($L$12:$L$27,$F$12:$F$27=\"Komb\",$L$12:$L$27>0)),5,-1)","v":71},"Carmina Petrine B Kirknes","Namsos IL Hopp","J11",59.099999999999994,{"$f":"TIME(0,0,0)","v":"00:00:00"},null,null,null,{"$f":"IF(C33=\"\",\"\",RANK(I33,$I$33:$I$48,1)+COUNTIF($I$33:I33,I33)-1)","v":{"$error":"#N/A"}}]
[null,{"$f":"IFERROR(IF(B33+1>COUNTIF($F$12:$F$27,\"Komb\"),\"\",B33+1),\"\")","v":2},72,"Charlotte Heldor Bach","Byåsen IL","J11",35.799999999999997,{"$f":"IF(B34=\"\",\"\",H33+TIME(0,0,6))","v":"00:00:06"},"00:05:40",null,null,{"$f":"IF(C34=\"\",\"\",RANK(I34,$I$33:$I$48,1)+COUNTIF($I$33:I34,I34)-1)","v":1}]
[null,{"$f":"IFERROR(IF(B34+1>COUNTIF($F$12:$F$27,\"Komb\"),\"\",B34+1),\"\")","v":""},null,null,null,null,null,{"$f":"IF(B35=\"\",\"\",H34+TIME(0,0,6))","v":""},null,null,null,{"$f":"IF(C35=\"\",\"\",RANK(I35,$I$33:$I$48,1)+COUNTIF($I$33:I35,I35)-1)","v":""}]
[null,"",null,null,null,null,null,"",null,null,null,{"$f":"IF(C36=\"\",\"\",RANK(I36,$I$33:$I$48,1)+COUNTIF($I$33:I36,I36)-1)","v":""}]
[null,"",null,null,null,null,null,"",null,null,null,{"$f":"IF(C37=\"\",\"\",RANK(I37,$I$33:$I$48,1)+COUNTIF($I$33:I37,I37)-1)","v":""}]
[null,"",null,null,null,null,null,"",null,null,null,{"$f":"IF(C38=\"\",\"\",RANK(I38,$I$33:$I$48,1)+COUNTIF($I$33:I38,I38)-1)","v":""}]
[null,"",null,null,null,null,null,"",null,null,null,{"$f":"IF(C39=\"\",\"\",RANK(I39,$I$33:$I$48,1)+COUNTIF($I$33:I39,I39)-1)","v":""}]
[null,"",null,null,null,null,null,"",null,null,null,{"$f":"IF(C40=\"\",\"\",RANK(I40,$I$33:$I$48,1)+COUNTIF($I$33:I40,I40)-1)","v":""}]
[null,"",null,null,null,null,null,"",null,null,null,{"$f":"IF(C41=\"\",\"\",RANK(I41,$I$33:$I$48,1)+COUNTIF($I$33:I41,I41)-1)","v":""}]
[null,"",null,null,null,null,null,"",null,null,null,{"$f":"IF(C42=\"\",\"\",RANK(I42,$I$33:$I$48,1)+COUNTIF($I$33:I42,I42)-1)","v":""}]
[null,"",null,null,null,null,null,"",null,null,null,{"$f":"IF(C43=\"\",\"\",RANK(I43,$I$33:$I$48,1)+COUNTIF($I$33:I43,I43)-1)","v":""}]
[null,"",null,null,null,null,null,"",null,null,null,{"$f":"IF(C44=\"\",\"\",RANK(I44,$I$33:$I$48,1)+COUNTIF($I$33:I44,I44)-1)","v":""}]
[null,"",null,null,null,null,null,"",null,null,null,{"$f":"IF(C45=\"\",\"\",RANK(I45,$I$33:$I$48,1)+COUNTIF($I$33:I45,I45)-1)","v":""}]
[null,"",null,null,null,null,null,"",null,null,null,{"$f":"IF(C46=\"\",\"\",RANK(I46,$I$33:$I$48,1)+COUNTIF($I$33:I46,I46)-1)","v":""}]
[null,"",null,null,null,null,null,"",null,null,null,{"$f":"IF(C47=\"\",\"\",RANK(I47,$I$33:$I$48,1)+COUNTIF($I$33:I47,I47)-1)","v":""}]
[null,"",null,null,null,null,null,"",null,null,null,{"$f":"IF(C48=\"\",\"\",RANK(I48,$I$33:$I$48,1)+COUNTIF($I$33:I48,I48)-1)","v":""}]
[]
[]
[null,null,null,null,"Resultatliste kombinert - individuell kompakt"]
[]
[null,"Plass","Start nr.","Navn","Klubb","F.år","Lengde","A","B","C","Poeng\nHopp","Starttid\nlangrenn","Tid\nlangr",null,"Tid i mål"]
[null,{"$f":"IF(COUNT($I$33:$I$48)>0,1,\"\")","v":1},{"$f":"IF(B54=\"\",\"\",_xlfn.XLOOKUP($B54,$L$33:$L$48,$C$33:$C$48,\"\",0,1))","v":72},{"$f":"IF(C54=\"\",\"\",_xlfn.XLOOKUP($C54,$C$33:$C$48,D$33:D$48,\"\",0,1))","v":"Charlotte Heldor Bach"},"Byåsen IL","J11",{"$f":"IF($C54=\"\",\"\",_xlfn.XLOOKUP($C54,$C$12:$C$27,H$12:H$27,\"\",0,1))","v":12},{"$f":"IF($C54=\"\",\"\",_xlfn.XLOOKUP($C54,$C$12:$C$27,I$12:I$27,\"\",0,1))","v":12},10,11,35.799999999999997,{"$f":"_xlfn.XLOOKUP(C54,$C$32:$C$48,$H$32:$H$48,\"\",0,1)","v":"00:00:06"},{"$f":"IF(C54=\"\",\"\",_xlfn.XLOOKUP(C54,$C$32:$C$48,$I$32:$I$48,\"\",0,1)-L54)","v":"00:05:34"},null,{"$f":"VLOOKUP(C54,C33:I48,7,FALSE)","v":"00:05:40"}]
[null,{"$f":"IFERROR(IF(B54+1>COUNT($I$33:$I$48),\"\",B54+1),\"\")","v":""},{"$f":"IF(B55=\"\",\"\",_xlfn.XLOOKUP($B55,$L$33:$L$48,$C$33:$C$48,\"\",0,1))","v":""},"","","",{"$f":"IF($C55=\"\",\"\",_xlfn.XLOOKUP($C55,$C$12:$C$27,H$12:H$27,\"\",0,1))","v":""},"","","","",{"$f":"_xlfn.XLOOKUP(C55,$C$32:$C$48,$H$32:$H$48,\"\",0,1)","v":""},{"$f":"IF(C55=\"\",\"\",_xlfn.XLOOKUP(C55,$C$32:$C$48,$I$32:$I$48,\"\",0,1)-L55)","v":""},{"$f":"IF(C55=\"\",\"\",\"+\")","v":""},{"$f":"IF(C55=\"\",\"\",VLOOKUP($C55,$C$33:$I$48,7,0)-VLOOKUP($C$54,$C$33:$I$48,7,0))","v":""}]
[null,{"$f":"IFERROR(IF(B55+1>COUNT($I$33:$I$48),\"\",B55+1),\"\")","v":""},"","","","","","","","","","","","",{"$f":"IF(C56=\"\",\"\",VLOOKUP($C56,$C$33:$I$48,7,0)-VLOOKUP($C$54,$C$33:$I$48,7,0))","v":""}]
[null,"","","","","","","","","","","","","",""]
[null,"","","","","","","","","","","","","",""]
[null,"","","","","","","","","","","","","",""]
[null,"","","","","","","","","","","","","",""]
[null,"","","","","","","","","","","","","",""]
[null,"","","","","","","","","","","","","",""]
[null,"","","","","","","","","","","","","",""]
[null,"","","","","","","","","","","","","",""]
[null,"","","","","","","","","","","","","",""]
[null,"","","","","","","","","","","","","",""]
[null,"","","","","","","","","","","","","",""]
[null,"","","","","","","","","","","","","",""]
[null,"","","","","","","","","","","","","",""]

{"sheet":"K45 G","index":6,"n_rows":68,"n_cols":18,"rows_kept":68,"cut":false,"hidden":false,"merged":[[8,7,8,11],[8,12,8,16]]}
[]
[null,null,null,null,{"$f":"+'K2'!E2","v":"Namsosrennet i hopp og kombinert 01.02.2026"}]
[]
[]
[null,null,null,null,{"$f":"\"K\"&F6","v":"K45"},null,"Gutter"]
[null,null,null,null,"K-punkt:",45,"meter"]
[null,null,null,null,"Meterverdi:",{"$f":"VLOOKUP(F6,Meterverdier!A:B,2,FALSE)","v":3.2},"poeng/meter"]
[]
[null,null,null,null,null,null,null,"1. omgang",null,null,null,null,"2. omgang"]
[null,null,"Start-",null,null,"Hopp/",null,null,null,null,null,null,null,null,null,null,null,"Poeng"]
[null,"Plassering","nr.","Navn","Klubb","Komb","F.år","Lengde","A","B","C","Poeng","Lengde","A","B","C","Poeng","totalt"]
[null,{"$f":"IF(R12=\"\",\"\",RANK(R12,$R$12:$R$26,0)+COUNTIFS($R$12:R12,R12)-1)","v":3},65,"Marius Pleym Fiskum","Overhalla IL","Hopp","RC C",28.5,13.5,13.5,13.5,{"$f":"IF(H12=\"\",0,60+'K25 G'!$F$7*(H12-'K25 G'!$F$6)+SUM(I12:K12))","v":115.9},26.5,13,13,13.5,{"$f":"IF(M12=\"\",\"\",60+'K25 G'!$F$7*(M12-'K25 G'!$F$6)+SUM(N12:P12))","v":106.1},{"$f":"IF(AND(ISNUMBER(L12),ISNUMBER(Q12)),L12+Q12,0)","v":222}]
[null,null,76,"Aiden Maksim Svendsen","Skogn IL","Komb","G10",33,14,14,14,{"$f":"IF(H13=\"\",0,60+'K25 G'!$F$7*(H13-'K25 G'!$F$6)+SUM(I13:K13))","v":137.19999999999999},33,14.5,14.5,14,{"$f":"IF(M13=\"\",\"\",60+'K25 G'!$F$7*(M13-'K25 G'!$F$6)+SUM(N13:P13))","v":138.19999999999999},{"$f":"IF(AND(ISNUMBER(L13),ISNUMBER(Q13)),L13+Q13,0)","v":275.39999999999998}]
[null,{"$f":"IF(R14=\"\",\"\",RANK(R14,$R$14:$R$14,0)+COUNTIFS($R$14:R14,R14)-1)","v":1},80,"Peder Hafell","Steinkjer Skiklubb ","Hopp","G12",29,14,13.5,14,{"$f":"IF(H14=\"\",0,60+'K25 G'!$F$7*(H14-'K25 G'!$F$6)+SUM(I14:K14))","v":119.1},30,14,14,14,{"$f":"IF(M14=\"\",\"\",60+'K25 G'!$F$7*(M14-'K25 G'!$F$6)+SUM(N14:P14))","v":124},{"$f":"IF(AND(ISNUMBER(L14),ISNUMBER(Q14)),L14+Q14,0)","v":243.1}]
[null,{"$f":"IF(R15=\"\",\"\",RANK(R15,$R$12:$R$26,0)+COUNTIFS($R$12:R15,R15)-1)","v":4},null,null,null,null,null,null,null,null,null,{"$f":"IF(H15=\"\",0,60+$F$7*(H15-$F$6)+SUM(I15:K15))","v":0},null,null,null,null,{"$f":"IF(M15=\"\",\"\",60+$F$7*(M15-$F$6)+SUM(N15:P15))","v":""},0]
[null,{"$f":"IF(R16=\"\",\"\",RANK(R16,$R$12:$R$26,0)+COUNTIFS($R$12:R16,R16)-1)","v":5},null,null,null,null,null,null,null,null,null,0,null,null,null,null,"",0]
[null,{"$f":"IF(R17=\"\",\"\",RANK(R17,$R$12:$R$26,0)+COUNTIFS($R$12:R17,R17)-1)","v":6},null,null,null,null,null,null,null,null,null,0,null,null,null,null,"",0]
[null,{"$f":"IF(R18=\"\",\"\",RANK(R18,$R$12:$R$26,0)+COUNTIFS($R$12:R18,R18)-1)","v":7},null,null,null,null,null,null,null,null,null,0,null,null,null,null,"",0]
[null,{"$f":"IF(R19=\"\",\"\",RANK(R19,$R$12:$R$26,0)+COUNTIFS($R$12:R19,R19)-1)","v":8},null,null,null,null,null,null,null,null,null,0,null,null,null,null,"",0]
[null,{"$f":"IF(R20=\"\",\"\",RANK(R20,$R$12:$R$26,0)+COUNTIFS($R$12:R20,R20)-1)","v":9},null,null,null,null,null,null,null,null,null,0,null,null,null,null,"",0]
[null,{"$f":"IF(R21=\"\",\"\",RANK(R21,$R$12:$R$26,0)+COUNTIFS($R$12:R21,R21)-1)","v":10},null,null,null,null,null,null,null,null,null,0,null,null,null,null,"",0]
[null,{"$f":"IF(R22=\"\",\"\",RANK(R22,$R$12:$R$26,0)+COUNTIFS($R$12:R22,R22)-1)","v":11},null,null,null,null,null,null,null,null,null,0,null,null,null,null,"",0]
[null,{"$f":"IF(R23=\"\",\"\",RANK(R23,$R$12:$R$26,0)+COUNTIFS($R$12:R23,R23)-1)","v":12},null,null,null,null,null,null,null,null,null,0,null,null,null,null,"",0]
[null,{"$f":"IF(R24=\"\",\"\",RANK(R24,$R$12:$R$26,0)+COUNTIFS($R$12:R24,R24)-1)","v":13},null,null,null,null,null,null,null,null,null,0,null,null,null,null,"",0]
[null,{"$f":"IF(R25=\"\",\"\",RANK(R25,$R$12:$R$26,0)+COUNTIFS($R$12:R25,R25)-1)","v":14},null,null,null,null,null,null,null,null,null,0,null,null,null,null,"",0]
[null,{"$f":"IF(R26=\"\",\"\",RANK(R26,$R$12:$R$26,0)+COUNTIFS($R$12:R26,R26)-1)","v":15},null,null,null,null,null,null,null,null,null,0,null,null,null,null,"",0]
[null,null,null,null,null,null,null,null,null,null,{"$f":"IF(G27=\"\",\"\",60+$F$7*(G27-$F$6)+SUM(H27:J27))","v":""},null,null,null,null,{"$f":"IF(L27=\"\",\"\",60+$F$7*(L27-$F$6)+SUM(M27:O27))","v":""},{"$f":"IF(AND(ISNUMBER(K27),ISNUMBER(P27)),K27+P27,\"\")","v":""}]
[]
[null,null,null,null,"Startliste kombinert - individuell kompakt"]
[]
[null,"Plass. Hopp\n 1. omg","Start nr.","Navn","Klubb","F.år","Poeng hopp","Start tid","Tid i mål\nMM:SS,T",null,null,"Plassering"]
[null,{"$f":"IF(COUNTIF($F$12:$F$26,\"Komb\")>0,1,\"\")","v":1},{"$f":"_xlfn._xlws.SORT(_xlfn.HSTACK(_xlfn._xlws.FILTER($C$12:$E$26,$F$12:$F$26=\"Komb\",$L$12:$L$26>0),_xlfn._xlws.FILTER($G$12:$G$26,$F$12:$F$26=\"Komb\",$L$12:$L$26>0),_xlfn._xlws.FILTER($L$12:$L$26,$F$12:$F$26=\"Komb\",$L$12:$L$26>0)),5,-1)","v":76},"Aiden Maksim Svendsen","Skogn IL","G10",137.19999999999999,{"$f":"TIME(0,0,0)","v":"00:00:00"},null,null,null,{"$f":"IF(C32=\"\",\"\",RANK(I32,$I$32:$I$47,1)+COUNTIF($I$32:I32,I32)-1)","v":{"$error":"#N/A"}}]
[null,{"$f":"IFERROR(IF(B32+1>COUNTIF($F$12:$F$26,\"Komb\"),\"\",B32+1),\"\")","v":""},null,null,null,null,null,{"$f":"IF(B33=\"\",\"\",H32+TIME(0,0,6))","v":""},null,null,null,{"$f":"IF(C33=\"\",\"\",RANK(I33,$I$32:$I$47,1)+COUNTIF($I$32:I33,I33)-1)","v":""}]
[null,"",null,null,null,null,null,{"$f":"IF(B34=\"\",\"\",H33+TIME(0,0,6))","v":""},null,null,null,{"$f":"IF(C34=\"\",\"\",RANK(I34,$I$32:$I$47,1)+COUNTIF($I$32:I34,I34)-1)","v":""}]
[null,"",null,null,null,null,null,"",null,null,null,{"$f":"IF(C35=\"\",\"\",RANK(I35,$I$32:$I$47,1)+COUNTIF($I$32:I35,I35)-1)","v":""}]
[null,"",null,null,null,null,null,"",null,null,null,{"$f":"IF(C36=\"\",\"\",RANK(I36,$I$32:$I$47,1)+COUNTIF($I$32:I36,I36)-1)","v":""}]
[null,"",null,null,null,null,null,"",null,null,null,{"$f":"IF(C37=\"\",\"\",RANK(I37,$I$32:$I$47,1)+COUNTIF($I$32:I37,I37)-1)","v":""}]
[null,"",null,null,null,null,null,"",null,null,null,{"$f":"IF(C38=\"\",\"\",RANK(I38,$I$32:$I$47,1)+COUNTIF($I$32:I38,I38)-1)","v":""}]
[null,"",null,null,null,null,null,"",null,null,null,{"$f":"IF(C39=\"\",\"\",RANK(I39,$I$32:$I$47,1)+COUNTIF($I$32:I39,I39)-1)","v":""}]
[null,"",null,null,null,null,null,"",null,null,null,{"$f":"IF(C40=\"\",\"\",RANK(I40,$I$32:$I$47,1)+COUNTIF($I$32:I40,I40)-1)","v":""}]
[null,"",null,null,null,null,null,"",null,null,null,{"$f":"IF(C41=\"\",\"\",RANK(I41,$I$32:$I$47,1)+COUNTIF($I$32:I41,I41)-1)","v":""}]
[null,"",null,null,null,null,null,"",null,null,null,{"$f":"IF(C42=\"\",\"\",RANK(I42,$I$32:$I$47,1)+COUNTIF($I$32:I42,I42)-1)","v":""}]
[null,"",null,null,null,null,null,"",null,null,null,{"$f":"IF(C43=\"\",\"\",RANK(I43,$I$32:$I$47,1)+COUNTIF($I$32:I43,I43)-1)","v":""}]
[null,"",null,null,null,null,null,"",null,null,null,{"$f":"IF(C44=\"\",\"\",RANK(I44,$I$32:$I$47,1)+COUNTIF($I$32:I44,I44)-1)","v":""}]
[null,"",null,null,null,null,null,"",null,null,null,{"$f":"IF(C45=\"\",\"\",RANK(I45,$I$32:$I$47,1)+COUNTIF($I$32:I45,I45)-1)","v":""}]
[null,"",null,null,null,null,null,"",null,null,null,{"$f":"IF(C46=\"\",\"\",RANK(I46,$I$32:$I$47,1)+COUNTIF($I$32:I46,I46)-1)","v":""}]
[null,"",null,null,null,null,null,"",null,null,null,{"$f":"IF(C47=\"\",\"\",RANK(I47,$I$32:$I$47,1)+COUNTIF($I$32:I47,I47)-1)","v":""}]
[]
[]
[null,null,null,null,"Resultatliste kombinert - individuell kompakt"]
[]
[null,"Plass","Start nr.","Navn","Klubb","F.år","Lengde","A","B","C","Poeng\nHopp","Starttid\nlangrenn","Tid\nlangr",null,"Tid i mål"]
[null,{"$f":"IF(COUNT($I$32:$I$47)>0,1,\"\")","v":""},{"$f":"IF(B53=\"\",\"\",_xlfn.XLOOKUP($B53,$L$32:$L$47,$C$32:$C$47,\"\",0,1))","v":""},{"$f":"IF(C53=\"\",\"\",_xlfn.XLOOKUP($C53,$C$32:$C$47,D$32:D$47,\"\",0,1))","v":""},{"$f":"IF(D53=\"\",\"\",_xlfn.XLOOKUP($C53,$C$32:$C$47,E$32:E$47,\"\",0,1))","v":""},"",{"$f":"IF($C53=\"\",\"\",_xlfn.XLOOKUP($C53,$C$12:$C$26,H$12:H$26,\"\",0,1))","v":""},"","","","",{"$f":"_xlfn.XLOOKUP(C53,$C$31:$C$47,$H$31:$H$47,\"\",0,1)","v":""},{"$f":"IF(C53=\"\",\"\",_xlfn.XLOOKUP(C53,$C$31:$C$47,$I$31:$I$47,\"\",0,1)-L53)","v":""},null,{"$f":"VLOOKUP(C53,C32:I47,7,FALSE)","v":{"$error":"#N/A"}}]
[null,{"$f":"IFERROR(IF(B53+1>COUNT($I$32:$I$47),\"\",B53+1),\"\")","v":""},{"$f":"IF(B54=\"\",\"\",_xlfn.XLOOKUP($B54,$L$32:$L$47,$C$32:$C$47,\"\",0,1))","v":""},"","","","","","","","",{"$f":"_xlfn.XLOOKUP(C54,$C$31:$C$47,$H$31:$H$47,\"\",0,1)","v":""},{"$f":"IF(C54=\"\",\"\",_xlfn.XLOOKUP(C54,$C$31:$C$47,$I$31:$I$47,\"\",0,1)-L54)","v":""},{"$f":"IF(C54=\"\",\"\",\"+\")","v":""},{"$f":"IF(C54=\"\",\"\",VLOOKUP($C54,$C$32:$I$47,7,0)-VLOOKUP($C$53,$C$32:$I$47,7,0))","v":""}]
[null,{"$f":"IFERROR(IF(B54+1>COUNT($I$32:$I$47),\"\",B54+1),\"\")","v":""},"","","","","","","","","","","","",{"$f":"IF(C55=\"\",\"\",VLOOKUP($C55,$C$32:$I$47,7,0)-VLOOKUP($C$53,$C$32:$I$47,7,0))","v":""}]
[null,"","","","","","","","","","","","","",""]
[null,"","","","","","","","","","","","","",""]
[null,"","","","","","","","","","","","","",""]
[null,"","","","","","","","","","","","","",""]
[null,"","","","","","","","","","","","","",""]
[null,"","","","","","","","","","","","","",""]
[null,"","","","","","","","","","","","","",""]
[null,"","","","","",{"$f":"IF($C63=\"\",\"\",_xlfn.XLOOKUP($C63,$C$12:$C$26,H$12:H$26,\"\",0,1))","v":""},"","","","","","","",""]
[null,"","","","","","","","","","","","","",""]
[null,"","","","","","","","","","","","","",""]
[null,"","","","","","","","","","","","","",""]
[null,"","","","","","","","","","","","","",""]
[null,"","","","","","","","","","","","","",""]

{"sheet":"K45 J","index":7,"n_rows":65,"n_cols":18,"rows_kept":65,"cut":false,"hidden":false,"merged":[[8,7,8,11],[8,12,8,16]]}
[]
[null,null,null,null,{"$f":"+'K2'!E2","v":"Namsosrennet i hopp og kombinert 01.02.2026"}]
[]
[]
[null,null,null,null,{"$f":"\"K\"&F6","v":"K45"},null,"Jenter"]
[null,null,null,null,"K-punkt:",45,"meter"]
[null,null,null,null,"Meterverdi:",{"$f":"VLOOKUP(F6,Meterverdier!A:B,2,FALSE)","v":3.2},"poeng/meter"]
[]
[null,null,null,null,null,null,null,"1. omgang",null,null,null,null,"2. omgang"]
[null,null,"Start-",null,null,"Hopp/",null,null,null,null,null,null,null,null,null,null,null,"Poeng"]
[null,"Plassering","nr.","Navn","Klubb","Komb","F.år","Lengde","A","B","C","Poeng","Lengde","A","B","C","Poeng","totalt"]
[null,{"$f":"IF(R12=\"\",\"\",RANK(R12,$R$12:$R$23,0)+COUNTIFS($R$12:R13,R12)-1)","v":2},61,"Filippa Nordseth Fredriksen","Namsos IL Hopp","Komb","RC C",31.5,14,14,14,{"$f":"IF(H12=\"\",0,60+$F$7*(H12-$F$6)+SUM(I12:K12))","v":58.8},32.5,14,15,14.5,{"$f":"IF(M12=\"\",\"\",60+$F$7*(M12-$F$6)+SUM(N12:P12))","v":63.5},{"$f":"IF(AND(ISNUMBER(L12),ISNUMBER(Q12)),L12+Q12,0)","v":122.3}]
[null,{"$f":"IF(R13=\"\",\"\",RANK(R13,$R$12:$R$23,0)+COUNTIFS($R$12:R13,R13)-1)","v":4},62,"Ane Marie Kimo","Fjellørnen IL","Hopp","RC C",29.5,14.5,14.5,14,{"$f":"IF(H13=\"\",0,60+$F$7*(H13-$F$6)+SUM(I13:K13))","v":53.4},30,14.5,14,14,{"$f":"IF(M13=\"\",\"\",60+$F$7*(M13-$F$6)+SUM(N13:P13))","v":54.5},{"$f":"IF(AND(ISNUMBER(L13),ISNUMBER(Q13)),L13+Q13,0)","v":107.9}]
[null,{"$f":"IF(R14=\"\",\"\",RANK(R14,$R$12:$R$23,0)+COUNTIFS($R$12:R14,R14)-1)","v":3},63,"Elise Skjeflo","Steinkjer Skiklubb","Hopp","RC C",32.5,14,14.5,14,{"$f":"IF(H14=\"\",0,60+$F$7*(H14-$F$6)+SUM(I14:K14))","v":62.5},31.5,14,14.5,14,{"$f":"IF(M14=\"\",\"\",60+$F$7*(M14-$F$6)+SUM(N14:P14))","v":59.3},{"$f":"IF(AND(ISNUMBER(L14),ISNUMBER(Q14)),L14+Q14,0)","v":121.8}]
[null,{"$f":"IF(R15=\"\",\"\",RANK(R15,$R$12:$R$23,0)+COUNTIFS($R$12:R15,R15)-1)","v":1},64,"Kristine Storø","Namsos IL Hopp","Hopp","RC C",33.5,14.5,15,14.5,{"$f":"IF(H15=\"\",0,60+$F$7*(H15-$F$6)+SUM(I15:K15))","v":67.199999999999989},32.5,14,14.5,14.5,{"$f":"IF(M15=\"\",\"\",60+$F$7*(M15-$F$6)+SUM(N15:P15))","v":63},{"$f":"IF(AND(ISNUMBER(L15),ISNUMBER(Q15)),L15+Q15,0)","v":130.19999999999999}]
[null,{"$f":"IF(R16=\"\",\"\",RANK(R16,$R$12:$R$23,0)+COUNTIFS($R$12:R16,R16)-1)","v":5},null,null,null,null,null,null,null,null,null,{"$f":"IF(H16=\"\",0,60+$F$7*(H16-$F$6)+SUM(I16:K16))","v":0},null,null,null,null,{"$f":"IF(M16=\"\",\"\",60+$F$7*(M16-$F$6)+SUM(N16:P16))","v":""},{"$f":"IF(AND(ISNUMBER(L16),ISNUMBER(Q16)),L16+Q16,0)","v":0}]
[null,{"$f":"IF(R17=\"\",\"\",RANK(R17,$R$12:$R$23,0)+COUNTIFS($R$12:R17,R17)-1)","v":6},null,null,null,null,null,null,null,null,null,0,null,null,null,null,"",0]
[null,{"$f":"IF(R18=\"\",\"\",RANK(R18,$R$12:$R$23,0)+COUNTIFS($R$12:R18,R18)-1)","v":7},null,null,null,null,null,null,null,null,null,0,null,null,null,null,"",0]
[null,{"$f":"IF(R19=\"\",\"\",RANK(R19,$R$12:$R$23,0)+COUNTIFS($R$12:R19,R19)-1)","v":8},null,null,null,null,null,null,null,null,null,0,null,null,null,null,"",0]
[null,{"$f":"IF(R20=\"\",\"\",RANK(R20,$R$12:$R$23,0)+COUNTIFS($R$12:R20,R20)-1)","v":9},null,null,null,null,null,null,null,null,null,0,null,null,null,null,"",0]
[null,{"$f":"IF(R21=\"\",\"\",RANK(R21,$R$12:$R$23,0)+COUNTIFS($R$12:R21,R21)-1)","v":10},null,null,null,null,null,null,null,null,null,0,null,null,null,null,"",0]
[null,{"$f":"IF(R22=\"\",\"\",RANK(R22,$R$12:$R$23,0)+COUNTIFS($R$12:R22,R22)-1)","v":11},null,null,null,null,null,null,null,null,null,0,null,null,null,null,"",0]
[null,{"$f":"IF(R23=\"\",\"\",RANK(R23,$R$12:$R$23,0)+COUNTIFS($R$12:R23,R23)-1)","v":12},null,null,null,null,null,null,null,null,null,0,null,null,null,null,"",0]
[null,null,null,null,null,null,null,null,null,null,{"$f":"IF(G24=\"\",\"\",60+$F$7*(G24-$F$6)+SUM(H24:J24))","v":""},null,null,null,null,{"$f":"IF(L24=\"\",\"\",60+$F$7*(L24-$F$6)+SUM(M24:O24))","v":""},{"$f":"IF(AND(ISNUMBER(K24),ISNUMBER(P24)),K24+P24,\"\")","v":""}]
[]
[null,null,null,null,"Startliste kombinert - individuell kompakt"]
[]
[null,"Plass. Hopp\n 1. omg","Start nr.","Navn","Klubb","F.år","Poeng hopp","Start tid","Tid i mål\nMM:SS,T",null,null,"Plassering"]
[null,{"$f":"IF(COUNTIF($F$12:$F$23,\"Komb\")>0,1,\"\")","v":1},{"$f":"_xlfn._xlws.SORT(_xlfn.HSTACK(_xlfn._xlws.FILTER($C$12:$E$23,$F$12:$F$23=\"Komb\",$L$12:$L$23>0),_xlfn._xlws.FILTER($G$12:$G$23,$F$12:$F$23=\"Komb\",$L$12:$L$23>0),_xlfn._xlws.FILTER($L$12:$L$23,$F$12:$F$23=\"Komb\",$L$12:$L$23>0)),5,-1)","v":61},"Filippa Nordseth Fredriksen","Namsos IL Hopp","RC C",58.8,{"$f":"TIME(0,0,0)","v":"00:00:00"},"00:04:40",null,null,{"$f":"IF(C29=\"\",\"\",RANK(I29,$I$29:$I$44,1)+COUNTIF($I$29:I29,I29)-1)","v":1}]
[null,{"$f":"IFERROR(IF(B29+1>COUNTIF($F$12:$F$23,\"Komb\"),\"\",B29+1),\"\")","v":""},null,null,null,null,null,{"$f":"IF(B30=\"\",\"\",H29+TIME(0,0,6))","v":""},null,null,null,{"$f":"IF(C30=\"\",\"\",RANK(I30,$I$29:$I$44,1)+COUNTIF($I$29:I30,I30)-1)","v":""}]
[null,"",null,null,null,null,null,{"$f":"IF(B31=\"\",\"\",H30+TIME(0,0,6))","v":""},null,null,null,{"$f":"IF(C31=\"\",\"\",RANK(I31,$I$29:$I$44,1)+COUNTIF($I$29:I31,I31)-1)","v":""}]
[null,"",null,null,null,null,null,"",null,null,null,{"$f":"IF(C32=\"\",\"\",RANK(I32,$I$29:$I$44,1)+COUNTIF($I$29:I32,I32)-1)","v":""}]
[null,"",null,null,null,null,null,"",null,null,null,{"$f":"IF(C33=\"\",\"\",RANK(I33,$I$29:$I$44,1)+COUNTIF($I$29:I33,I33)-1)","v":""}]
[null,"",null,null,null,null,null,"",null,null,null,{"$f":"IF(C34=\"\",\"\",RANK(I34,$I$29:$I$44,1)+COUNTIF($I$29:I34,I34)-1)","v":""}]
[null,"",null,null,null,null,null,"",null,null,null,{"$f":"IF(C35=\"\",\"\",RANK(I35,$I$29:$I$44,1)+COUNTIF($I$29:I35,I35)-1)","v":""}]
[null,"",null,null,null,null,null,"",null,null,null,{"$f":"IF(C36=\"\",\"\",RANK(I36,$I$29:$I$44,1)+COUNTIF($I$29:I36,I36)-1)","v":""}]
[null,"",null,null,null,null,null,"",null,null,null,{"$f":"IF(C37=\"\",\"\",RANK(I37,$I$29:$I$44,1)+COUNTIF($I$29:I37,I37)-1)","v":""}]
[null,"",null,null,null,null,null,"",null,null,null,{"$f":"IF(C38=\"\",\"\",RANK(I38,$I$29:$I$44,1)+COUNTIF($I$29:I38,I38)-1)","v":""}]
[null,"",null,null,null,null,null,"",null,null,null,{"$f":"IF(C39=\"\",\"\",RANK(I39,$I$29:$I$44,1)+COUNTIF($I$29:I39,I39)-1)","v":""}]
[null,"",null,null,null,null,null,"",null,null,null,{"$f":"IF(C40=\"\",\"\",RANK(I40,$I$29:$I$44,1)+COUNTIF($I$29:I40,I40)-1)","v":""}]
[null,"",null,null,null,null,null,"",null,null,null,{"$f":"IF(C41=\"\",\"\",RANK(I41,$I$29:$I$44,1)+COUNTIF($I$29:I41,I41)-1)","v":""}]
[null,"",null,null,null,null,null,"",null,null,null,{"$f":"IF(C42=\"\",\"\",RANK(I42,$I$29:$I$44,1)+COUNTIF($I$29:I42,I42)-1)","v":""}]
[null,"",null,null,null,null,null,"",null,null,null,{"$f":"IF(C43=\"\",\"\",RANK(I43,$I$29:$I$44,1)+COUNTIF($I$29:I43,I43)-1)","v":""}]
[null,"",null,null,null,null,null,"",null,null,null,{"$f":"IF(C44=\"\",\"\",RANK(I44,$I$29:$I$44,1)+COUNTIF($I$29:I44,I44)-1)","v":""}]
[]
[]
[null,null,null,null,"Resultatliste kombinert - individuell kompakt"]
[]
[null,"Plass","Start nr.","Navn","Klubb","F.år","Lengde","A","B","C","Poeng\nHopp","Starttid\nlangrenn","Tid\nlangr",null,"Tid i mål"]
[null,{"$f":"IF(COUNT($I$29:$I$44)>0,1,\"\")","v":1},{"$f":"IF(B50=\"\",\"\",_xlfn.XLOOKUP($B50,$L$29:$L$44,$C$29:$C$44,\"\",0,1))","v":61},{"$f":"IF(C50=\"\",\"\",_xlfn.XLOOKUP($C50,$C$29:$C$44,D$29:D$44,\"\",0,1))","v":"Filippa Nordseth Fredriksen"},"Namsos IL Hopp","RC C",{"$f":"IF($C50=\"\",\"\",_xlfn.XLOOKUP($C50,$C$12:$C$23,H$12:H$23,\"\",0,1))","v":31.5},14,14,14,58.8,{"$f":"_xlfn.XLOOKUP(C50,$C$28:$C$44,$H$28:$H$44,\"\",0,1)","v":"00:00:00"},{"$f":"IF(C50=\"\",\"\",_xlfn.XLOOKUP(C50,$C$28:$C$44,$I$28:$I$44,\"\",0,1)-L50)","v":"00:04:40"},null,{"$f":"VLOOKUP(C50,C29:I44,7,FALSE)","v":"00:04:40"}]
[null,{"$f":"IFERROR(IF(B50+1>COUNT($I$29:$I$44),\"\",B50+1),\"\")","v":""},{"$f":"IF(B51=\"\",\"\",_xlfn.XLOOKUP($B51,$L$29:$L$44,$C$29:$C$44,\"\",0,1))","v":""},"","","","","","","","",{"$f":"_xlfn.XLOOKUP(C51,$C$28:$C$44,$H$28:$H$44,\"\",0,1)","v":""},{"$f":"IF(C51=\"\",\"\",_xlfn.XLOOKUP(C51,$C$28:$C$44,$I$28:$I$44,\"\",0,1)-L51)","v":""},{"$f":"IF(C51=\"\",\"\",\"+\")","v":""},{"$f":"IF(C51=\"\",\"\",VLOOKUP($C51,$C$29:$I$44,7,0)-VLOOKUP($C$50,$C$29:$I$44,7,0))","v":""}]
[null,{"$f":"IFERROR(IF(B51+1>COUNT($I$29:$I$44),\"\",B51+1),\"\")","v":""},"","","","","","","","","","","","",{"$f":"IF(C52=\"\",\"\",VLOOKUP($C52,$C$29:$I$44,7,0)-VLOOKUP($C$50,$C$29:$I$44,7,0))","v":""}]
[null,"","","","","","","","","","","","","",""]
[null,"","","","","","","","","","","","","",""]
[null,"","","","","","","","","","","","","",""]
[null,"","","","","","","","","","","","","",""]
[null,"","","","","","","","","","","","","",""]
[null,"","","","","","","","","","","","","",""]
[null,"","","","","","","","","","","","","",""]
[null,"","","","","",{"$f":"IF($C60=\"\",\"\",_xlfn.XLOOKUP($C60,$C$12:$C$23,H$12:H$23,\"\",0,1))","v":""},"","","","","","","",""]
[null,"","","","","","","","","","","","","",""]
[null,"","","","","","","","","","","","","",""]
[null,"","","","","","","","","","","","","",""]
[null,"","","","","","","","","","","","","",""]
[null,"","","","","","","","","","","","","",""]

{"sheet":"K40 RCB G","index":8,"n_rows":69,"n_cols":18,"rows_kept":69,"cut":false,"hidden":true,"merged":[[8,7,8,11],[8,12,8,16]]}
[]
[null,null,null,null,"Granåsenrennet - SMN 1 Trøndercup i hopp og kombinert 11.02.2024"]
[]
[]
[null,null,null,null,{"$f":"\"K\"&F6","v":"K40"},null,"RCB Gutter"]
[null,null,null,null,"K-punkt:",40,"meter"]
[null,null,null,null,"Meterverdi:",{"$f":"VLOOKUP(F6,Meterverdier!A:B,2,FALSE)","v":3.2},"poeng/meter"]
[]
[null,null,null,null,null,null,null,"1. omgang",null,null,null,null,"2. omgang"]
[null,null,"Start-",null,null,"Hopp/",null,null,null,null,null,null,null,null,null,null,null,"Poeng"]
[null,"Plassering","nr.","Navn","Klubb","Komb","F.år","Lengde","A","B","C","Poeng","Lengde","A","B","C","Poeng","totalt"]
[null,{"$f":"IF(R12=\"\",\"\",RANK(R12,$R$12:$R$27,0)+COUNTIFS($R$12:R12,R12)-1)","v":1},null,null,null,null,null,null,null,null,null,{"$f":"IF(H12=\"\",0,60+$F$7*(H12-$F$6)+SUM(I12:K12))","v":0},null,null,null,null,{"$f":"IF(M12=\"\",\"\",60+$F$7*(M12-$F$6)+SUM(N12:P12))","v":""},{"$f":"IF(AND(ISNUMBER(L12),ISNUMBER(Q12)),L12+Q12,0)","v":0}]
[null,{"$f":"IF(R13=\"\",\"\",RANK(R13,$R$12:$R$27,0)+COUNTIFS($R$12:R13,R13)-1)","v":2},null,null,null,null,null,null,null,null,null,0,null,null,null,null,{"$f":"IF(M13=\"\",\"\",60+$F$7*(M13-$F$6)+SUM(N13:P13))","v":""},0]
[null,{"$f":"IF(R14=\"\",\"\",RANK(R14,$R$12:$R$27,0)+COUNTIFS($R$12:R14,R14)-1)","v":3},null,null,null,null,null,null,null,null,null,0,null,null,null,null,{"$f":"IF(M14=\"\",\"\",60+$F$7*(M14-$F$6)+SUM(N14:P14))","v":""},0]
[null,{"$f":"IF(R15=\"\",\"\",RANK(R15,$R$12:$R$27,0)+COUNTIFS($R$12:R15,R15)-1)","v":4},null,null,null,null,null,null,null,null,null,0,null,null,null,null,{"$f":"IF(M15=\"\",\"\",60+$F$7*(M15-$F$6)+SUM(N15:P15))","v":""},0]
[null,{"$f":"IF(R16=\"\",\"\",RANK(R16,$R$12:$R$27,0)+COUNTIFS($R$12:R16,R16)-1)","v":5},null,null,null,null,null,null,null,null,null,0,null,null,null,null,{"$f":"IF(M16=\"\",\"\",60+$F$7*(M16-$F$6)+SUM(N16:P16))","v":""},0]
[null,{"$f":"IF(R17=\"\",\"\",RANK(R17,$R$12:$R$27,0)+COUNTIFS($R$12:R17,R17)-1)","v":6},null,null,null,null,null,null,null,null,null,0,null,null,null,null,"",0]
[null,{"$f":"IF(R18=\"\",\"\",RANK(R18,$R$12:$R$27,0)+COUNTIFS($R$12:R18,R18)-1)","v":7},null,null,null,null,null,null,null,null,null,0,null,null,null,null,"",0]
[null,{"$f":"IF(R19=\"\",\"\",RANK(R19,$R$12:$R$27,0)+COUNTIFS($R$12:R19,R19)-1)","v":8},null,null,null,null,null,null,null,null,null,0,null,null,null,null,"",0]
[null,{"$f":"IF(R20=\"\",\"\",RANK(R20,$R$12:$R$27,0)+COUNTIFS($R$12:R20,R20)-1)","v":9},null,null,null,null,null,null,null,null,null,0,null,null,null,null,"",0]
[null,{"$f":"IF(R21=\"\",\"\",RANK(R21,$R$12:$R$27,0)+COUNTIFS($R$12:R21,R21)-1)","v":10},null,null,null,null,null,null,null,null,null,0,null,null,null,null,"",0]
[null,{"$f":"IF(R22=\"\",\"\",RANK(R22,$R$12:$R$27,0)+COUNTIFS($R$12:R22,R22)-1)","v":11},null,null,null,null,null,null,null,null,null,0,null,null,null,null,"",0]
[null,{"$f":"IF(R23=\"\",\"\",RANK(R23,$R$12:$R$27,0)+COUNTIFS($R$12:R23,R23)-1)","v":12},null,null,null,null,null,null,null,null,null,0,null,null,null,null,"",0]
[null,{"$f":"IF(R24=\"\",\"\",RANK(R24,$R$12:$R$27,0)+COUNTIFS($R$12:R24,R24)-1)","v":13},null,null,null,null,null,null,null,null,null,0,null,null,null,null,"",0]
[null,{"$f":"IF(R25=\"\",\"\",RANK(R25,$R$12:$R$27,0)+COUNTIFS($R$12:R25,R25)-1)","v":14},null,null,null,null,null,null,null,null,null,0,null,null,null,null,"",0]
[null,{"$f":"IF(R26=\"\",\"\",RANK(R26,$R$12:$R$27,0)+COUNTIFS($R$12:R26,R26)-1)","v":15},null,null,null,null,null,null,null,null,null,0,null,null,null,null,"",0]
[null,{"$f":"IF(R27=\"\",\"\",RANK(R27,$R$12:$R$27,0)+COUNTIFS($R$12:R27,R27)-1)","v":16},null,null,null,null,null,null,null,null,null,0,null,null,null,null,"",0]
[null,null,null,null,null,null,null,null,null,null,{"$f":"IF(G28=\"\",\"\",60+$F$7*(G28-$F$6)+SUM(H28:J28))","v":""},null,null,null,null,{"$f":"IF(L28=\"\",\"\",60+$F$7*(L28-$F$6)+SUM(M28:O28))","v":""},{"$f":"IF(AND(ISNUMBER(K28),ISNUMBER(P28)),K28+P28,\"\")","v":""}]
[]
[null,null,null,null,"Startliste kombinert - individuell kompakt"]
[]
[null,"Plass. Hopp\n 1. omg","Start nr.","Navn","Klubb","F.år","Poeng hopp","Start tid","Tid i mål\nMM:SS,T",null,null,"Plassering"]
[null,{"$f":"IF(COUNTIF($F$12:$F$27,\"Komb\")>0,1,\"\")","v":""},{"$f":"_xlfn._xlws.SORT(_xlfn.HSTACK(_xlfn._xlws.FILTER($C$12:$E$27,$F$12:$F$27=\"Komb\",$L$12:$L$27>0),_xlfn._xlws.FILTER($G$12:$G$27,$F$12:$F$27=\"Komb\",$L$12:$L$27>0),_xlfn._xlws.FILTER($L$12:$L$27,$F$12:$F$27=\"Komb\",$L$12:$L$27>0)),5,-1)","v":{"$error":"#VALUE!"}},null,null,null,null,{"$f":"TIME(0,0,0)","v":"00:00:00"},"00:01:11.300",null,null,{"$f":"IF(C33=\"\",\"\",RANK(I33,$I$33:$I$48,1)+COUNTIF($I$33:I33,I33)-1)","v":{"$error":"#VALUE!"}}]
[null,{"$f":"IFERROR(IF(B33+1>COUNTIF($F$12:$F$27,\"Komb\"),\"\",B33+1),\"\")","v":""},null,null,null,null,null,{"$f":"IF(B34=\"\",\"\",H33+TIME(0,0,6))","v":""},"00:01:10.100",null,null,{"$f":"IF(C34=\"\",\"\",RANK(I34,$I$33:$I$48,1)+COUNTIF($I$33:I34,I34)-1)","v":""}]
[null,{"$f":"IFERROR(IF(B34+1>COUNTIF($F$12:$F$27,\"Komb\"),\"\",B34+1),\"\")","v":""},null,null,null,null,null,{"$f":"IF(B35=\"\",\"\",H34+TIME(0,0,6))","v":""},"00:02:03.400",null,null,{"$f":"IF(C35=\"\",\"\",RANK(I35,$I$33:$I$48,1)+COUNTIF($I$33:I35,I35)-1)","v":""}]
[null,"",null,null,null,null,null,"","00:01:23.400",null,null,{"$f":"IF(C36=\"\",\"\",RANK(I36,$I$33:$I$48,1)+COUNTIF($I$33:I36,I36)-1)","v":""}]
[null,"",null,null,null,null,null,"",null,null,null,{"$f":"IF(C37=\"\",\"\",RANK(I37,$I$33:$I$48,1)+COUNTIF($I$33:I37,I37)-1)","v":""}]
[null,"",null,null,null,null,null,"",null,null,null,{"$f":"IF(C38=\"\",\"\",RANK(I38,$I$33:$I$48,1)+COUNTIF($I$33:I38,I38)-1)","v":""}]
[null,"",null,null,null,null,null,"",null,null,null,{"$f":"IF(C39=\"\",\"\",RANK(I39,$I$33:$I$48,1)+COUNTIF($I$33:I39,I39)-1)","v":""}]
[null,"",null,null,null,null,null,"",null,null,null,{"$f":"IF(C40=\"\",\"\",RANK(I40,$I$33:$I$48,1)+COUNTIF($I$33:I40,I40)-1)","v":""}]
[null,"",null,null,null,null,null,"",null,null,null,{"$f":"IF(C41=\"\",\"\",RANK(I41,$I$33:$I$48,1)+COUNTIF($I$33:I41,I41)-1)","v":""}]
[null,"",null,null,null,null,null,"",null,null,null,{"$f":"IF(C42=\"\",\"\",RANK(I42,$I$33:$I$48,1)+COUNTIF($I$33:I42,I42)-1)","v":""}]
[null,"",null,null,null,null,null,"",null,null,null,{"$f":"IF(C43=\"\",\"\",RANK(I43,$I$33:$I$48,1)+COUNTIF($I$33:I43,I43)-1)","v":""}]
[null,"",null,null,null,null,null,"",null,null,null,{"$f":"IF(C44=\"\",\"\",RANK(I44,$I$33:$I$48,1)+COUNTIF($I$33:I44,I44)-1)","v":""}]
[null,"",null,null,null,null,null,"",null,null,null,{"$f":"IF(C45=\"\",\"\",RANK(I45,$I$33:$I$48,1)+COUNTIF($I$33:I45,I45)-1)","v":""}]
[null,"",null,null,null,null,null,"",null,null,null,{"$f":"IF(C46=\"\",\"\",RANK(I46,$I$33:$I$48,1)+COUNTIF($I$33:I46,I46)-1)","v":""}]
[null,"",null,null,null,null,null,"",null,null,null,{"$f":"IF(C47=\"\",\"\",RANK(I47,$I$33:$I$48,1)+COUNTIF($I$33:I47,I47)-1)","v":""}]
[null,"",null,null,null,null,null,"",null,null,null,{"$f":"IF(C48=\"\",\"\",RANK(I48,$I$33:$I$48,1)+COUNTIF($I$33:I48,I48)-1)","v":""}]
[]
[]
[null,null,null,null,"Resultatliste kombinert - individuell kompakt"]
[]
[null,"Plass","Start nr.","Navn","Klubb","F.år","Lengde","A","B","C","Poeng\nHopp","Starttid\nlangrenn","Tid\nlangr",null,"Tid i mål"]
[null,{"$f":"IF(COUNT($I$33:$I$48)>0,1,\"\")","v":1},{"$f":"IF(B54=\"\",\"\",_xlfn.XLOOKUP($B54,$L$33:$L$48,$C$33:$C$48,\"\",0,1))","v":""},{"$f":"IF(C54=\"\",\"\",_xlfn.XLOOKUP($C54,$C$33:$C$48,D$33:D$48,\"\",0,1))","v":""},{"$f":"IF(D54=\"\",\"\",_xlfn.XLOOKUP($C54,$C$33:$C$48,E$33:E$48,\"\",0,1))","v":""},"",{"$f":"IF($C54=\"\",\"\",_xlfn.XLOOKUP($C54,$C$12:$C$27,H$12:H$27,\"\",0,1))","v":""},{"$f":"IF($C54=\"\",\"\",_xlfn.XLOOKUP($C54,$C$12:$C$27,I$12:I$27,\"\",0,1))","v":""},"","","",{"$f":"_xlfn.XLOOKUP(C54,$C$32:$C$48,$H$32:$H$48,\"\",0,1)","v":""},{"$f":"IF(C54=\"\",\"\",_xlfn.XLOOKUP(C54,$C$32:$C$48,$I$32:$I$48,\"\",0,1)-L54)","v":""},null,{"$f":"VLOOKUP(C54,C33:I48,7,FALSE)","v":{"$error":"#N/A"}}]
[null,{"$f":"IFERROR(IF(B54+1>COUNT($I$33:$I$48),\"\",B54+1),\"\")","v":2},{"$f":"IF(B55=\"\",\"\",_xlfn.XLOOKUP($B55,$L$33:$L$48,$C$33:$C$48,\"\",0,1))","v":""},"","","",{"$f":"IF($C55=\"\",\"\",_xlfn.XLOOKUP($C55,$C$12:$C$27,H$12:H$27,\"\",0,1))","v":""},"","","","",{"$f":"_xlfn.XLOOKUP(C55,$C$32:$C$48,$H$32:$H$48,\"\",0,1)","v":""},{"$f":"IF(C55=\"\",\"\",_xlfn.XLOOKUP(C55,$C$32:$C$48,$I$32:$I$48,\"\",0,1)-L55)","v":""},{"$f":"IF(C55=\"\",\"\",\"+\")","v":""},{"$f":"IF(C55=\"\",\"\",VLOOKUP($C55,$C$33:$I$48,7,0)-VLOOKUP($C$54,$C$33:$I$48,7,0))","v":""}]
[null,{"$f":"IFERROR(IF(B55+1>COUNT($I$33:$I$48),\"\",B55+1),\"\")","v":3},"","","","","","","","","","","","",{"$f":"IF(C56=\"\",\"\",VLOOKUP($C56,$C$33:$I$48,7,0)-VLOOKUP($C$54,$C$33:$I$48,7,0))","v":""}]
[null,4,"","","","","","","","","","","","",""]
[null,"","","","","","","","","","","","","",""]
[null,"","","","","","","","","","","","","",""]
[null,"","","","","","","","","","","","","",""]
[null,"","","","","","","","","","","","","",""]
[null,"","","","","","","","","","","","","",""]
[null,"","","","","","","","","","","","","",""]
[null,"","","","","","","","","","","","","",""]
[null,"","","","","","","","","","","","","",""]
[null,"","","","","","","","","","","","","",""]
[null,"","","","","","","","","","","","","",""]
[null,"","","","","","","","","","","","","",""]
[null,"","","","","","","","","","","","","",""]

{"sheet":"K40 RCB J","index":9,"n_rows":69,"n_cols":18,"rows_kept":69,"cut":false,"hidden":true,"merged":[[8,7,8,11],[8,12,8,16]]}
[]
[null,null,null,null,"Granåsenrennet - SMN 1 Trøndercup i hopp og kombinert 11.02.2024"]
[]
[]
[null,null,null,null,{"$f":"\"K\"&F6","v":"K40"},null,"RCB Jenter"]
[null,null,null,null,"K-punkt:",40,"meter"]
[null,null,null,null,"Meterverdi:",{"$f":"VLOOKUP(F6,Meterverdier!A:B,2,FALSE)","v":3.2},"poeng/meter"]
[]
[null,null,null,null,null,null,null,"1. omgang",null,null,null,null,"2. omgang"]
[null,null,"Start-",null,null,"Hopp/",null,null,null,null,null,null,null,null,null,null,null,"Poeng"]
[null,"Plassering","nr.","Navn","Klubb","Komb","F.år","Lengde","A","B","C","Poeng","Lengde","A","B","C","Poeng","totalt"]
[null,{"$f":"IF(R12=\"\",\"\",RANK(R12,$R$12:$R$27,0)+COUNTIFS($R$12:R12,R12)-1)","v":1},null,null,null,null,null,null,null,null,null,{"$f":"IF(H12=\"\",0,60+$F$7*(H12-$F$6)+SUM(I12:K12))","v":0},null,null,null,null,{"$f":"IF(M12=\"\",\"\",60+$F$7*(M12-$F$6)+SUM(N12:P12))","v":""},{"$f":"IF(AND(ISNUMBER(L12),ISNUMBER(Q12)),L12+Q12,0)","v":0}]
[null,{"$f":"IF(R13=\"\",\"\",RANK(R13,$R$12:$R$27,0)+COUNTIFS($R$12:R13,R13)-1)","v":2},null,null,null,null,null,null,null,null,null,0,null,null,null,null,{"$f":"IF(M13=\"\",\"\",60+$F$7*(M13-$F$6)+SUM(N13:P13))","v":""},0]
[null,{"$f":"IF(R14=\"\",\"\",RANK(R14,$R$12:$R$27,0)+COUNTIFS($R$12:R14,R14)-1)","v":3},null,null,null,null,null,null,null,null,null,0,null,null,null,null,{"$f":"IF(M14=\"\",\"\",60+$F$7*(M14-$F$6)+SUM(N14:P14))","v":""},0]
[null,{"$f":"IF(R15=\"\",\"\",RANK(R15,$R$12:$R$27,0)+COUNTIFS($R$12:R15,R15)-1)","v":4},null,null,null,null,null,null,null,null,null,0,null,null,null,null,{"$f":"IF(M15=\"\",\"\",60+$F$7*(M15-$F$6)+SUM(N15:P15))","v":""},0]
[null,{"$f":"IF(R16=\"\",\"\",RANK(R16,$R$12:$R$27,0)+COUNTIFS($R$12:R16,R16)-1)","v":5},null,null,null,null,null,null,null,null,null,0,null,null,null,null,{"$f":"IF(M16=\"\",\"\",60+$F$7*(M16-$F$6)+SUM(N16:P16))","v":""},0]
[null,{"$f":"IF(R17=\"\",\"\",RANK(R17,$R$12:$R$27,0)+COUNTIFS($R$12:R17,R17)-1)","v":6},null,null,null,null,null,null,null,null,null,0,null,null,null,null,"",0]
[null,{"$f":"IF(R18=\"\",\"\",RANK(R18,$R$12:$R$27,0)+COUNTIFS($R$12:R18,R18)-1)","v":7},null,null,null,null,null,null,null,null,null,0,null,null,null,null,"",0]
[null,{"$f":"IF(R19=\"\",\"\",RANK(R19,$R$12:$R$27,0)+COUNTIFS($R$12:R19,R19)-1)","v":8},null,null,null,null,null,null,null,null,null,0,null,null,null,null,"",0]
[null,{"$f":"IF(R20=\"\",\"\",RANK(R20,$R$12:$R$27,0)+COUNTIFS($R$12:R20,R20)-1)","v":9},null,null,null,null,null,null,null,null,null,0,null,null,null,null,"",0]
[null,{"$f":"IF(R21=\"\",\"\",RANK(R21,$R$12:$R$27,0)+COUNTIFS($R$12:R21,R21)-1)","v":10},null,null,null,null,null,null,null,null,null,0,null,null,null,null,"",0]
[null,{"$f":"IF(R22=\"\",\"\",RANK(R22,$R$12:$R$27,0)+COUNTIFS($R$12:R22,R22)-1)","v":11},null,null,null,null,null,null,null,null,null,0,null,null,null,null,"",0]
[null,{"$f":"IF(R23=\"\",\"\",RANK(R23,$R$12:$R$27,0)+COUNTIFS($R$12:R23,R23)-1)","v":12},null,null,null,null,null,null,null,null,null,0,null,null,null,null,"",0]
[null,{"$f":"IF(R24=\"\",\"\",RANK(R24,$R$12:$R$27,0)+COUNTIFS($R$12:R24,R24)-1)","v":13},null,null,null,null,null,null,null,null,null,0,null,null,null,null,"",0]
[null,{"$f":"IF(R25=\"\",\"\",RANK(R25,$R$12:$R$27,0)+COUNTIFS($R$12:R25,R25)-1)","v":14},null,null,null,null,null,null,null,null,null,0,null,null,null,null,"",0]
[null,{"$f":"IF(R26=\"\",\"\",RANK(R26,$R$12:$R$27,0)+COUNTIFS($R$12:R26,R26)-1)","v":15},null,null,null,null,null,null,null,null,null,0,null,null,null,null,"",0]
[null,{"$f":"IF(R27=\"\",\"\",RANK(R27,$R$12:$R$27,0)+COUNTIFS($R$12:R27,R27)-1)","v":16},null,null,null,null,null,null,null,null,null,0,null,null,null,null,"",0]
[null,null,null,null,null,null,null,null,null,null,{"$f":"IF(G28=\"\",\"\",60+$F$7*(G28-$F$6)+SUM(H28:J28))","v":""},null,null,null,null,{"$f":"IF(L28=\"\",\"\",60+$F$7*(L28-$F$6)+SUM(M28:O28))","v":""},{"$f":"IF(AND(ISNUMBER(K28),ISNUMBER(P28)),K28+P28,\"\")","v":""}]
[]
[null,null,null,null,"Startliste kombinert - individuell kompakt"]
[]
[null,"Plass. Hopp\n 1. omg","Start nr.","Navn","Klubb","F.år","Poeng hopp","Start tid","Tid i mål\nMM:SS,T",null,null,"Plassering"]
[null,{"$f":"IF(COUNTIF($F$12:$F$27,\"Komb\")>0,1,\"\")","v":""},{"$f":"_xlfn._xlws.SORT(_xlfn.HSTACK(_xlfn._xlws.FILTER($C$12:$E$27,$F$12:$F$27=\"Komb\",$L$12:$L$27>0),_xlfn._xlws.FILTER($G$12:$G$27,$F$12:$F$27=\"Komb\",$L$12:$L$27>0),_xlfn._xlws.FILTER($L$12:$L$27,$F$12:$F$27=\"Komb\",$L$12:$L$27>0)),5,-1)","v":{"$error":"#VALUE!"}},null,null,null,null,{"$f":"TIME(0,0,0)","v":"00:00:00"},"00:01:11.300",null,null,{"$f":"IF(C33=\"\",\"\",RANK(I33,$I$33:$I$48,1)+COUNTIF($I$33:I33,I33)-1)","v":{"$error":"#VALUE!"}}]
[null,{"$f":"IFERROR(IF(B33+1>COUNTIF($F$12:$F$27,\"Komb\"),\"\",B33+1),\"\")","v":""},null,null,null,null,null,{"$f":"IF(B34=\"\",\"\",H33+TIME(0,0,6))","v":""},"00:01:10.100",null,null,{"$f":"IF(C34=\"\",\"\",RANK(I34,$I$33:$I$48,1)+COUNTIF($I$33:I34,I34)-1)","v":""}]
[null,{"$f":"IFERROR(IF(B34+1>COUNTIF($F$12:$F$27,\"Komb\"),\"\",B34+1),\"\")","v":""},null,null,null,null,null,{"$f":"IF(B35=\"\",\"\",H34+TIME(0,0,6))","v":""},"00:02:03.400",null,null,{"$f":"IF(C35=\"\",\"\",RANK(I35,$I$33:$I$48,1)+COUNTIF($I$33:I35,I35)-1)","v":""}]
[null,"",null,null,null,null,null,"","00:01:23.400",null,null,{"$f":"IF(C36=\"\",\"\",RANK(I36,$I$33:$I$48,1)+COUNTIF($I$33:I36,I36)-1)","v":""}]
[null,"",null,null,null,null,null,"",null,null,null,{"$f":"IF(C37=\"\",\"\",RANK(I37,$I$33:$I$48,1)+COUNTIF($I$33:I37,I37)-1)","v":""}]
[null,"",null,null,null,null,null,"",null,null,null,{"$f":"IF(C38=\"\",\"\",RANK(I38,$I$33:$I$48,1)+COUNTIF($I$33:I38,I38)-1)","v":""}]
[null,"",null,null,null,null,null,"",null,null,null,{"$f":"IF(C39=\"\",\"\",RANK(I39,$I$33:$I$48,1)+COUNTIF($I$33:I39,I39)-1)","v":""}]
[null,"",null,null,null,null,null,"",null,null,null,{"$f":"IF(C40=\"\",\"\",RANK(I40,$I$33:$I$48,1)+COUNTIF($I$33:I40,I40)-1)","v":""}]
[null,"",null,null,null,null,null,"",null,null,null,{"$f":"IF(C41=\"\",\"\",RANK(I41,$I$33:$I$48,1)+COUNTIF($I$33:I41,I41)-1)","v":""}]
[null,"",null,null,null,null,null,"",null,null,null,{"$f":"IF(C42=\"\",\"\",RANK(I42,$I$33:$I$48,1)+COUNTIF($I$33:I42,I42)-1)","v":""}]
[null,"",null,null,null,null,null,"",null,null,null,{"$f":"IF(C43=\"\",\"\",RANK(I43,$I$33:$I$48,1)+COUNTIF($I$33:I43,I43)-1)","v":""}]
[null,"",null,null,null,null,null,"",null,null,null,{"$f":"IF(C44=\"\",\"\",RANK(I44,$I$33:$I$48,1)+COUNTIF($I$33:I44,I44)-1)","v":""}]
[null,"",null,null,null,null,null,"",null,null,null,{"$f":"IF(C45=\"\",\"\",RANK(I45,$I$33:$I$48,1)+COUNTIF($I$33:I45,I45)-1)","v":""}]
[null,"",null,null,null,null,null,"",null,null,null,{"$f":"IF(C46=\"\",\"\",RANK(I46,$I$33:$I$48,1)+COUNTIF($I$33:I46,I46)-1)","v":""}]
[null,"",null,null,null,null,null,"",null,null,null,{"$f":"IF(C47=\"\",\"\",RANK(I47,$I$33:$I$48,1)+COUNTIF($I$33:I47,I47)-1)","v":""}]
[null,"",null,null,null,null,null,"",null,null,null,{"$f":"IF(C48=\"\",\"\",RANK(I48,$I$33:$I$48,1)+COUNTIF($I$33:I48,I48)-1)","v":""}]
[]
[]
[null,null,null,null,"Resultatliste kombinert - individuell kompakt"]
[]
[null,"Plass","Start nr.","Navn","Klubb","F.år","Lengde","A","B","C","Poeng\nHopp","Starttid\nlangrenn","Tid\nlangr",null,"Tid i mål"]
[null,{"$f":"IF(COUNT($I$33:$I$48)>0,1,\"\")","v":1},{"$f":"IF(B54=\"\",\"\",_xlfn.XLOOKUP($B54,$L$33:$L$48,$C$33:$C$48,\"\",0,1))","v":""},{"$f":"IF(C54=\"\",\"\",_xlfn.XLOOKUP($C54,$C$33:$C$48,D$33:D$48,\"\",0,1))","v":""},{"$f":"IF(D54=\"\",\"\",_xlfn.XLOOKUP($C54,$C$33:$C$48,E$33:E$48,\"\",0,1))","v":""},"",{"$f":"IF($C54=\"\",\"\",_xlfn.XLOOKUP($C54,$C$12:$C$27,H$12:H$27,\"\",0,1))","v":""},{"$f":"IF($C54=\"\",\"\",_xlfn.XLOOKUP($C54,$C$12:$C$27,I$12:I$27,\"\",0,1))","v":""},"","","",{"$f":"_xlfn.XLOOKUP(C54,$C$32:$C$48,$H$32:$H$48,\"\",0,1)","v":""},{"$f":"IF(C54=\"\",\"\",_xlfn.XLOOKUP(C54,$C$32:$C$48,$I$32:$I$48,\"\",0,1)-L54)","v":""},null,{"$f":"VLOOKUP(C54,C33:I48,7,FALSE)","v":{"$error":"#N/A"}}]
[null,{"$f":"IFERROR(IF(B54+1>COUNT($I$33:$I$48),\"\",B54+1),\"\")","v":2},{"$f":"IF(B55=\"\",\"\",_xlfn.XLOOKUP($B55,$L$33:$L$48,$C$33:$C$48,\"\",0,1))","v":""},"","","",{"$f":"IF($C55=\"\",\"\",_xlfn.XLOOKUP($C55,$C$12:$C$27,H$12:H$27,\"\",0,1))","v":""},"","","","",{"$f":"_xlfn.XLOOKUP(C55,$C$32:$C$48,$H$32:$H$48,\"\",0,1)","v":""},{"$f":"IF(C55=\"\",\"\",_xlfn.XLOOKUP(C55,$C$32:$C$48,$I$32:$I$48,\"\",0,1)-L55)","v":""},{"$f":"IF(C55=\"\",\"\",\"+\")","v":""},{"$f":"IF(C55=\"\",\"\",VLOOKUP($C55,$C$33:$I$48,7,0)-VLOOKUP($C$54,$C$33:$I$48,7,0))","v":""}]
[null,{"$f":"IFERROR(IF(B55+1>COUNT($I$33:$I$48),\"\",B55+1),\"\")","v":3},"","","","","","","","","","","","",{"$f":"IF(C56=\"\",\"\",VLOOKUP($C56,$C$33:$I$48,7,0)-VLOOKUP($C$54,$C$33:$I$48,7,0))","v":""}]
[null,4,"","","","","","","","","","","","",""]
[null,"","","","","","","","","","","","","",""]
[null,"","","","","","","","","","","","","",""]
[null,"","","","","","","","","","","","","",""]
[null,"","","","","","","","","","","","","",""]
[null,"","","","","","","","","","","","","",""]
[null,"","","","","","","","","","","","","",""]
[null,"","","","","","","","","","","","","",""]
[null,"","","","","","","","","","","","","",""]
[null,"","","","","","","","","","","","","",""]
[null,"","","","","","","","","","","","","",""]
[null,"","","","","","","","","","","","","",""]
[null,"","","","","","","","","","","","","",""]

{"sheet":"K65 G","index":10,"n_rows":70,"n_cols":20,"rows_kept":70,"cut":false,"hidden":false,"merged":[[8,7,8,11],[8,12,8,16]]}
[]
[null,null,null,null,{"$f":"+'K2'!E2","v":"Namsosrennet i hopp og kombinert 01.02.2026"}]
[]
[]
[null,null,null,null,{"$f":"\"K\"&F6","v":"K65"},null,"RCA Gutter"]
[null,null,null,null,"K-punkt:",65,"meter"]
[null,null,null,null,"Meterverdi:",{"$f":"VLOOKUP(F6,Meterverdier!A:B,2,FALSE)","v":2.4},"poeng/meter"]
[]
[null,null,null,null,null,null,null,"1. omgang",null,null,null,null,"2. omgang"]
[null,null,"Start-",null,null,"Hopp/",null,null,null,null,null,null,null,null,null,null,null,"Poeng"]
[null,"Plassering","nr.","Navn","Klubb","Komb","F.år","Lengde","A","B","C","Poeng","Lengde","A","B","C","Poeng","totalt"]
[null,{"$f":"IF(R12=\"\",\"\",RANK(R12,$R$12:$R$28,0)+COUNTIFS($R$12:R12,R12)-1)","v":5},53,"Mikkel Holt-Vorvik","Byåsen Idrettslag","Komb","RC B",56,15.5,15.5,15.5,{"$f":"IF(H12=\"\",0,60+$F$7*(H12-$F$6)+SUM(I12:K12))","v":84.9},61,16.5,17,16.5,{"$f":"IF(M12=\"\",\"\",60+$F$7*(M12-$F$6)+SUM(N12:P12))","v":100.4},{"$f":"IF(AND(ISNUMBER(L12),ISNUMBER(Q12)),L12+Q12,0)","v":185.3},0,{"$f":"(R12+S12)","v":185.3}]
[null,{"$f":"IF(R13=\"\",\"\",RANK(R13,$R$12:$R$28,0)+COUNTIFS($R$12:R13,R13)-1)","v":9},54,"Sander Grande Molden","Byåsen Idrettslag","Komb","RC B",44,14.5,14.5,15,{"$f":"IF(H13=\"\",0,60+$F$7*(H13-$F$6)+SUM(I13:K13))","v":53.6},42,14,14,14.5,{"$f":"IF(M13=\"\",\"\",60+$F$7*(M13-$F$6)+SUM(N13:P13))","v":47.300000000000004},{"$f":"IF(AND(ISNUMBER(L13),ISNUMBER(Q13)),L13+Q13,0)","v":100.9},null,{"$f":"(R13+S13)","v":100.9}]
[null,{"$f":"IF(R14=\"\",\"\",RANK(R14,$R$12:$R$28,0)+COUNTIFS($R$12:R14,R14)-1)","v":3},56,"Sigurd Fredagsvik-Johansen","Skogn IL","Hopp","RC B",60.5,16,16,16,{"$f":"IF(H14=\"\",0,60+$F$7*(H14-$F$6)+SUM(I14:K14))","v":97.2},61,16,17,16,{"$f":"IF(M14=\"\",\"\",60+$F$7*(M14-$F$6)+SUM(N14:P14))","v":99.4},{"$f":"IF(AND(ISNUMBER(L14),ISNUMBER(Q14)),L14+Q14,0)","v":196.60000000000002},null,196.60000000000002]
[null,{"$f":"IF(R15=\"\",\"\",RANK(R15,$R$12:$R$28,0)+COUNTIFS($R$12:R15,R15)-1)","v":1},57,"Sondre Hegseth Volden","Byåsen IL","Hopp","RC B",61,15.5,16,16,97.9,61.5,16.5,17,16.5,101.6,199.5,null,199.5]
[null,{"$f":"IF(R16=\"\",\"\",RANK(R16,$R$12:$R$28,0)+COUNTIFS($R$12:R16,R16)-1)","v":6},58,"Thomas Opheim Bardal","Steinkjer Skiklubb","Komb","RC B",58,15,15.5,15,88.7,58.5,15,15.5,15,89.9,178.60000000000002,null,178.60000000000002]
[null,{"$f":"IF(R17=\"\",\"\",RANK(R17,$R$12:$R$28,0)+COUNTIFS($R$12:R17,R17)-1)","v":4},66,"Aksel Gurendal Skogstad","Byåsen IL","Komb","RC A",60,16,16,16.5,96.5,60.5,16,16.5,16,97.7,194.2,null,194.2]
[null,{"$f":"IF(R18=\"\",\"\",RANK(R18,$R$12:$R$28,0)+COUNTIFS($R$12:R18,R18)-1)","v":7},59,"Aleksander Fleischer","Skatval Skilag","Komb","RC A",53,15.5,15.5,16,{"$f":"IF(H18=\"\",0,60+$F$7*(H18-$F$6)+SUM(I18:K18))","v":78.2},59.5,16.5,16,16.5,{"$f":"IF(M18=\"\",\"\",60+$F$7*(M18-$F$6)+SUM(N18:P18))","v":95.8},{"$f":"IF(AND(ISNUMBER(L18),ISNUMBER(Q18)),L18+Q18,0)","v":174},50,224]
[null,{"$f":"IF(R19=\"\",\"\",RANK(R19,$R$12:$R$28,0)+COUNTIFS($R$12:R19,R19)-1)","v":8},60,"Henrik Storø","Namsos IL Hopp","Hopp","NC Men",56,15,15,15.5,{"$f":"IF(H19=\"\",0,60+$F$7*(H19-$F$6)+SUM(I19:K19))","v":83.9},53.5,14,14,14,{"$f":"IF(M19=\"\",\"\",60+$F$7*(M19-$F$6)+SUM(N19:P19))","v":74.400000000000006},{"$f":"IF(AND(ISNUMBER(L19),ISNUMBER(Q19)),L19+Q19,0)","v":158.30000000000001},30,188.3]
[null,{"$f":"IF(R20=\"\",\"\",RANK(R20,$R$12:$R$28,0)+COUNTIFS($R$12:R20,R20)-1)","v":2},111,"Isak Skorstad Mortensen","Namsos IL Hopp","Hopp"," NC Elite",59.5,16.5,16,16.5,{"$f":"IF(H20=\"\",0,60+$F$7*(H20-$F$6)+SUM(I20:K20))","v":95.8},62,16,16.5,16.5,{"$f":"IF(M20=\"\",\"\",60+$F$7*(M20-$F$6)+SUM(N20:P20))","v":101.8},{"$f":"IF(AND(ISNUMBER(L20),ISNUMBER(Q20)),L20+Q20,0)","v":197.6},80,277.60000000000002]
[null,{"$f":"IF(R21=\"\",\"\",RANK(R21,$R$12:$R$28,0)+COUNTIFS($R$12:R21,R21)-1)","v":10},null,null,null,null,null,null,null,null,null,0,null,null,null,null,"",0]
[null,{"$f":"IF(R22=\"\",\"\",RANK(R22,$R$12:$R$28,0)+COUNTIFS($R$12:R22,R22)-1)","v":11},null,null,null,null,null,null,null,null,null,0,null,null,null,null,"",0]
[null,{"$f":"IF(R23=\"\",\"\",RANK(R23,$R$12:$R$28,0)+COUNTIFS($R$12:R23,R23)-1)","v":12},null,null,null,null,null,null,null,null,null,0,null,null,null,null,"",0]
[null,{"$f":"IF(R24=\"\",\"\",RANK(R24,$R$12:$R$28,0)+COUNTIFS($R$12:R24,R24)-1)","v":13},null,null,null,null,null,null,null,null,null,0,null,null,null,null,"",0]
[null,{"$f":"IF(R25=\"\",\"\",RANK(R25,$R$12:$R$28,0)+COUNTIFS($R$12:R25,R25)-1)","v":14},null,null,null,null,null,null,null,null,null,0,null,null,null,null,"",0]
[null,{"$f":"IF(R26=\"\",\"\",RANK(R26,$R$12:$R$28,0)+COUNTIFS($R$12:R26,R26)-1)","v":15},null,null,null,null,null,null,null,null,null,0,null,null,null,null,"",0]
[null,{"$f":"IF(R27=\"\",\"\",RANK(R27,$R$12:$R$28,0)+COUNTIFS($R$12:R27,R27)-1)","v":16},null,null,null,null,null,null,null,null,null,0,null,null,null,null,"",0]
[null,{"$f":"IF(R28=\"\",\"\",RANK(R28,$R$12:$R$28,0)+COUNTIFS($R$12:R28,R28)-1)","v":17},null,null,null,null,null,null,null,null,null,0,null,null,null,null,"",0]
[null,null,null,null,null,null,null,null,null,null,{"$f":"IF(G29=\"\",\"\",60+$F$7*(G29-$F$6)+SUM(H29:J29))","v":""},null,null,null,null,{"$f":"IF(L29=\"\",\"\",60+$F$7*(L29-$F$6)+SUM(M29:O29))","v":""},{"$f":"IF(AND(ISNUMBER(K29),ISNUMBER(P29)),K29+P29,\"\")","v":""}]
[]
[null,null,null,null,"Startliste kombinert - individuell kompakt"]
[]
[null,"Plass. Hopp\n 1. omg","Start nr.","Navn","Klubb","F.år","Poeng hopp","Start tid","Tid i mål\nMM:SS,T",null,null,"Plassering"]
[null,{"$f":"IF(COUNTIF($F$12:$F$28,\"Komb\")>0,1,\"\")","v":1},{"$f":"_xlfn._xlws.SORT(_xlfn.HSTACK(_xlfn._xlws.FILTER($C$12:$E$28,$F$12:$F$28=\"Komb\",$L$12:$L$28>0),_xlfn._xlws.FILTER($G$12:$G$28,$F$12:$F$28=\"Komb\",$L$12:$L$28>0),_xlfn._xlws.FILTER($L$12:$L$28,$F$12:$F$28=\"Komb\",$L$12:$L$28>0)),5,-1)","v":66},"Aksel Gurendal Skogstad","Byåsen IL","RC A",96.5,{"$f":"TIME(0,0,0)","v":"00:00:00"},"00:13:11",null,null,{"$f":"IF(C34=\"\",\"\",RANK(I34,$I$34:$I$49,1)+COUNTIF($I$34:I34,I34)-1)","v":4}]
[null,{"$f":"IFERROR(IF(B34+1>COUNTIF($F$12:$F$28,\"Komb\"),\"\",B34+1),\"\")","v":2},58,"Thomas Opheim Bardal","Steinkjer Skiklubb","RC B",88.7,{"$f":"IF(B35=\"\",\"\",H34+TIME(0,0,6))","v":"00:00:06"},"00:08:16",null,null,{"$f":"IF(C35=\"\",\"\",RANK(I35,$I$34:$I$49,1)+COUNTIF($I$34:I35,I35)-1)","v":2}]
[null,{"$f":"IFERROR(IF(B35+1>COUNTIF($F$12:$F$28,\"Komb\"),\"\",B35+1),\"\")","v":3},53,"Mikkel Holt-Vorvik","Byåsen Idrettslag","RC B",84.9,{"$f":"IF(B36=\"\",\"\",H35+TIME(0,0,6))","v":"00:00:12"},"00:08:12",null,null,{"$f":"IF(C36=\"\",\"\",RANK(I36,$I$34:$I$49,1)+COUNTIF($I$34:I36,I36)-1)","v":1}]
[null,{"$f":"IFERROR(IF(B36+1>COUNTIF($F$12:$F$28,\"Komb\"),\"\",B36+1),\"\")","v":4},59,"Aleksander Fleischer","Skatval Skilag","RC A",78.2,"00:00:18","00:16:36",null,null,{"$f":"IF(C37=\"\",\"\",RANK(I37,$I$34:$I$49,1)+COUNTIF($I$34:I37,I37)-1)","v":5}]
[null,{"$f":"IFERROR(IF(B37+1>COUNTIF($F$12:$F$28,\"Komb\"),\"\",B37+1),\"\")","v":5},54,"Sander Grande Molden","Byåsen Idrettslag","RC B",53.6,"00:00:24","00:08:57",null,null,{"$f":"IF(C38=\"\",\"\",RANK(I38,$I$34:$I$49,1)+COUNTIF($I$34:I38,I38)-1)","v":3}]
[null,{"$f":"IFERROR(IF(B38+1>COUNTIF($F$12:$F$28,\"Komb\"),\"\",B38+1),\"\")","v":""},null,null,null,null,null,null,null,null,null,{"$f":"IF(C39=\"\",\"\",RANK(I39,$I$34:$I$49,1)+COUNTIF($I$34:I39,I39)-1)","v":""}]
[null,{"$f":"IFERROR(IF(B39+1>COUNTIF($F$12:$F$28,\"Komb\"),\"\",B39+1),\"\")","v":""},null,null,null,null,null,"",null,null,null,{"$f":"IF(C40=\"\",\"\",RANK(I40,$I$34:$I$49,1)+COUNTIF($I$34:I40,I40)-1)","v":""}]
[null,{"$f":"IFERROR(IF(B40+1>COUNTIF($F$12:$F$28,\"Komb\"),\"\",B40+1),\"\")","v":""},null,null,null,null,null,"",null,null,null,{"$f":"IF(C41=\"\",\"\",RANK(I41,$I$34:$I$49,1)+COUNTIF($I$34:I41,I41)-1)","v":""}]
[null,{"$f":"IFERROR(IF(B41+1>COUNTIF($F$12:$F$28,\"Komb\"),\"\",B41+1),\"\")","v":""},null,null,null,null,null,"",null,null,null,{"$f":"IF(C42=\"\",\"\",RANK(I42,$I$34:$I$49,1)+COUNTIF($I$34:I42,I42)-1)","v":""}]
[null,{"$f":"IFERROR(IF(B42+1>COUNTIF($F$12:$F$28,\"Komb\"),\"\",B42+1),\"\")","v":""},null,null,null,null,null,"",null,null,null,{"$f":"IF(C43=\"\",\"\",RANK(I43,$I$34:$I$49,1)+COUNTIF($I$34:I43,I43)-1)","v":""}]
[null,{"$f":"IFERROR(IF(B43+1>COUNTIF($F$12:$F$28,\"Komb\"),\"\",B43+1),\"\")","v":""},null,null,null,null,null,"",null,null,null,{"$f":"IF(C44=\"\",\"\",RANK(I44,$I$34:$I$49,1)+COUNTIF($I$34:I44,I44)-1)","v":""}]
[null,{"$f":"IFERROR(IF(B44+1>COUNTIF($F$12:$F$28,\"Komb\"),\"\",B44+1),\"\")","v":""},null,null,null,null,null,"",null,null,null,{"$f":"IF(C45=\"\",\"\",RANK(I45,$I$34:$I$49,1)+COUNTIF($I$34:I45,I45)-1)","v":""}]
[null,{"$f":"IFERROR(IF(B45+1>COUNTIF($F$12:$F$28,\"Komb\"),\"\",B45+1),\"\")","v":""},null,null,null,null,null,"",null,null,null,{"$f":"IF(C46=\"\",\"\",RANK(I46,$I$34:$I$49,1)+COUNTIF($I$34:I46,I46)-1)","v":""}]
[null,{"$f":"IFERROR(IF(B46+1>COUNTIF($F$12:$F$28,\"Komb\"),\"\",B46+1),\"\")","v":""},null,null,null,null,null,"",null,null,null,{"$f":"IF(C47=\"\",\"\",RANK(I47,$I$34:$I$49,1)+COUNTIF($I$34:I47,I47)-1)","v":""}]
[null,{"$f":"IFERROR(IF(B47+1>COUNTIF($F$12:$F$28,\"Komb\"),\"\",B47+1),\"\")","v":""},null,null,null,null,null,"",null,null,null,{"$f":"IF(C48=\"\",\"\",RANK(I48,$I$34:$I$49,1)+COUNTIF($I$34:I48,I48)-1)","v":""}]
[null,{"$f":"IFERROR(IF(B48+1>COUNTIF($F$12:$F$28,\"Komb\"),\"\",B48+1),\"\")","v":""},null,null,null,null,null,"",null,null,null,{"$f":"IF(C49=\"\",\"\",RANK(I49,$I$34:$I$49,1)+COUNTIF($I$34:I49,I49)-1)","v":""}]
[]
[]
[null,null,null,null,"Resultatliste kombinert - individuell kompakt"]
[]
[null,"Plass","Start nr.","Navn","Klubb","F.år","Lengde","A","B","C","Poeng\nHopp","Starttid\nlangrenn","Tid\nlangr",null,"Tid i mål"]
[null,{"$f":"IF(COUNT($I$34:$I$49)>0,1,\"\")","v":1},{"$f":"IF(B55=\"\",\"\",_xlfn.XLOOKUP($B55,$L$34:$L$49,$C$34:$C$49,\"\",0,1))","v":53},{"$f":"IF(C55=\"\",\"\",_xlfn.XLOOKUP($C55,$C$34:$C$49,D$34:D$49,\"\",0,1))","v":"Mikkel Holt-Vorvik"},{"$f":"IF(D55=\"\",\"\",_xlfn.XLOOKUP($C55,$C$34:$C$49,E$34:E$49,\"\",0,1))","v":"Byåsen Idrettslag"},"RC B",{"$f":"IF($C55=\"\",\"\",_xlfn.XLOOKUP($C55,$C$12:$C$28,H$12:H$28,\"\",0,1))","v":56},{"$f":"IF($C55=\"\",\"\",_xlfn.XLOOKUP($C55,$C$12:$C$28,I$12:I$28,\"\",0,1))","v":15.5},{"$f":"IF($C55=\"\",\"\",_xlfn.XLOOKUP($C55,$C$12:$C$28,J$12:J$28,\"\",0,1))","v":15.5},{"$f":"IF($C55=\"\",\"\",_xlfn.XLOOKUP($C55,$C$12:$C$28,K$12:K$28,\"\",0,1))","v":15.5},{"$f":"IF($C55=\"\",\"\",_xlfn.XLOOKUP($C55,$C$12:$C$28,L$12:L$28,\"\",0,1))","v":84.9},{"$f":"_xlfn.XLOOKUP(C55,$C$33:$C$49,$H$33:$H$49,\"\",0,1)","v":"00:00:12"},{"$f":"IF(C55=\"\",\"\",_xlfn.XLOOKUP(C55,$C$33:$C$49,$I$33:$I$49,\"\",0,1)-L55)","v":"00:08:00"},null,{"$f":"VLOOKUP(C55,C34:I49,7,FALSE)","v":"00:08:12"}]
[null,{"$f":"IFERROR(IF(B55+1>COUNT($I$34:$I$49),\"\",B55+1),\"\")","v":2},{"$f":"IF(B56=\"\",\"\",_xlfn.XLOOKUP($B56,$L$34:$L$49,$C$34:$C$49,\"\",0,1))","v":58},"Thomas Opheim Bardal","Steinkjer Skiklubb","RC B",{"$f":"IF($C56=\"\",\"\",_xlfn.XLOOKUP($C56,$C$12:$C$28,H$12:H$28,\"\",0,1))","v":58},{"$f":"IF($C56=\"\",\"\",_xlfn.XLOOKUP($C56,$C$12:$C$28,I$12:I$28,\"\",0,1))","v":15},{"$f":"IF($C56=\"\",\"\",_xlfn.XLOOKUP($C56,$C$12:$C$28,J$12:J$28,\"\",0,1))","v":15.5},{"$f":"IF($C56=\"\",\"\",_xlfn.XLOOKUP($C56,$C$12:$C$28,K$12:K$28,\"\",0,1))","v":15},{"$f":"IF($C56=\"\",\"\",_xlfn.XLOOKUP($C56,$C$12:$C$28,L$12:L$28,\"\",0,1))","v":88.7},{"$f":"_xlfn.XLOOKUP(C56,$C$33:$C$49,$H$33:$H$49,\"\",0,1)","v":"00:00:06"},{"$f":"IF(C56=\"\",\"\",_xlfn.XLOOKUP(C56,$C$33:$C$49,$I$33:$I$49,\"\",0,1)-L56)","v":"00:08:10"},{"$f":"IF(C56=\"\",\"\",\"+\")","v":"+"},{"$f":"IF(C56=\"\",\"\",VLOOKUP($C56,$C$34:$I$49,7,0)-VLOOKUP($C$55,$C$34:$I$49,7,0))","v":"00:00:04"}]
[null,{"$f":"IFERROR(IF(B56+1>COUNT($I$34:$I$49),\"\",B56+1),\"\")","v":3},54,"Sander Grande Molden","Byåsen Idrettslag","RC B",{"$f":"IF($C57=\"\",\"\",_xlfn.XLOOKUP($C57,$C$12:$C$28,H$12:H$28,\"\",0,1))","v":44},{"$f":"IF($C57=\"\",\"\",_xlfn.XLOOKUP($C57,$C$12:$C$28,I$12:I$28,\"\",0,1))","v":14.5},{"$f":"IF($C57=\"\",\"\",_xlfn.XLOOKUP($C57,$C$12:$C$28,J$12:J$28,\"\",0,1))","v":14.5},{"$f":"IF($C57=\"\",\"\",_xlfn.XLOOKUP($C57,$C$12:$C$28,K$12:K$28,\"\",0,1))","v":15},{"$f":"IF($C57=\"\",\"\",_xlfn.XLOOKUP($C57,$C$12:$C$28,L$12:L$28,\"\",0,1))","v":53.6},"00:00:24","00:08:33","+",{"$f":"IF(C57=\"\",\"\",VLOOKUP($C57,$C$34:$I$49,7,0)-VLOOKUP($C$55,$C$34:$I$49,7,0))","v":"00:00:45"}]
[null,4,66,"Aksel Gurendal Skogstad","Byåsen IL","RC A",{"$f":"IF($C58=\"\",\"\",_xlfn.XLOOKUP($C58,$C$12:$C$28,H$12:H$28,\"\",0,1))","v":60},{"$f":"IF($C58=\"\",\"\",_xlfn.XLOOKUP($C58,$C$12:$C$28,I$12:I$28,\"\",0,1))","v":16},{"$f":"IF($C58=\"\",\"\",_xlfn.XLOOKUP($C58,$C$12:$C$28,J$12:J$28,\"\",0,1))","v":16},{"$f":"IF($C58=\"\",\"\",_xlfn.XLOOKUP($C58,$C$12:$C$28,K$12:K$28,\"\",0,1))","v":16.5},{"$f":"IF($C58=\"\",\"\",_xlfn.XLOOKUP($C58,$C$12:$C$28,L$12:L$28,\"\",0,1))","v":96.5},"00:00:00","00:13:11","+","00:04:59"]
[null,5,59,"Aleksander Fleischer","Skatval Skilag","RC A",{"$f":"IF($C59=\"\",\"\",_xlfn.XLOOKUP($C59,$C$12:$C$28,H$12:H$28,\"\",0,1))","v":53},{"$f":"IF($C59=\"\",\"\",_xlfn.XLOOKUP($C59,$C$12:$C$28,I$12:I$28,\"\",0,1))","v":15.5},{"$f":"IF($C59=\"\",\"\",_xlfn.XLOOKUP($C59,$C$12:$C$28,J$12:J$28,\"\",0,1))","v":15.5},{"$f":"IF($C59=\"\",\"\",_xlfn.XLOOKUP($C59,$C$12:$C$28,K$12:K$28,\"\",0,1))","v":16},{"$f":"IF($C59=\"\",\"\",_xlfn.XLOOKUP($C59,$C$12:$C$28,L$12:L$28,\"\",0,1))","v":78.2},"00:00:18","00:16:18","+","00:08:24"]
[null,"","","","","",{"$f":"IF($C60=\"\",\"\",_xlfn.XLOOKUP($C60,$C$12:$C$28,H$12:H$28,\"\",0,1))","v":""},{"$f":"IF($C60=\"\",\"\",_xlfn.XLOOKUP($C60,$C$12:$C$28,I$12:I$28,\"\",0,1))","v":""},{"$f":"IF($C60=\"\",\"\",_xlfn.XLOOKUP($C60,$C$12:$C$28,J$12:J$28,\"\",0,1))","v":""},{"$f":"IF($C60=\"\",\"\",_xlfn.XLOOKUP($C60,$C$12:$C$28,K$12:K$28,\"\",0,1))","v":""},{"$f":"IF($C60=\"\",\"\",_xlfn.XLOOKUP($C60,$C$12:$C$28,L$12:L$28,\"\",0,1))","v":""},"","","",""]
[null,"","","","","",{"$f":"IF($C61=\"\",\"\",_xlfn.XLOOKUP($C61,$C$12:$C$28,H$12:H$28,\"\",0,1))","v":""},{"$f":"IF($C61=\"\",\"\",_xlfn.XLOOKUP($C61,$C$12:$C$28,I$12:I$28,\"\",0,1))","v":""},{"$f":"IF($C61=\"\",\"\",_xlfn.XLOOKUP($C61,$C$12:$C$28,J$12:J$28,\"\",0,1))","v":""},{"$f":"IF($C61=\"\",\"\",_xlfn.XLOOKUP($C61,$C$12:$C$28,K$12:K$28,\"\",0,1))","v":""},{"$f":"IF($C61=\"\",\"\",_xlfn.XLOOKUP($C61,$C$12:$C$28,L$12:L$28,\"\",0,1))","v":""},"","","",""]
[null,"","","","","",{"$f":"IF($C62=\"\",\"\",_xlfn.XLOOKUP($C62,$C$12:$C$28,H$12:H$28,\"\",0,1))","v":""},{"$f":"IF($C62=\"\",\"\",_xlfn.XLOOKUP($C62,$C$12:$C$28,I$12:I$28,\"\",0,1))","v":""},{"$f":"IF($C62=\"\",\"\",_xlfn.XLOOKUP($C62,$C$12:$C$28,J$12:J$28,\"\",0,1))","v":""},{"$f":"IF($C62=\"\",\"\",_xlfn.XLOOKUP($C62,$C$12:$C$28,K$12:K$28,\"\",0,1))","v":""},{"$f":"IF($C62=\"\",\"\",_xlfn.XLOOKUP($C62,$C$12:$C$28,L$12:L$28,\"\",0,1))","v":""},"","","",""]
[null,"","","","","",{"$f":"IF($C63=\"\",\"\",_xlfn.XLOOKUP($C63,$C$12:$C$28,H$12:H$28,\"\",0,1))","v":""},{"$f":"IF($C63=\"\",\"\",_xlfn.XLOOKUP($C63,$C$12:$C$28,I$12:I$28,\"\",0,1))","v":""},{"$f":"IF($C63=\"\",\"\",_xlfn.XLOOKUP($C63,$C$12:$C$28,J$12:J$28,\"\",0,1))","v":""},{"$f":"IF($C63=\"\",\"\",_xlfn.XLOOKUP($C63,$C$12:$C$28,K$12:K$28,\"\",0,1))","v":""},{"$f":"IF($C63=\"\",\"\",_xlfn.XLOOKUP($C63,$C$12:$C$28,L$12:L$28,\"\",0,1))","v":""},"","","",""]
[null,"","","","","",{"$f":"IF($C64=\"\",\"\",_xlfn.XLOOKUP($C64,$C$12:$C$28,H$12:H$28,\"\",0,1))","v":""},{"$f":"IF($C64=\"\",\"\",_xlfn.XLOOKUP($C64,$C$12:$C$28,I$12:I$28,\"\",0,1))","v":""},{"$f":"IF($C64=\"\",\"\",_xlfn.XLOOKUP($C64,$C$12:$C$28,J$12:J$28,\"\",0,1))","v":""},{"$f":"IF($C64=\"\",\"\",_xlfn.XLOOKUP($C64,$C$12:$C$28,K$12:K$28,\"\",0,1))","v":""},{"$f":"IF($C64=\"\",\"\",_xlfn.XLOOKUP($C64,$C$12:$C$28,L$12:L$28,\"\",0,1))","v":""},"","","",""]
[null,"","","","","",{"$f":"IF($C65=\"\",\"\",_xlfn.XLOOKUP($C65,$C$12:$C$28,H$12:H$28,\"\",0,1))","v":""},{"$f":"IF($C65=\"\",\"\",_xlfn.XLOOKUP($C65,$C$12:$C$28,I$12:I$28,\"\",0,1))","v":""},{"$f":"IF($C65=\"\",\"\",_xlfn.XLOOKUP($C65,$C$12:$C$28,J$12:J$28,\"\",0,1))","v":""},{"$f":"IF($C65=\"\",\"\",_xlfn.XLOOKUP($C65,$C$12:$C$28,K$12:K$28,\"\",0,1))","v":""},{"$f":"IF($C65=\"\",\"\",_xlfn.XLOOKUP($C65,$C$12:$C$28,L$12:L$28,\"\",0,1))","v":""},"","","",""]
[null,"","","","","",{"$f":"IF($C66=\"\",\"\",_xlfn.XLOOKUP($C66,$C$12:$C$28,H$12:H$28,\"\",0,1))","v":""},{"$f":"IF($C66=\"\",\"\",_xlfn.XLOOKUP($C66,$C$12:$C$28,I$12:I$28,\"\",0,1))","v":""},{"$f":"IF($C66=\"\",\"\",_xlfn.XLOOKUP($C66,$C$12:$C$28,J$12:J$28,\"\",0,1))","v":""},{"$f":"IF($C66=\"\",\"\",_xlfn.XLOOKUP($C66,$C$12:$C$28,K$12:K$28,\"\",0,1))","v":""},{"$f":"IF($C66=\"\",\"\",_xlfn.XLOOKUP($C66,$C$12:$C$28,L$12:L$28,\"\",0,1))","v":""},"","","",""]
[null,"","","","","",{"$f":"IF($C67=\"\",\"\",_xlfn.XLOOKUP($C67,$C$12:$C$28,H$12:H$28,\"\",0,1))","v":""},{"$f":"IF($C67=\"\",\"\",_xlfn.XLOOKUP($C67,$C$12:$C$28,I$12:I$28,\"\",0,1))","v":""},{"$f":"IF($C67=\"\",\"\",_xlfn.XLOOKUP($C67,$C$12:$C$28,J$12:J$28,\"\",0,1))","v":""},{"$f":"IF($C67=\"\",\"\",_xlfn.XLOOKUP($C67,$C$12:$C$28,K$12:K$28,\"\",0,1))","v":""},{"$f":"IF($C67=\"\",\"\",_xlfn.XLOOKUP($C67,$C$12:$C$28,L$12:L$28,\"\",0,1))","v":""},"","","",""]
[null,"","","","","",{"$f":"IF($C68=\"\",\"\",_xlfn.XLOOKUP($C68,$C$12:$C$28,H$12:H$28,\"\",0,1))","v":""},{"$f":"IF($C68=\"\",\"\",_xlfn.XLOOKUP($C68,$C$12:$C$28,I$12:I$28,\"\",0,1))","v":""},{"$f":"IF($C68=\"\",\"\",_xlfn.XLOOKUP($C68,$C$12:$C$28,J$12:J$28,\"\",0,1))","v":""},{"$f":"IF($C68=\"\",\"\",_xlfn.XLOOKUP($C68,$C$12:$C$28,K$12:K$28,\"\",0,1))","v":""},{"$f":"IF($C68=\"\",\"\",_xlfn.XLOOKUP($C68,$C$12:$C$28,L$12:L$28,\"\",0,1))","v":""},"","","",""]
[null,"","","","","",{"$f":"IF($C69=\"\",\"\",_xlfn.XLOOKUP($C69,$C$12:$C$28,H$12:H$28,\"\",0,1))","v":""},{"$f":"IF($C69=\"\",\"\",_xlfn.XLOOKUP($C69,$C$12:$C$28,I$12:I$28,\"\",0,1))","v":""},{"$f":"IF($C69=\"\",\"\",_xlfn.XLOOKUP($C69,$C$12:$C$28,J$12:J$28,\"\",0,1))","v":""},{"$f":"IF($C69=\"\",\"\",_xlfn.XLOOKUP($C69,$C$12:$C$28,K$12:K$28,\"\",0,1))","v":""},{"$f":"IF($C69=\"\",\"\",_xlfn.XLOOKUP($C69,$C$12:$C$28,L$12:L$28,\"\",0,1))","v":""},"","","",""]
[null,"","","","","",{"$f":"IF($C70=\"\",\"\",_xlfn.XLOOKUP($C70,$C$12:$C$28,H$12:H$28,\"\",0,1))","v":""},{"$f":"IF($C70=\"\",\"\",_xlfn.XLOOKUP($C70,$C$12:$C$28,I$12:I$28,\"\",0,1))","v":""},{"$f":"IF($C70=\"\",\"\",_xlfn.XLOOKUP($C70,$C$12:$C$28,J$12:J$28,\"\",0,1))","v":""},{"$f":"IF($C70=\"\",\"\",_xlfn.XLOOKUP($C70,$C$12:$C$28,K$12:K$28,\"\",0,1))","v":""},{"$f":"IF($C70=\"\",\"\",_xlfn.XLOOKUP($C70,$C$12:$C$28,L$12:L$28,\"\",0,1))","v":""},"","","",""]

{"sheet":"K65 J","index":11,"n_rows":69,"n_cols":18,"rows_kept":69,"cut":false,"hidden":false,"merged":[[8,7,8,11],[8,12,8,16]]}
[]
[null,null,null,null,{"$f":"+'K2'!E2","v":"Namsosrennet i hopp og kombinert 01.02.2026"}]
[]
[]
[null,null,null,null,{"$f":"\"K\"&F6","v":"K65"},null,"RCA Jenter"]
[null,null,null,null,"K-punkt:",65,"meter"]
[null,null,null,null,"Meterverdi:",{"$f":"VLOOKUP(F6,Meterverdier!A:B,2,FALSE)","v":2.4},"poeng/meter"]
[]
[null,null,null,null,null,null,null,"1. omgang",null,null,null,null,"2. omgang"]
[null,null,"Start-",null,null,"Hopp/",null,null,null,null,null,null,null,null,null,null,null,"Poeng"]
[null,"Plassering","nr.","Navn","Klubb","Komb","F.år","Lengde","A","B","C","Poeng","Lengde","A","B","C","Poeng","totalt"]
[null,{"$f":"IF(R12=\"\",\"\",RANK(R12,$R$12:$R$27,0)+COUNTIFS($R$12:R12,R12)-1)","v":1},51,"Olava Wesche Fossheim","Byåsen IL","Komb","RCA",53,15.5,15,15,{"$f":"IF(H12=\"\",0,60+$F$7*(H12-$F$6)+SUM(I12:K12))","v":76.7},52,15,14.5,14.5,{"$f":"IF(M12=\"\",\"\",60+$F$7*(M12-$F$6)+SUM(N12:P12))","v":72.8},{"$f":"IF(AND(ISNUMBER(L12),ISNUMBER(Q12)),L12+Q12,0)","v":149.5}]
[null,{"$f":"IF(R13=\"\",\"\",RANK(R13,$R$12:$R$27,0)+COUNTIFS($R$12:R13,R13)-1)","v":2},null,null,null,null,null,null,null,null,null,0,null,null,null,null,{"$f":"IF(M13=\"\",\"\",60+$F$7*(M13-$F$6)+SUM(N13:P13))","v":""},0]
[null,{"$f":"IF(R14=\"\",\"\",RANK(R14,$R$12:$R$27,0)+COUNTIFS($R$12:R14,R14)-1)","v":3},null,null,null,null,null,null,null,null,null,0,null,null,null,null,{"$f":"IF(M14=\"\",\"\",60+$F$7*(M14-$F$6)+SUM(N14:P14))","v":""},0]
[null,{"$f":"IF(R15=\"\",\"\",RANK(R15,$R$12:$R$27,0)+COUNTIFS($R$12:R15,R15)-1)","v":4},null,null,null,null,null,null,null,null,null,0,null,null,null,null,{"$f":"IF(M15=\"\",\"\",60+$F$7*(M15-$F$6)+SUM(N15:P15))","v":""},0]
[null,{"$f":"IF(R16=\"\",\"\",RANK(R16,$R$12:$R$27,0)+COUNTIFS($R$12:R16,R16)-1)","v":5},null,null,null,null,null,null,null,null,null,0,null,null,null,null,"",0]
[null,{"$f":"IF(R17=\"\",\"\",RANK(R17,$R$12:$R$27,0)+COUNTIFS($R$12:R17,R17)-1)","v":6},null,null,null,null,null,null,null,null,null,0,null,null,null,null,"",0]
[null,{"$f":"IF(R18=\"\",\"\",RANK(R18,$R$12:$R$27,0)+COUNTIFS($R$12:R18,R18)-1)","v":7},null,null,null,null,null,null,null,null,null,0,null,null,null,null,"",0]
[null,{"$f":"IF(R19=\"\",\"\",RANK(R19,$R$12:$R$27,0)+COUNTIFS($R$12:R19,R19)-1)","v":8},null,null,null,null,null,null,null,null,null,0,null,null,null,null,"",0]
[null,{"$f":"IF(R20=\"\",\"\",RANK(R20,$R$12:$R$27,0)+COUNTIFS($R$12:R20,R20)-1)","v":9},null,null,null,null,null,null,null,null,null,0,null,null,null,null,"",0]
[null,{"$f":"IF(R21=\"\",\"\",RANK(R21,$R$12:$R$27,0)+COUNTIFS($R$12:R21,R21)-1)","v":10},null,null,null,null,null,null,null,null,null,0,null,null,null,null,"",0]
[null,{"$f":"IF(R22=\"\",\"\",RANK(R22,$R$12:$R$27,0)+COUNTIFS($R$12:R22,R22)-1)","v":11},null,null,null,null,null,null,null,null,null,0,null,null,null,null,"",0]
[null,{"$f":"IF(R23=\"\",\"\",RANK(R23,$R$12:$R$27,0)+COUNTIFS($R$12:R23,R23)-1)","v":12},null,null,null,null,null,null,null,null,null,0,null,null,null,null,"",0]
[null,{"$f":"IF(R24=\"\",\"\",RANK(R24,$R$12:$R$27,0)+COUNTIFS($R$12:R24,R24)-1)","v":13},null,null,null,null,null,null,null,null,null,0,null,null,null,null,"",0]
[null,{"$f":"IF(R25=\"\",\"\",RANK(R25,$R$12:$R$27,0)+COUNTIFS($R$12:R25,R25)-1)","v":14},null,null,null,null,null,null,null,null,null,0,null,null,null,null,"",0]
[null,{"$f":"IF(R26=\"\",\"\",RANK(R26,$R$12:$R$27,0)+COUNTIFS($R$12:R26,R26)-1)","v":15},null,null,null,null,null,null,null,null,null,0,null,null,null,null,"",0]
[null,{"$f":"IF(R27=\"\",\"\",RANK(R27,$R$12:$R$27,0)+COUNTIFS($R$12:R27,R27)-1)","v":16},null,null,null,null,null,null,null,null,null,0,null,null,null,null,"",0]
[null,null,null,null,null,null,null,null,null,null,{"$f":"IF(G28=\"\",\"\",60+$F$7*(G28-$F$6)+SUM(H28:J28))","v":""},null,null,null,null,{"$f":"IF(L28=\"\",\"\",60+$F$7*(L28-$F$6)+SUM(M28:O28))","v":""},{"$f":"IF(AND(ISNUMBER(K28),ISNUMBER(P28)),K28+P28,\"\")","v":""}]
[]
[null,null,null,null,"Startliste kombinert - individuell kompakt"]
[]
[null,"Plass. Hopp\n 1. omg","Start nr.","Navn","Klubb","F.år","Poeng hopp","Start tid","Tid i mål\nMM:SS,T",null,null,"Plassering"]
[null,{"$f":"IF(COUNTIF($F$12:$F$27,\"Komb\")>0,1,\"\")","v":1},{"$f":"_xlfn._xlws.SORT(_xlfn.HSTACK(_xlfn._xlws.FILTER($C$12:$E$27,$F$12:$F$27=\"Komb\",$L$12:$L$27>0),_xlfn._xlws.FILTER($G$12:$G$27,$F$12:$F$27=\"Komb\",$L$12:$L$27>0),_xlfn._xlws.FILTER($L$12:$L$27,$F$12:$F$27=\"Komb\",$L$12:$L$27>0)),5,-1)","v":51},"Olava Wesche Fossheim","Byåsen IL","RCA",76.7,{"$f":"TIME(0,0,0)","v":"00:00:00"},"00:08:05",null,null,{"$f":"IF(C33=\"\",\"\",RANK(I33,$I$33:$I$48,1)+COUNTIF($I$33:I33,I33)-1)","v":1}]
[null,{"$f":"IFERROR(IF(B33+1>COUNTIF($F$12:$F$27,\"Komb\"),\"\",B33+1),\"\")","v":""},null,null,null,null,null,{"$f":"IF(B34=\"\",\"\",H33+TIME(0,0,6))","v":""},null,null,null,{"$f":"IF(C34=\"\",\"\",RANK(I34,$I$33:$I$48,1)+COUNTIF($I$33:I34,I34)-1)","v":""}]
[null,{"$f":"IFERROR(IF(B34+1>COUNTIF($F$12:$F$27,\"Komb\"),\"\",B34+1),\"\")","v":""},null,null,null,null,null,{"$f":"IF(B35=\"\",\"\",H34+TIME(0,0,6))","v":""},null,null,null,{"$f":"IF(C35=\"\",\"\",RANK(I35,$I$33:$I$48,1)+COUNTIF($I$33:I35,I35)-1)","v":""}]
[null,"",null,null,null,null,null,"",null,null,null,{"$f":"IF(C36=\"\",\"\",RANK(I36,$I$33:$I$48,1)+COUNTIF($I$33:I36,I36)-1)","v":""}]
[null,"",null,null,null,null,null,"",null,null,null,{"$f":"IF(C37=\"\",\"\",RANK(I37,$I$33:$I$48,1)+COUNTIF($I$33:I37,I37)-1)","v":""}]
[null,"",null,null,null,null,null,"",null,null,null,{"$f":"IF(C38=\"\",\"\",RANK(I38,$I$33:$I$48,1)+COUNTIF($I$33:I38,I38)-1)","v":""}]
[null,"",null,null,null,null,null,"",null,null,null,{"$f":"IF(C39=\"\",\"\",RANK(I39,$I$33:$I$48,1)+COUNTIF($I$33:I39,I39)-1)","v":""}]
[null,"",null,null,null,null,null,"",null,null,null,{"$f":"IF(C40=\"\",\"\",RANK(I40,$I$33:$I$48,1)+COUNTIF($I$33:I40,I40)-1)","v":""}]
[null,"",null,null,null,null,null,"",null,null,null,{"$f":"IF(C41=\"\",\"\",RANK(I41,$I$33:$I$48,1)+COUNTIF($I$33:I41,I41)-1)","v":""}]
[null,"",null,null,null,null,null,"",null,null,null,{"$f":"IF(C42=\"\",\"\",RANK(I42,$I$33:$I$48,1)+COUNTIF($I$33:I42,I42)-1)","v":""}]
[null,"",null,null,null,null,null,"",null,null,null,{"$f":"IF(C43=\"\",\"\",RANK(I43,$I$33:$I$48,1)+COUNTIF($I$33:I43,I43)-1)","v":""}]
[null,"",null,null,null,null,null,"",null,null,null,{"$f":"IF(C44=\"\",\"\",RANK(I44,$I$33:$I$48,1)+COUNTIF($I$33:I44,I44)-1)","v":""}]
[null,"",null,null,null,null,null,"",null,null,null,{"$f":"IF(C45=\"\",\"\",RANK(I45,$I$33:$I$48,1)+COUNTIF($I$33:I45,I45)-1)","v":""}]
[null,"",null,null,null,null,null,"",null,null,null,{"$f":"IF(C46=\"\",\"\",RANK(I46,$I$33:$I$48,1)+COUNTIF($I$33:I46,I46)-1)","v":""}]
[null,"",null,null,null,null,null,"",null,null,null,{"$f":"IF(C47=\"\",\"\",RANK(I47,$I$33:$I$48,1)+COUNTIF($I$33:I47,I47)-1)","v":""}]
[null,"",null,null,null,null,null,"",null,null,null,{"$f":"IF(C48=\"\",\"\",RANK(I48,$I$33:$I$48,1)+COUNTIF($I$33:I48,I48)-1)","v":""}]
[]
[]
[null,null,null,null,"Resultatliste kombinert - individuell kompakt"]
[]
[null,"Plass","Start nr.","Navn","Klubb","F.år","Lengde","A","B","C","Poeng\nHopp","Starttid\nlangrenn","Tid\nlangr",null,"Tid i mål"]
[null,{"$f":"IF(COUNT($I$33:$I$48)>0,1,\"\")","v":1},{"$f":"IF(B54=\"\",\"\",_xlfn.XLOOKUP($B54,$L$33:$L$48,$C$33:$C$48,\"\",0,1))","v":51},{"$f":"IF(C54=\"\",\"\",_xlfn.XLOOKUP($C54,$C$33:$C$48,D$33:D$48,\"\",0,1))","v":"Olava Wesche Fossheim"},{"$f":"IF(D54=\"\",\"\",_xlfn.XLOOKUP($C54,$C$33:$C$48,E$33:E$48,\"\",0,1))","v":"Byåsen IL"},"RCA",{"$f":"IF($C54=\"\",\"\",_xlfn.XLOOKUP($C54,$C$12:$C$27,H$12:H$27,\"\",0,1))","v":53},{"$f":"IF($C54=\"\",\"\",_xlfn.XLOOKUP($C54,$C$12:$C$27,I$12:I$27,\"\",0,1))","v":15.5},15,15,76.7,{"$f":"_xlfn.XLOOKUP(C54,$C$32:$C$48,$H$32:$H$48,\"\",0,1)","v":"00:00:00"},{"$f":"IF(C54=\"\",\"\",_xlfn.XLOOKUP(C54,$C$32:$C$48,$I$32:$I$48,\"\",0,1)-L54)","v":"00:08:05"},null,{"$f":"VLOOKUP(C54,C33:I48,7,FALSE)","v":"00:08:05"}]
[null,{"$f":"IFERROR(IF(B54+1>COUNT($I$33:$I$48),\"\",B54+1),\"\")","v":""},{"$f":"IF(B55=\"\",\"\",_xlfn.XLOOKUP($B55,$L$33:$L$48,$C$33:$C$48,\"\",0,1))","v":""},"","","",{"$f":"IF($C55=\"\",\"\",_xlfn.XLOOKUP($C55,$C$12:$C$27,H$12:H$27,\"\",0,1))","v":""},"","","","",{"$f":"_xlfn.XLOOKUP(C55,$C$32:$C$48,$H$32:$H$48,\"\",0,1)","v":""},{"$f":"IF(C55=\"\",\"\",_xlfn.XLOOKUP(C55,$C$32:$C$48,$I$32:$I$48,\"\",0,1)-L55)","v":""},{"$f":"IF(C55=\"\",\"\",\"+\")","v":""},{"$f":"IF(C55=\"\",\"\",VLOOKUP($C55,$C$33:$I$48,7,0)-VLOOKUP($C$54,$C$33:$I$48,7,0))","v":""}]
[null,{"$f":"IFERROR(IF(B55+1>COUNT($I$33:$I$48),\"\",B55+1),\"\")","v":""},"","","","","","","","","","","","",{"$f":"IF(C56=\"\",\"\",VLOOKUP($C56,$C$33:$I$48,7,0)-VLOOKUP($C$54,$C$33:$I$48,7,0))","v":""}]
[null,"","","","","","","","","","","","","",""]
[null,"","","","","","","","","","","","","",""]
[null,"","","","","","","","","","","","","",""]
[null,"","","","","","","","","","","","","",""]
[null,"","","","","","","","","","","","","",""]
[null,"","","","","","","","","","","","","",""]
[null,"","","","","","","","","","","","","",""]
[null,"","","","","","","","","","","","","",""]
[null,"","","","","","","","","","","","","",""]
[null,"","","","","","","","","","","","","",""]
[null,"","","","","","","","","","","","","",""]
[null,"","","","","","","","","","","","","",""]
[null,"","","","","","","","","","","","","",""]

{"sheet":"Ledig (2)","index":12,"n_rows":70,"n_cols":18,"rows_kept":70,"cut":false,"hidden":false,"merged":[[8,7,8,11],[8,12,8,16]]}
[]
[null,null,null,null,{"$f":"+'K2'!E2","v":"Namsosrennet i hopp og kombinert 01.02.2026"}]
[]
[]
[null,null,null,null,{"$f":"\"K\"&F6","v":"K45"},null,"Steinkjerrennet 31.01.2026"]
[null,null,null,null,"K-punkt:",45,"meter"]
[null,null,null,null,"Meterverdi:",{"$f":"VLOOKUP(F6,Meterverdier!A:B,2,FALSE)","v":3.2},"poeng/meter"]
[]
[null,null,null,null,null,null,null,"1. omgang",null,null,null,null,"2. omgang"]
[null,null,"Start-",null,null,"Hopp/",null,null,null,null,null,null,null,null,null,null,null,"Poeng"]
[null,"Plassering","nr.","Navn","Klubb","Komb","F.år","Lengde","A","B","C","Poeng","Lengde","A","B","C","Poeng","totalt"]
[null,{"$f":"IF(R12=\"\",\"\",RANK(R12,$R$12:$R$28,0)+COUNTIFS($R$12:R12,R12)-1)","v":2},51,"Elise Skjeflo","Steinkjer Skiklubb",null,null,31,15,14.5,13.5,{"$f":"IF(H12=\"\",0,60+$F$7*(H12-$F$6)+SUM(I12:K12))","v":58.199999999999996},31.5,15.5,15.5,14.5,{"$f":"IF(M12=\"\",\"\",60+$F$7*(M12-$F$6)+SUM(N12:P12))","v":62.3},{"$f":"IF(AND(ISNUMBER(L12),ISNUMBER(Q12)),L12+Q12,0)","v":120.5}]
[null,{"$f":"IF(R13=\"\",\"\",RANK(R13,$R$12:$R$28,0)+COUNTIFS($R$12:R13,R13)-1)","v":1},52,"Kristine Storø","Namsos IL Hopp",null,null,33,15,14.5,13.5,64.599999999999994,32.5,15.5,15,14,{"$f":"IF(M13=\"\",\"\",60+$F$7*(M13-$F$6)+SUM(N13:P13))","v":64.5},129.1]
[null,3,53,"Ane Marie Kimo","Fjellørnen IL",null,null,27,14,14,12.5,42.9,28,14.5,14.5,13,{"$f":"IF(M14=\"\",\"\",60+$F$7*(M14-$F$6)+SUM(N14:P14))","v":47.599999999999994},90.5]
[null,null,54,"Filippa Nordseth Fredriksen","Namsos IL Hopp",null,null,29,7,7,7,null,28,14,15,13]
[null,null,null,null,null,null,null,null,null,null,null,0,null,null,null,null,{"$f":"IF(M16=\"\",\"\",60+$F$7*(M16-$F$6)+SUM(N16:P16))","v":""},0]
[null,1,56,"Marius Pleym Fiskum","Overhalla IL",null,null,29,13.5,13.5,13,48.8,28,14,14.5,12.5,46.599999999999994,95.399999999999991]
[null,null,null,null,null,null,null,null,null,null,null,0,null,null,null,null,"",0]
[null,null,null,null,null,null,null,null,null,null,null,0,null,null,null,null,"",0]
[null,null,null,null,null,null,null,null,null,null,null,0,null,null,null,null,"",0]
[null,null,null,null,null,null,null,null,null,null,null,0,null,null,null,null,"",0]
[null,null,null,null,null,null,null,null,null,null,null,0,null,null,null,null,"",0]
[null,null,null,null,null,null,null,null,null,null,null,0,null,null,null,null,"",0]
[null,null,null,null,null,null,null,null,null,null,null,0,null,null,null,null,"",0]
[null,null,null,null,null,null,null,null,null,null,null,0,null,null,null,null,"",0]
[null,null,null,null,null,null,null,null,null,null,null,0,null,null,null,null,"",0]
[null,null,null,null,null,null,null,null,null,null,null,0,null,null,null,null,"",0]
[null,null,null,null,null,null,null,null,null,null,null,0,null,null,null,null,"",0]
[null,null,null,null,null,null,null,null,null,null,{"$f":"IF(G29=\"\",\"\",60+$F$7*(G29-$F$6)+SUM(H29:J29))","v":""},null,null,null,null,{"$f":"IF(L29=\"\",\"\",60+$F$7*(L29-$F$6)+SUM(M29:O29))","v":""},{"$f":"IF(AND(ISNUMBER(K29),ISNUMBER(P29)),K29+P29,\"\")","v":""}]
[]
[null,null,null,null,"Startliste kombinert - individuell kompakt"]
[]
[null,"Plass. Hopp\n 1. omg","Start nr.","Navn","Klubb","F.år","Poeng hopp","Start tid","Tid i mål\nMM:SS,T",null,null,"Plassering"]
[null,{"$f":"IF(COUNTIF($F$12:$F$28,\"Komb\")>0,1,\"\")","v":""},{"$f":"_xlfn._xlws.SORT(_xlfn.HSTACK(_xlfn._xlws.FILTER($C$12:$E$28,$F$12:$F$28=\"Komb\",$L$12:$L$28>0),_xlfn._xlws.FILTER($G$12:$G$28,$F$12:$F$28=\"Komb\",$L$12:$L$28>0),_xlfn._xlws.FILTER($L$12:$L$28,$F$12:$F$28=\"Komb\",$L$12:$L$28>0)),5,-1)","v":{"$error":"#VALUE!"}},null,null,null,null,{"$f":"TIME(0,0,0)","v":"00:00:00"},"00:04:29",null,null,{"$f":"IF(C34=\"\",\"\",RANK(I34,$I$34:$I$49,1)+COUNTIF($I$34:I34,I34)-1)","v":{"$error":"#VALUE!"}}]
[null,{"$f":"IFERROR(IF(B34+1>COUNTIF($F$12:$F$28,\"Komb\"),\"\",B34+1),\"\")","v":""},null,null,null,null,null,{"$f":"IF(B35=\"\",\"\",H34+TIME(0,0,6))","v":""},null,null,null,{"$f":"IF(C35=\"\",\"\",RANK(I35,$I$34:$I$49,1)+COUNTIF($I$34:I35,I35)-1)","v":""}]
[null,{"$f":"IFERROR(IF(B35+1>COUNTIF($F$12:$F$28,\"Komb\"),\"\",B35+1),\"\")","v":""},null,null,null,null,null,{"$f":"IF(B36=\"\",\"\",H35+TIME(0,0,6))","v":""},null,null,null,{"$f":"IF(C36=\"\",\"\",RANK(I36,$I$34:$I$49,1)+COUNTIF($I$34:I36,I36)-1)","v":""}]
[null,{"$f":"IFERROR(IF(B36+1>COUNTIF($F$12:$F$28,\"Komb\"),\"\",B36+1),\"\")","v":""},null,null,null,null,null,"",null,null,null,{"$f":"IF(C37=\"\",\"\",RANK(I37,$I$34:$I$49,1)+COUNTIF($I$34:I37,I37)-1)","v":""}]
[null,{"$f":"IFERROR(IF(B37+1>COUNTIF($F$12:$F$28,\"Komb\"),\"\",B37+1),\"\")","v":""},null,null,null,null,null,"",null,null,null,{"$f":"IF(C38=\"\",\"\",RANK(I38,$I$34:$I$49,1)+COUNTIF($I$34:I38,I38)-1)","v":""}]
[null,{"$f":"IFERROR(IF(B38+1>COUNTIF($F$12:$F$28,\"Komb\"),\"\",B38+1),\"\")","v":""},null,null,null,null,null,"",null,null,null,{"$f":"IF(C39=\"\",\"\",RANK(I39,$I$34:$I$49,1)+COUNTIF($I$34:I39,I39)-1)","v":""}]
[null,{"$f":"IFERROR(IF(B39+1>COUNTIF($F$12:$F$28,\"Komb\"),\"\",B39+1),\"\")","v":""},null,null,null,null,null,"",null,null,null,{"$f":"IF(C40=\"\",\"\",RANK(I40,$I$34:$I$49,1)+COUNTIF($I$34:I40,I40)-1)","v":""}]
[null,{"$f":"IFERROR(IF(B40+1>COUNTIF($F$12:$F$28,\"Komb\"),\"\",B40+1),\"\")","v":""},null,null,null,null,null,"",null,null,null,{"$f":"IF(C41=\"\",\"\",RANK(I41,$I$34:$I$49,1)+COUNTIF($I$34:I41,I41)-1)","v":""}]
[null,{"$f":"IFERROR(IF(B41+1>COUNTIF($F$12:$F$28,\"Komb\"),\"\",B41+1),\"\")","v":""},null,null,null,null,null,"",null,null,null,{"$f":"IF(C42=\"\",\"\",RANK(I42,$I$34:$I$49,1)+COUNTIF($I$34:I42,I42)-1)","v":""}]
[null,{"$f":"IFERROR(IF(B42+1>COUNTIF($F$12:$F$28,\"Komb\"),\"\",B42+1),\"\")","v":""},null,null,null,null,null,"",null,null,null,{"$f":"IF(C43=\"\",\"\",RANK(I43,$I$34:$I$49,1)+COUNTIF($I$34:I43,I43)-1)","v":""}]
[null,{"$f":"IFERROR(IF(B43+1>COUNTIF($F$12:$F$28,\"Komb\"),\"\",B43+1),\"\")","v":""},null,null,null,null,null,"",null,null,null,{"$f":"IF(C44=\"\",\"\",RANK(I44,$I$34:$I$49,1)+COUNTIF($I$34:I44,I44)-1)","v":""}]
[null,{"$f":"IFERROR(IF(B44+1>COUNTIF($F$12:$F$28,\"Komb\"),\"\",B44+1),\"\")","v":""},null,null,null,null,null,"",null,null,null,{"$f":"IF(C45=\"\",\"\",RANK(I45,$I$34:$I$49,1)+COUNTIF($I$34:I45,I45)-1)","v":""}]
[null,{"$f":"IFERROR(IF(B45+1>COUNTIF($F$12:$F$28,\"Komb\"),\"\",B45+1),\"\")","v":""},null,null,null,null,null,"",null,null,null,{"$f":"IF(C46=\"\",\"\",RANK(I46,$I$34:$I$49,1)+COUNTIF($I$34:I46,I46)-1)","v":""}]
[null,{"$f":"IFERROR(IF(B46+1>COUNTIF($F$12:$F$28,\"Komb\"),\"\",B46+1),\"\")","v":""},null,null,null,null,null,"",null,null,null,{"$f":"IF(C47=\"\",\"\",RANK(I47,$I$34:$I$49,1)+COUNTIF($I$34:I47,I47)-1)","v":""}]
[null,{"$f":"IFERROR(IF(B47+1>COUNTIF($F$12:$F$28,\"Komb\"),\"\",B47+1),\"\")","v":""},null,null,null,null,null,"",null,null,null,{"$f":"IF(C48=\"\",\"\",RANK(I48,$I$34:$I$49,1)+COUNTIF($I$34:I48,I48)-1)","v":""}]
[null,{"$f":"IFERROR(IF(B48+1>COUNTIF($F$12:$F$28,\"Komb\"),\"\",B48+1),\"\")","v":""},null,null,null,null,null,"",null,null,null,{"$f":"IF(C49=\"\",\"\",RANK(I49,$I$34:$I$49,1)+COUNTIF($I$34:I49,I49)-1)","v":""}]
[]
[]
[null,null,null,null,"Resultatliste kombinert - individuell kompakt"]
[]
[null,"Plass","Start nr.","Navn","Klubb","F.år","Lengde","A","B","C","Poeng\nHopp","Starttid\nlangrenn","Tid\nlangr",null,"Tid i mål"]
[null,{"$f":"IF(COUNT($I$34:$I$49)>0,1,\"\")","v":1},{"$f":"IF(B55=\"\",\"\",_xlfn.XLOOKUP($B55,$L$34:$L$49,$C$34:$C$49,\"\",0,1))","v":""},{"$f":"IF(C55=\"\",\"\",_xlfn.XLOOKUP($C55,$C$34:$C$49,D$34:D$49,\"\",0,1))","v":""},"","",{"$f":"IF($C55=\"\",\"\",_xlfn.XLOOKUP($C55,$C$12:$C$28,H$12:H$28,\"\",0,1))","v":""},{"$f":"IF($C55=\"\",\"\",_xlfn.XLOOKUP($C55,$C$12:$C$28,I$12:I$28,\"\",0,1))","v":""},"","","",{"$f":"_xlfn.XLOOKUP(C55,$C$33:$C$49,$H$33:$H$49,\"\",0,1)","v":""},{"$f":"IF(C55=\"\",\"\",_xlfn.XLOOKUP(C55,$C$33:$C$49,$I$33:$I$49,\"\",0,1)-L55)","v":""},null,{"$f":"VLOOKUP(C55,C34:I49,7,FALSE)","v":{"$error":"#N/A"}}]
[null,{"$f":"IFERROR(IF(B55+1>COUNT($I$34:$I$49),\"\",B55+1),\"\")","v":""},{"$f":"IF(B56=\"\",\"\",_xlfn.XLOOKUP($B56,$L$34:$L$49,$C$34:$C$49,\"\",0,1))","v":""},"","","",{"$f":"IF($C56=\"\",\"\",_xlfn.XLOOKUP($C56,$C$12:$C$28,H$12:H$28,\"\",0,1))","v":""},{"$f":"IF($C56=\"\",\"\",_xlfn.XLOOKUP($C56,$C$12:$C$28,I$12:I$28,\"\",0,1))","v":""},{"$f":"IF($C56=\"\",\"\",_xlfn.XLOOKUP($C56,$C$12:$C$28,J$12:J$28,\"\",0,1))","v":""},{"$f":"IF($C56=\"\",\"\",_xlfn.XLOOKUP($C56,$C$12:$C$28,K$12:K$28,\"\",0,1))","v":""},{"$f":"IF($C56=\"\",\"\",_xlfn.XLOOKUP($C56,$C$12:$C$28,L$12:L$28,\"\",0,1))","v":""},{"$f":"_xlfn.XLOOKUP(C56,$C$33:$C$49,$H$33:$H$49,\"\",0,1)","v":""},{"$f":"IF(C56=\"\",\"\",_xlfn.XLOOKUP(C56,$C$33:$C$49,$I$33:$I$49,\"\",0,1)-L56)","v":""},{"$f":"IF(C56=\"\",\"\",\"+\")","v":""},{"$f":"IF(C56=\"\",\"\",VLOOKUP($C56,$C$34:$I$49,7,0)-VLOOKUP($C$55,$C$34:$I$49,7,0))","v":""}]
[null,{"$f":"IFERROR(IF(B56+1>COUNT($I$34:$I$49),\"\",B56+1),\"\")","v":""},"","","","",{"$f":"IF($C57=\"\",\"\",_xlfn.XLOOKUP($C57,$C$12:$C$28,H$12:H$28,\"\",0,1))","v":""},{"$f":"IF($C57=\"\",\"\",_xlfn.XLOOKUP($C57,$C$12:$C$28,I$12:I$28,\"\",0,1))","v":""},{"$f":"IF($C57=\"\",\"\",_xlfn.XLOOKUP($C57,$C$12:$C$28,J$12:J$28,\"\",0,1))","v":""},{"$f":"IF($C57=\"\",\"\",_xlfn.XLOOKUP($C57,$C$12:$C$28,K$12:K$28,\"\",0,1))","v":""},{"$f":"IF($C57=\"\",\"\",_xlfn.XLOOKUP($C57,$C$12:$C$28,L$12:L$28,\"\",0,1))","v":""},"","","",{"$f":"IF(C57=\"\",\"\",VLOOKUP($C57,$C$34:$I$49,7,0)-VLOOKUP($C$55,$C$34:$I$49,7,0))","v":""}]
[null,"","","","","",{"$f":"IF($C58=\"\",\"\",_xlfn.XLOOKUP($C58,$C$12:$C$28,H$12:H$28,\"\",0,1))","v":""},{"$f":"IF($C58=\"\",\"\",_xlfn.XLOOKUP($C58,$C$12:$C$28,I$12:I$28,\"\",0,1))","v":""},{"$f":"IF($C58=\"\",\"\",_xlfn.XLOOKUP($C58,$C$12:$C$28,J$12:J$28,\"\",0,1))","v":""},{"$f":"IF($C58=\"\",\"\",_xlfn.XLOOKUP($C58,$C$12:$C$28,K$12:K$28,\"\",0,1))","v":""},{"$f":"IF($C58=\"\",\"\",_xlfn.XLOOKUP($C58,$C$12:$C$28,L$12:L$28,\"\",0,1))","v":""},"","","",""]
[null,"","","","","",{"$f":"IF($C59=\"\",\"\",_xlfn.XLOOKUP($C59,$C$12:$C$28,H$12:H$28,\"\",0,1))","v":""},{"$f":"IF($C59=\"\",\"\",_xlfn.XLOOKUP($C59,$C$12:$C$28,I$12:I$28,\"\",0,1))","v":""},{"$f":"IF($C59=\"\",\"\",_xlfn.XLOOKUP($C59,$C$12:$C$28,J$12:J$28,\"\",0,1))","v":""},{"$f":"IF($C59=\"\",\"\",_xlfn.XLOOKUP($C59,$C$12:$C$28,K$12:K$28,\"\",0,1))","v":""},{"$f":"IF($C59=\"\",\"\",_xlfn.XLOOKUP($C59,$C$12:$C$28,L$12:L$28,\"\",0,1))","v":""},"","","",""]
[null,"","","","","",{"$f":"IF($C60=\"\",\"\",_xlfn.XLOOKUP($C60,$C$12:$C$28,H$12:H$28,\"\",0,1))","v":""},{"$f":"IF($C60=\"\",\"\",_xlfn.XLOOKUP($C60,$C$12:$C$28,I$12:I$28,\"\",0,1))","v":""},{"$f":"IF($C60=\"\",\"\",_xlfn.XLOOKUP($C60,$C$12:$C$28,J$12:J$28,\"\",0,1))","v":""},{"$f":"IF($C60=\"\",\"\",_xlfn.XLOOKUP($C60,$C$12:$C$28,K$12:K$28,\"\",0,1))","v":""},{"$f":"IF($C60=\"\",\"\",_xlfn.XLOOKUP($C60,$C$12:$C$28,L$12:L$28,\"\",0,1))","v":""},"","","",""]
[null,"","","","","",{"$f":"IF($C61=\"\",\"\",_xlfn.XLOOKUP($C61,$C$12:$C$28,H$12:H$28,\"\",0,1))","v":""},{"$f":"IF($C61=\"\",\"\",_xlfn.XLOOKUP($C61,$C$12:$C$28,I$12:I$28,\"\",0,1))","v":""},{"$f":"IF($C61=\"\",\"\",_xlfn.XLOOKUP($C61,$C$12:$C$28,J$12:J$28,\"\",0,1))","v":""},{"$f":"IF($C61=\"\",\"\",_xlfn.XLOOKUP($C61,$C$12:$C$28,K$12:K$28,\"\",0,1))","v":""},{"$f":"IF($C61=\"\",\"\",_xlfn.XLOOKUP($C61,$C$12:$C$28,L$12:L$28,\"\",0,1))","v":""},"","","",""]
[null,"","","","","",{"$f":"IF($C62=\"\",\"\",_xlfn.XLOOKUP($C62,$C$12:$C$28,H$12:H$28,\"\",0,1))","v":""},{"$f":"IF($C62=\"\",\"\",_xlfn.XLOOKUP($C62,$C$12:$C$28,I$12:I$28,\"\",0,1))","v":""},{"$f":"IF($C62=\"\",\"\",_xlfn.XLOOKUP($C62,$C$12:$C$28,J$12:J$28,\"\",0,1))","v":""},{"$f":"IF($C62=\"\",\"\",_xlfn.XLOOKUP($C62,$C$12:$C$28,K$12:K$28,\"\",0,1))","v":""},{"$f":"IF($C62=\"\",\"\",_xlfn.XLOOKUP($C62,$C$12:$C$28,L$12:L$28,\"\",0,1))","v":""},"","","",""]
[null,"","","","","",{"$f":"IF($C63=\"\",\"\",_xlfn.XLOOKUP($C63,$C$12:$C$28,H$12:H$28,\"\",0,1))","v":""},{"$f":"IF($C63=\"\",\"\",_xlfn.XLOOKUP($C63,$C$12:$C$28,I$12:I$28,\"\",0,1))","v":""},{"$f":"IF($C63=\"\",\"\",_xlfn.XLOOKUP($C63,$C$12:$C$28,J$12:J$28,\"\",0,1))","v":""},{"$f":"IF($C63=\"\",\"\",_xlfn.XLOOKUP($C63,$C$12:$C$28,K$12:K$28,\"\",0,1))","v":""},{"$f":"IF($C63=\"\",\"\",_xlfn.XLOOKUP($C63,$C$12:$C$28,L$12:L$28,\"\",0,1))","v":""},"","","",""]
[null,"","","","","",{"$f":"IF($C64=\"\",\"\",_xlfn.XLOOKUP($C64,$C$12:$C$28,H$12:H$28,\"\",0,1))","v":""},{"$f":"IF($C64=\"\",\"\",_xlfn.XLOOKUP($C64,$C$12:$C$28,I$12:I$28,\"\",0,1))","v":""},{"$f":"IF($C64=\"\",\"\",_xlfn.XLOOKUP($C64,$C$12:$C$28,J$12:J$28,\"\",0,1))","v":""},{"$f":"IF($C64=\"\",\"\",_xlfn.XLOOKUP($C64,$C$12:$C$28,K$12:K$28,\"\",0,1))","v":""},{"$f":"IF($C64=\"\",\"\",_xlfn.XLOOKUP($C64,$C$12:$C$28,L$12:L$28,\"\",0,1))","v":""},"","","",""]
[null,"","","","","",{"$f":"IF($C65=\"\",\"\",_xlfn.XLOOKUP($C65,$C$12:$C$28,H$12:H$28,\"\",0,1))","v":""},{"$f":"IF($C65=\"\",\"\",_xlfn.XLOOKUP($C65,$C$12:$C$28,I$12:I$28,\"\",0,1))","v":""},{"$f":"IF($C65=\"\",\"\",_xlfn.XLOOKUP($C65,$C$12:$C$28,J$12:J$28,\"\",0,1))","v":""},{"$f":"IF($C65=\"\",\"\",_xlfn.XLOOKUP($C65,$C$12:$C$28,K$12:K$28,\"\",0,1))","v":""},{"$f":"IF($C65=\"\",\"\",_xlfn.XLOOKUP($C65,$C$12:$C$28,L$12:L$28,\"\",0,1))","v":""},"","","",""]
[null,"","","","","",{"$f":"IF($C66=\"\",\"\",_xlfn.XLOOKUP($C66,$C$12:$C$28,H$12:H$28,\"\",0,1))","v":""},{"$f":"IF($C66=\"\",\"\",_xlfn.XLOOKUP($C66,$C$12:$C$28,I$12:I$28,\"\",0,1))","v":""},{"$f":"IF($C66=\"\",\"\",_xlfn.XLOOKUP($C66,$C$12:$C$28,J$12:J$28,\"\",0,1))","v":""},{"$f":"IF($C66=\"\",\"\",_xlfn.XLOOKUP($C66,$C$12:$C$28,K$12:K$28,\"\",0,1))","v":""},{"$f":"IF($C66=\"\",\"\",_xlfn.XLOOKUP($C66,$C$12:$C$28,L$12:L$28,\"\",0,1))","v":""},"","","",""]
[null,"","","","","",{"$f":"IF($C67=\"\",\"\",_xlfn.XLOOKUP($C67,$C$12:$C$28,H$12:H$28,\"\",0,1))","v":""},{"$f":"IF($C67=\"\",\"\",_xlfn.XLOOKUP($C67,$C$12:$C$28,I$12:I$28,\"\",0,1))","v":""},{"$f":"IF($C67=\"\",\"\",_xlfn.XLOOKUP($C67,$C$12:$C$28,J$12:J$28,\"\",0,1))","v":""},{"$f":"IF($C67=\"\",\"\",_xlfn.XLOOKUP($C67,$C$12:$C$28,K$12:K$28,\"\",0,1))","v":""},{"$f":"IF($C67=\"\",\"\",_xlfn.XLOOKUP($C67,$C$12:$C$28,L$12:L$28,\"\",0,1))","v":""},"","","",""]
[null,"","","","","",{"$f":"IF($C68=\"\",\"\",_xlfn.XLOOKUP($C68,$C$12:$C$28,H$12:H$28,\"\",0,1))","v":""},{"$f":"IF($C68=\"\",\"\",_xlfn.XLOOKUP($C68,$C$12:$C$28,I$12:I$28,\"\",0,1))","v":""},{"$f":"IF($C68=\"\",\"\",_xlfn.XLOOKUP($C68,$C$12:$C$28,J$12:J$28,\"\",0,1))","v":""},{"$f":"IF($C68=\"\",\"\",_xlfn.XLOOKUP($C68,$C$12:$C$28,K$12:K$28,\"\",0,1))","v":""},{"$f":"IF($C68=\"\",\"\",_xlfn.XLOOKUP($C68,$C$12:$C$28,L$12:L$28,\"\",0,1))","v":""},"","","",""]
[null,"","","","","",{"$f":"IF($C69=\"\",\"\",_xlfn.XLOOKUP($C69,$C$12:$C$28,H$12:H$28,\"\",0,1))","v":""},{"$f":"IF($C69=\"\",\"\",_xlfn.XLOOKUP($C69,$C$12:$C$28,I$12:I$28,\"\",0,1))","v":""},{"$f":"IF($C69=\"\",\"\",_xlfn.XLOOKUP($C69,$C$12:$C$28,J$12:J$28,\"\",0,1))","v":""},{"$f":"IF($C69=\"\",\"\",_xlfn.XLOOKUP($C69,$C$12:$C$28,K$12:K$28,\"\",0,1))","v":""},{"$f":"IF($C69=\"\",\"\",_xlfn.XLOOKUP($C69,$C$12:$C$28,L$12:L$28,\"\",0,1))","v":""},"","","",""]
[null,"","","","","",{"$f":"IF($C70=\"\",\"\",_xlfn.XLOOKUP($C70,$C$12:$C$28,H$12:H$28,\"\",0,1))","v":""},{"$f":"IF($C70=\"\",\"\",_xlfn.XLOOKUP($C70,$C$12:$C$28,I$12:I$28,\"\",0,1))","v":""},{"$f":"IF($C70=\"\",\"\",_xlfn.XLOOKUP($C70,$C$12:$C$28,J$12:J$28,\"\",0,1))","v":""},{"$f":"IF($C70=\"\",\"\",_xlfn.XLOOKUP($C70,$C$12:$C$28,K$12:K$28,\"\",0,1))","v":""},{"$f":"IF($C70=\"\",\"\",_xlfn.XLOOKUP($C70,$C$12:$C$28,L$12:L$28,\"\",0,1))","v":""},"","","",""]

{"sheet":"Ledig (3)","index":13,"n_rows":69,"n_cols":18,"rows_kept":69,"cut":false,"hidden":false,"merged":[[8,7,8,11],[8,12,8,16]]}
[]
[null,null,null,null,{"$f":"+'K2'!E2","v":"Namsosrennet i hopp og kombinert 01.02.2026"}]
[]
[]
[null,null,null,null,{"$f":"\"K\"&F6","v":"K65"},null,"Steinkjerrennet 31.01.2026"]
[null,null,null,null,"K-punkt:",65,"meter"]
[null,null,null,null,"Meterverdi:",{"$f":"VLOOKUP(F6,Meterverdier!A:B,2,FALSE)","v":2.4},"poeng/meter"]
[]
[null,null,null,null,null,null,null,"1. omgang",null,null,null,null,"2. omgang"]
[null,null,"Start-",null,null,"Hopp/",null,null,null,null,null,null,null,null,null,null,null,"Poeng"]
[null,"Plassering","nr.","Navn","Klubb","Komb","F.år","Lengde","A","B","C","Poeng","Lengde","A","B","C","Poeng","totalt"]
[null,1,61,"Olava Wesche Fossheim","Byåsen IL","Hopp",null,48,16.5,16.5,16,{"$f":"IF(H12=\"\",0,60+$F$7*(H12-$F$6)+SUM(I12:K12))","v":68.2},53,17,17,16,{"$f":"IF(M12=\"\",\"\",60+$F$7*(M12-$F$6)+SUM(N12:P12))","v":81.2},{"$f":"IF(AND(ISNUMBER(L12),ISNUMBER(Q12)),L12+Q12,0)","v":149.4}]
[null,2,62,"Anna Ervik Aune","Byåsen IL","Hopp",null,41,14.5,15,13.5,45.400000000000006,40,14.5,15.5,13.5,{"$f":"IF(M13=\"\",\"\",60+$F$7*(M13-$F$6)+SUM(N13:P13))","v":43.5},{"$f":"IF(AND(ISNUMBER(L13),ISNUMBER(Q13)),L13+Q13,0)","v":88.9}]
[null,null,null,null,null,null,null,null,null,null,null,0,null,null,null,null,{"$f":"IF(M14=\"\",\"\",60+$F$7*(M14-$F$6)+SUM(N14:P14))","v":""},{"$f":"IF(AND(ISNUMBER(L14),ISNUMBER(Q14)),L14+Q14,0)","v":0}]
[null,5,63,"Mikkel Holth Vårvik","Byåsen IL","Hopp",null,52,16,16,14.5,{"$f":"IF(H15=\"\",0,60+$F$7*(H15-$F$6)+SUM(I15:K15))","v":75.3},53,17,16,14.5,{"$f":"IF(M15=\"\",\"\",60+$F$7*(M15-$F$6)+SUM(N15:P15))","v":78.7},{"$f":"IF(AND(ISNUMBER(L15),ISNUMBER(Q15)),L15+Q15,0)","v":154}]
[null,6,64,"Sander Grande Molden","Byåsen IL","Hopp",null,40,14,14,13,41,43,15,16.5,15,{"$f":"IF(M16=\"\",\"\",60+$F$7*(M16-$F$6)+SUM(N16:P16))","v":53.7},{"$f":"IF(AND(ISNUMBER(L16),ISNUMBER(Q16)),L16+Q16,0)","v":94.7}]
[null,{"$f":"IF(R17=\"\",\"\",RANK(R17,$R$12:$R$27,0)+COUNTIFS($R$12:R17,R17)-1)","v":2},65,"Sondre Hegseth Volden","Byåsen IL","Hopp",null,61,17,17,17,101.4,59,16.5,16.5,16.5,95.1,{"$f":"IF(AND(ISNUMBER(L17),ISNUMBER(Q17)),L17+Q17,0)","v":196.5}]
[null,4,66,"Thomas Opheim Bardal","Steinkjer Skiklubb","Hopp",null,55,15.5,15.5,16,83,56,15.5,15.5,16,85.4,{"$f":"IF(AND(ISNUMBER(L18),ISNUMBER(Q18)),L18+Q18,0)","v":168.4}]
[null,{"$f":"IF(R19=\"\",\"\",RANK(R19,$R$12:$R$27,0)+COUNTIFS($R$12:R19,R19)-1)","v":1},67,"Akeksander Fleischer","Skatval IL","Hopp",null,63,17.5,17.5,18,108.2,66,17.5,18,18,115.9,{"$f":"IF(AND(ISNUMBER(L19),ISNUMBER(Q19)),L19+Q19,0)+50","v":274.10000000000002}]
[null,{"$f":"IF(R20=\"\",\"\",RANK(R20,$R$12:$R$27,0)+COUNTIFS($R$12:R20,R20)-1)","v":3},68,"Aksel Gurendasl Skogstad","Byåsen IL","Hopp",null,64,14,14,14.5,100.1,57,15.5,16.5,16.5,89.3,{"$f":"IF(AND(ISNUMBER(L20),ISNUMBER(Q20)),L20+Q20,0)","v":189.39999999999998}]
[]
[null,null,null,null,null,null,null,null,null,null,null,0,null,null,null,null,"",{"$f":"IF(AND(ISNUMBER(L22),ISNUMBER(Q22)),L22+Q22,0)","v":0}]
[null,1,71,"Henrik Storø","Namsos IL Hopp","Hopp","Jun",58.5,15.5,15.5,15.5,90.9,60,15,15,15,93,{"$f":"IF(AND(ISNUMBER(L23),ISNUMBER(Q23)),L23+Q23,0)","v":183.9}]
[null,null,null,null,null,null,null,null,null,null,null,0,null,null,null,null,"",{"$f":"IF(AND(ISNUMBER(L24),ISNUMBER(Q24)),L24+Q24,0)","v":0}]
[null,null,null,null,null,null,null,null,null,null,null,0,null,null,null,null,"",{"$f":"IF(AND(ISNUMBER(L25),ISNUMBER(Q25)),L25+Q25,0)","v":0}]
[null,null,null,null,null,null,null,null,null,null,null,0,null,null,null,null,"",{"$f":"IF(AND(ISNUMBER(L26),ISNUMBER(Q26)),L26+Q26,0)","v":0}]
[null,null,null,null,null,null,null,null,null,null,null,0,null,null,null,null,"",{"$f":"IF(AND(ISNUMBER(L27),ISNUMBER(Q27)),L27+Q27,0)","v":0}]
[null,null,null,null,null,null,null,null,null,null,{"$f":"IF(G28=\"\",\"\",60+$F$7*(G28-$F$6)+SUM(H28:J28))","v":""},null,null,null,null,{"$f":"IF(L28=\"\",\"\",60+$F$7*(L28-$F$6)+SUM(M28:O28))","v":""},{"$f":"IF(AND(ISNUMBER(K28),ISNUMBER(P28)),K28+P28,\"\")","v":""}]
[]
[null,null,null,null,"Startliste kombinert - individuell kompakt"]
[]
[null,"Plass. Hopp\n 1. omg","Start nr.","Navn","Klubb","F.år","Poeng hopp","Start tid","Tid i mål\nMM:SS,T",null,null,"Plassering"]
[null,{"$f":"IF(COUNTIF($F$12:$F$27,\"Komb\")>0,1,\"\")","v":""},{"$f":"_xlfn._xlws.SORT(_xlfn.HSTACK(_xlfn._xlws.FILTER($C$12:$E$27,$F$12:$F$27=\"Komb\",$L$12:$L$27>0),_xlfn._xlws.FILTER($G$12:$G$27,$F$12:$F$27=\"Komb\",$L$12:$L$27>0),_xlfn._xlws.FILTER($L$12:$L$27,$F$12:$F$27=\"Komb\",$L$12:$L$27>0)),5,-1)","v":{"$error":"#VALUE!"}},null,null,null,null,{"$f":"TIME(0,0,0)","v":"00:00:00"},"00:04:29.800",null,null,{"$f":"IF(C33=\"\",\"\",RANK(I33,$I$33:$I$48,1)+COUNTIF($I$33:I33,I33)-1)","v":{"$error":"#VALUE!"}}]
[null,{"$f":"IFERROR(IF(B33+1>COUNTIF($F$12:$F$27,\"Komb\"),\"\",B33+1),\"\")","v":""},null,null,null,null,null,{"$f":"IF(B34=\"\",\"\",H33+TIME(0,0,6))","v":""},null,null,null,{"$f":"IF(C34=\"\",\"\",RANK(I34,$I$33:$I$48,1)+COUNTIF($I$33:I34,I34)-1)","v":""}]
[null,{"$f":"IFERROR(IF(B34+1>COUNTIF($F$12:$F$27,\"Komb\"),\"\",B34+1),\"\")","v":""},null,null,null,null,null,{"$f":"IF(B35=\"\",\"\",H34+TIME(0,0,6))","v":""},null,null,null,{"$f":"IF(C35=\"\",\"\",RANK(I35,$I$33:$I$48,1)+COUNTIF($I$33:I35,I35)-1)","v":""}]
[null,{"$f":"IFERROR(IF(B35+1>COUNTIF($F$12:$F$27,\"Komb\"),\"\",B35+1),\"\")","v":""},null,null,null,null,null,"",null,null,null,{"$f":"IF(C36=\"\",\"\",RANK(I36,$I$33:$I$48,1)+COUNTIF($I$33:I36,I36)-1)","v":""}]
[null,{"$f":"IFERROR(IF(B36+1>COUNTIF($F$12:$F$27,\"Komb\"),\"\",B36+1),\"\")","v":""},null,null,null,null,null,"",null,null,null,{"$f":"IF(C37=\"\",\"\",RANK(I37,$I$33:$I$48,1)+COUNTIF($I$33:I37,I37)-1)","v":""}]
[null,{"$f":"IFERROR(IF(B37+1>COUNTIF($F$12:$F$27,\"Komb\"),\"\",B37+1),\"\")","v":""},null,null,null,null,null,"",null,null,null,{"$f":"IF(C38=\"\",\"\",RANK(I38,$I$33:$I$48,1)+COUNTIF($I$33:I38,I38)-1)","v":""}]
[null,{"$f":"IFERROR(IF(B38+1>COUNTIF($F$12:$F$27,\"Komb\"),\"\",B38+1),\"\")","v":""},null,null,null,null,null,"",null,null,null,{"$f":"IF(C39=\"\",\"\",RANK(I39,$I$33:$I$48,1)+COUNTIF($I$33:I39,I39)-1)","v":""}]
[null,{"$f":"IFERROR(IF(B39+1>COUNTIF($F$12:$F$27,\"Komb\"),\"\",B39+1),\"\")","v":""},null,null,null,null,null,"",null,null,null,{"$f":"IF(C40=\"\",\"\",RANK(I40,$I$33:$I$48,1)+COUNTIF($I$33:I40,I40)-1)","v":""}]
[null,{"$f":"IFERROR(IF(B40+1>COUNTIF($F$12:$F$27,\"Komb\"),\"\",B40+1),\"\")","v":""},null,null,null,null,null,"",null,null,null,{"$f":"IF(C41=\"\",\"\",RANK(I41,$I$33:$I$48,1)+COUNTIF($I$33:I41,I41)-1)","v":""}]
[null,{"$f":"IFERROR(IF(B41+1>COUNTIF($F$12:$F$27,\"Komb\"),\"\",B41+1),\"\")","v":""},null,null,null,null,null,"",null,null,null,{"$f":"IF(C42=\"\",\"\",RANK(I42,$I$33:$I$48,1)+COUNTIF($I$33:I42,I42)-1)","v":""}]
[null,{"$f":"IFERROR(IF(B42+1>COUNTIF($F$12:$F$27,\"Komb\"),\"\",B42+1),\"\")","v":""},null,null,null,null,null,"",null,null,null,{"$f":"IF(C43=\"\",\"\",RANK(I43,$I$33:$I$48,1)+COUNTIF($I$33:I43,I43)-1)","v":""}]
[null,{"$f":"IFERROR(IF(B43+1>COUNTIF($F$12:$F$27,\"Komb\"),\"\",B43+1),\"\")","v":""},null,null,null,null,null,"",null,null,null,{"$f":"IF(C44=\"\",\"\",RANK(I44,$I$33:$I$48,1)+COUNTIF($I$33:I44,I44)-1)","v":""}]
[null,{"$f":"IFERROR(IF(B44+1>COUNTIF($F$12:$F$27,\"Komb\"),\"\",B44+1),\"\")","v":""},null,null,null,null,null,"",null,null,null,{"$f":"IF(C45=\"\",\"\",RANK(I45,$I$33:$I$48,1)+COUNTIF($I$33:I45,I45)-1)","v":""}]
[null,{"$f":"IFERROR(IF(B45+1>COUNTIF($F$12:$F$27,\"Komb\"),\"\",B45+1),\"\")","v":""},null,null,null,null,null,"",null,null,null,{"$f":"IF(C46=\"\",\"\",RANK(I46,$I$33:$I$48,1)+COUNTIF($I$33:I46,I46)-1)","v":""}]
[null,{"$f":"IFERROR(IF(B46+1>COUNTIF($F$12:$F$27,\"Komb\"),\"\",B46+1),\"\")","v":""},null,null,null,null,null,"",null,null,null,{"$f":"IF(C47=\"\",\"\",RANK(I47,$I$33:$I$48,1)+COUNTIF($I$33:I47,I47)-1)","v":""}]
[null,{"$f":"IFERROR(IF(B47+1>COUNTIF($F$12:$F$27,\"Komb\"),\"\",B47+1),\"\")","v":""},null,null,null,null,null,"",null,null,null,{"$f":"IF(C48=\"\",\"\",RANK(I48,$I$33:$I$48,1)+COUNTIF($I$33:I48,I48)-1)","v":""}]
[]
[]
[null,null,null,null,"Resultatliste kombinert - individuell kompakt"]
[]
[null,"Plass","Start nr.","Navn","Klubb","F.år","Lengde","A","B","C","Poeng\nHopp","Starttid\nlangrenn","Tid\nlangr",null,"Tid i mål"]
[null,{"$f":"IF(COUNT($I$33:$I$48)>0,1,\"\")","v":1},{"$f":"IF(B54=\"\",\"\",_xlfn.XLOOKUP($B54,$L$33:$L$48,$C$33:$C$48,\"\",0,1))","v":""},{"$f":"IF(C54=\"\",\"\",_xlfn.XLOOKUP($C54,$C$33:$C$48,D$33:D$48,\"\",0,1))","v":""},"","",{"$f":"IF($C54=\"\",\"\",_xlfn.XLOOKUP($C54,$C$12:$C$27,H$12:H$27,\"\",0,1))","v":""},{"$f":"IF($C54=\"\",\"\",_xlfn.XLOOKUP($C54,$C$12:$C$27,I$12:I$27,\"\",0,1))","v":""},"","","",{"$f":"_xlfn.XLOOKUP(C54,$C$32:$C$48,$H$32:$H$48,\"\",0,1)","v":""},{"$f":"IF(C54=\"\",\"\",_xlfn.XLOOKUP(C54,$C$32:$C$48,$I$32:$I$48,\"\",0,1)-L54)","v":""},null,{"$f":"VLOOKUP(C54,C33:I48,7,FALSE)","v":{"$error":"#N/A"}}]
[null,{"$f":"IFERROR(IF(B54+1>COUNT($I$33:$I$48),\"\",B54+1),\"\")","v":""},{"$f":"IF(B55=\"\",\"\",_xlfn.XLOOKUP($B55,$L$33:$L$48,$C$33:$C$48,\"\",0,1))","v":""},"","","",{"$f":"IF($C55=\"\",\"\",_xlfn.XLOOKUP($C55,$C$12:$C$27,H$12:H$27,\"\",0,1))","v":""},"","","","",{"$f":"_xlfn.XLOOKUP(C55,$C$32:$C$48,$H$32:$H$48,\"\",0,1)","v":""},{"$f":"IF(C55=\"\",\"\",_xlfn.XLOOKUP(C55,$C$32:$C$48,$I$32:$I$48,\"\",0,1)-L55)","v":""},{"$f":"IF(C55=\"\",\"\",\"+\")","v":""},{"$f":"IF(C55=\"\",\"\",VLOOKUP($C55,$C$33:$I$48,7,0)-VLOOKUP($C$54,$C$33:$I$48,7,0))","v":""}]
[null,{"$f":"IFERROR(IF(B55+1>COUNT($I$33:$I$48),\"\",B55+1),\"\")","v":""},"","","","","","","","","","","","",{"$f":"IF(C56=\"\",\"\",VLOOKUP($C56,$C$33:$I$48,7,0)-VLOOKUP($C$54,$C$33:$I$48,7,0))","v":""}]
[null,"","","","","","","","","","","","","",""]
[null,"","","","","","","","","","","","","",""]
[null,"","","","","","","","","","","","","",""]
[null,"","","","","","","","","","","","","",""]
[null,"","","","","","","","","","","","","",""]
[null,"","","","","","","","","","","","","",""]
[null,"","","","","","","","","","","","","",""]
[null,"","","","","","","","","","","","","",""]
[null,"","","","","","","","","","","","","",""]
[null,"","","","","","","","","","","","","",""]
[null,"","","","","","","","","","","","","",""]
[null,"","","","","","","","","","","","","",""]
[null,"","","","","","","","","","","","","",""]

{"sheet":"Ledig (4)","index":14,"n_rows":69,"n_cols":18,"rows_kept":69,"cut":false,"hidden":false,"merged":[[8,7,8,11],[8,12,8,16]]}
[]
[null,null,null,null,{"$f":"+'K2'!E2","v":"Namsosrennet i hopp og kombinert 01.02.2026"}]
[]
[]
[null,null,null,null,{"$f":"\"K\"&F6","v":"K120"},null,"Ledig klasse"]
[null,null,null,null,"K-punkt:",120,"meter"]
[null,null,null,null,"Meterverdi:",{"$f":"VLOOKUP(F6,Meterverdier!A:B,2,FALSE)","v":1.8},"poeng/meter"]
[]
[null,null,null,null,null,null,null,"1. omgang",null,null,null,null,"2. omgang"]
[null,null,"Start-",null,null,"Hopp/",null,null,null,null,null,null,null,null,null,null,null,"Poeng"]
[null,"Plassering","nr.","Navn","Klubb","Komb","F.år","Lengde","A","B","C","Poeng","Lengde","A","B","C","Poeng","totalt"]
[null,{"$f":"IF(R12=\"\",\"\",RANK(R12,$R$12:$R$27,0)+COUNTIFS($R$12:R12,R12)-1)","v":1},null,null,null,null,null,61.5,16.5,16,17,{"$f":"IF(H12=\"\",0,60+$F$7*(H12-$F$6)+SUM(I12:K12))","v":4.2000000000000028},62.5,17,16.5,17.5,{"$f":"IF(M12=\"\",\"\",60+$F$7*(M12-$F$6)+SUM(N12:P12))","v":7.5},{"$f":"IF(AND(ISNUMBER(L12),ISNUMBER(Q12)),L12+Q12,0)","v":11.700000000000003}]
[null,{"$f":"IF(R13=\"\",\"\",RANK(R13,$R$12:$R$27,0)+COUNTIFS($R$12:R13,R13)-1)","v":2},null,null,null,null,null,null,null,null,null,0,null,null,null,null,{"$f":"IF(M13=\"\",\"\",60+$F$7*(M13-$F$6)+SUM(N13:P13))","v":""},0]
[null,{"$f":"IF(R14=\"\",\"\",RANK(R14,$R$12:$R$27,0)+COUNTIFS($R$12:R14,R14)-1)","v":3},null,null,null,null,null,null,null,null,null,0,null,null,null,null,{"$f":"IF(M14=\"\",\"\",60+$F$7*(M14-$F$6)+SUM(N14:P14))","v":""},0]
[null,{"$f":"IF(R15=\"\",\"\",RANK(R15,$R$12:$R$27,0)+COUNTIFS($R$12:R15,R15)-1)","v":4},null,null,null,null,null,null,null,null,null,0,null,null,null,null,{"$f":"IF(M15=\"\",\"\",60+$F$7*(M15-$F$6)+SUM(N15:P15))","v":""},0]
[null,{"$f":"IF(R16=\"\",\"\",RANK(R16,$R$12:$R$27,0)+COUNTIFS($R$12:R16,R16)-1)","v":5},null,null,null,null,null,null,null,null,null,0,null,null,null,null,"",0]
[null,{"$f":"IF(R17=\"\",\"\",RANK(R17,$R$12:$R$27,0)+COUNTIFS($R$12:R17,R17)-1)","v":6},null,null,null,null,null,null,null,null,null,0,null,null,null,null,"",0]
[null,{"$f":"IF(R18=\"\",\"\",RANK(R18,$R$12:$R$27,0)+COUNTIFS($R$12:R18,R18)-1)","v":7},null,null,null,null,null,null,null,null,null,0,null,null,null,null,"",0]
[null,{"$f":"IF(R19=\"\",\"\",RANK(R19,$R$12:$R$27,0)+COUNTIFS($R$12:R19,R19)-1)","v":8},null,null,null,null,null,null,null,null,null,0,null,null,null,null,"",0]
[null,{"$f":"IF(R20=\"\",\"\",RANK(R20,$R$12:$R$27,0)+COUNTIFS($R$12:R20,R20)-1)","v":9},null,null,null,null,null,null,null,null,null,0,null,null,null,null,"",0]
[null,{"$f":"IF(R21=\"\",\"\",RANK(R21,$R$12:$R$27,0)+COUNTIFS($R$12:R21,R21)-1)","v":10},null,null,null,null,null,null,null,null,null,0,null,null,null,null,"",0]
[null,{"$f":"IF(R22=\"\",\"\",RANK(R22,$R$12:$R$27,0)+COUNTIFS($R$12:R22,R22)-1)","v":11},null,null,null,null,null,null,null,null,null,0,null,null,null,null,"",0]
[null,{"$f":"IF(R23=\"\",\"\",RANK(R23,$R$12:$R$27,0)+COUNTIFS($R$12:R23,R23)-1)","v":12},null,null,null,null,null,null,null,null,null,0,null,null,null,null,"",0]
[null,{"$f":"IF(R24=\"\",\"\",RANK(R24,$R$12:$R$27,0)+COUNTIFS($R$12:R24,R24)-1)","v":13},null,null,null,null,null,null,null,null,null,0,null,null,null,null,"",0]
[null,{"$f":"IF(R25=\"\",\"\",RANK(R25,$R$12:$R$27,0)+COUNTIFS($R$12:R25,R25)-1)","v":14},null,null,null,null,null,null,null,null,null,0,null,null,null,null,"",0]
[null,{"$f":"IF(R26=\"\",\"\",RANK(R26,$R$12:$R$27,0)+COUNTIFS($R$12:R26,R26)-1)","v":15},null,null,null,null,null,null,null,null,null,0,null,null,null,null,"",0]
[null,{"$f":"IF(R27=\"\",\"\",RANK(R27,$R$12:$R$27,0)+COUNTIFS($R$12:R27,R27)-1)","v":16},null,null,null,null,null,null,null,null,null,0,null,null,null,null,"",0]
[null,null,null,null,null,null,null,null,null,null,{"$f":"IF(G28=\"\",\"\",60+$F$7*(G28-$F$6)+SUM(H28:J28))","v":""},null,null,null,null,{"$f":"IF(L28=\"\",\"\",60+$F$7*(L28-$F$6)+SUM(M28:O28))","v":""},{"$f":"IF(AND(ISNUMBER(K28),ISNUMBER(P28)),K28+P28,\"\")","v":""}]
[]
[null,null,null,null,"Startliste kombinert - individuell kompakt"]
[]
[null,"Plass. Hopp\n 1. omg","Start nr.","Navn","Klubb","F.år","Poeng hopp","Start tid","Tid i mål\nMM:SS,T",null,null,"Plassering"]
[null,{"$f":"IF(COUNTIF($F$12:$F$27,\"Komb\")>0,1,\"\")","v":""},{"$f":"_xlfn._xlws.SORT(_xlfn.HSTACK(_xlfn._xlws.FILTER($C$12:$E$27,$F$12:$F$27=\"Komb\",$L$12:$L$27>0),_xlfn._xlws.FILTER($G$12:$G$27,$F$12:$F$27=\"Komb\",$L$12:$L$27>0),_xlfn._xlws.FILTER($L$12:$L$27,$F$12:$F$27=\"Komb\",$L$12:$L$27>0)),5,-1)","v":{"$error":"#VALUE!"}},null,null,null,null,{"$f":"TIME(0,0,0)","v":"00:00:00"},"00:04:29.800",null,null,{"$f":"IF(C33=\"\",\"\",RANK(I33,$I$33:$I$48,1)+COUNTIF($I$33:I33,I33)-1)","v":{"$error":"#VALUE!"}}]
[null,{"$f":"IFERROR(IF(B33+1>COUNTIF($F$12:$F$27,\"Komb\"),\"\",B33+1),\"\")","v":""},null,null,null,null,null,{"$f":"IF(B34=\"\",\"\",H33+TIME(0,0,6))","v":""},null,null,null,{"$f":"IF(C34=\"\",\"\",RANK(I34,$I$33:$I$48,1)+COUNTIF($I$33:I34,I34)-1)","v":""}]
[null,{"$f":"IFERROR(IF(B34+1>COUNTIF($F$12:$F$27,\"Komb\"),\"\",B34+1),\"\")","v":""},null,null,null,null,null,{"$f":"IF(B35=\"\",\"\",H34+TIME(0,0,6))","v":""},null,null,null,{"$f":"IF(C35=\"\",\"\",RANK(I35,$I$33:$I$48,1)+COUNTIF($I$33:I35,I35)-1)","v":""}]
[null,"",null,null,null,null,null,"",null,null,null,{"$f":"IF(C36=\"\",\"\",RANK(I36,$I$33:$I$48,1)+COUNTIF($I$33:I36,I36)-1)","v":""}]
[null,"",null,null,null,null,null,"",null,null,null,{"$f":"IF(C37=\"\",\"\",RANK(I37,$I$33:$I$48,1)+COUNTIF($I$33:I37,I37)-1)","v":""}]
[null,"",null,null,null,null,null,"",null,null,null,{"$f":"IF(C38=\"\",\"\",RANK(I38,$I$33:$I$48,1)+COUNTIF($I$33:I38,I38)-1)","v":""}]
[null,"",null,null,null,null,null,"",null,null,null,{"$f":"IF(C39=\"\",\"\",RANK(I39,$I$33:$I$48,1)+COUNTIF($I$33:I39,I39)-1)","v":""}]
[null,"",null,null,null,null,null,"",null,null,null,{"$f":"IF(C40=\"\",\"\",RANK(I40,$I$33:$I$48,1)+COUNTIF($I$33:I40,I40)-1)","v":""}]
[null,"",null,null,null,null,null,"",null,null,null,{"$f":"IF(C41=\"\",\"\",RANK(I41,$I$33:$I$48,1)+COUNTIF($I$33:I41,I41)-1)","v":""}]
[null,"",null,null,null,null,null,"",null,null,null,{"$f":"IF(C42=\"\",\"\",RANK(I42,$I$33:$I$48,1)+COUNTIF($I$33:I42,I42)-1)","v":""}]
[null,"",null,null,null,null,null,"",null,null,null,{"$f":"IF(C43=\"\",\"\",RANK(I43,$I$33:$I$48,1)+COUNTIF($I$33:I43,I43)-1)","v":""}]
[null,"",null,null,null,null,null,"",null,null,null,{"$f":"IF(C44=\"\",\"\",RANK(I44,$I$33:$I$48,1)+COUNTIF($I$33:I44,I44)-1)","v":""}]
[null,"",null,null,null,null,null,"",null,null,null,{"$f":"IF(C45=\"\",\"\",RANK(I45,$I$33:$I$48,1)+COUNTIF($I$33:I45,I45)-1)","v":""}]
[null,"",null,null,null,null,null,"",null,null,null,{"$f":"IF(C46=\"\",\"\",RANK(I46,$I$33:$I$48,1)+COUNTIF($I$33:I46,I46)-1)","v":""}]
[null,"",null,null,null,null,null,"",null,null,null,{"$f":"IF(C47=\"\",\"\",RANK(I47,$I$33:$I$48,1)+COUNTIF($I$33:I47,I47)-1)","v":""}]
[null,"",null,null,null,null,null,"",null,null,null,{"$f":"IF(C48=\"\",\"\",RANK(I48,$I$33:$I$48,1)+COUNTIF($I$33:I48,I48)-1)","v":""}]
[]
[]
[null,null,null,null,"Resultatliste kombinert - individuell kompakt"]
[]
[null,"Plass","Start nr.","Navn","Klubb","F.år","Lengde","A","B","C","Poeng\nHopp","Starttid\nlangrenn","Tid\nlangr",null,"Tid i mål"]
[null,{"$f":"IF(COUNT($I$33:$I$48)>0,1,\"\")","v":1},{"$f":"IF(B54=\"\",\"\",_xlfn.XLOOKUP($B54,$L$33:$L$48,$C$33:$C$48,\"\",0,1))","v":""},{"$f":"IF(C54=\"\",\"\",_xlfn.XLOOKUP($C54,$C$33:$C$48,D$33:D$48,\"\",0,1))","v":""},"","",{"$f":"IF($C54=\"\",\"\",_xlfn.XLOOKUP($C54,$C$12:$C$27,H$12:H$27,\"\",0,1))","v":""},{"$f":"IF($C54=\"\",\"\",_xlfn.XLOOKUP($C54,$C$12:$C$27,I$12:I$27,\"\",0,1))","v":""},"","","",{"$f":"_xlfn.XLOOKUP(C54,$C$32:$C$48,$H$32:$H$48,\"\",0,1)","v":""},{"$f":"IF(C54=\"\",\"\",_xlfn.XLOOKUP(C54,$C$32:$C$48,$I$32:$I$48,\"\",0,1)-L54)","v":""},null,{"$f":"VLOOKUP(C54,C33:I48,7,FALSE)","v":{"$error":"#N/A"}}]
[null,{"$f":"IFERROR(IF(B54+1>COUNT($I$33:$I$48),\"\",B54+1),\"\")","v":""},{"$f":"IF(B55=\"\",\"\",_xlfn.XLOOKUP($B55,$L$33:$L$48,$C$33:$C$48,\"\",0,1))","v":""},"","","",{"$f":"IF($C55=\"\",\"\",_xlfn.XLOOKUP($C55,$C$12:$C$27,H$12:H$27,\"\",0,1))","v":""},"","","","",{"$f":"_xlfn.XLOOKUP(C55,$C$32:$C$48,$H$32:$H$48,\"\",0,1)","v":""},{"$f":"IF(C55=\"\",\"\",_xlfn.XLOOKUP(C55,$C$32:$C$48,$I$32:$I$48,\"\",0,1)-L55)","v":""},{"$f":"IF(C55=\"\",\"\",\"+\")","v":""},{"$f":"IF(C55=\"\",\"\",VLOOKUP($C55,$C$33:$I$48,7,0)-VLOOKUP($C$54,$C$33:$I$48,7,0))","v":""}]
[null,{"$f":"IFERROR(IF(B55+1>COUNT($I$33:$I$48),\"\",B55+1),\"\")","v":""},"","","","","","","","","","","","",{"$f":"IF(C56=\"\",\"\",VLOOKUP($C56,$C$33:$I$48,7,0)-VLOOKUP($C$54,$C$33:$I$48,7,0))","v":""}]
[null,"","","","","","","","","","","","","",""]
[null,"","","","","","","","","","","","","",""]
[null,"","","","","","","","","","","","","",""]
[null,"","","","","","","","","","","","","",""]
[null,"","","","","","","","","","","","","",""]
[null,"","","","","","","","","","","","","",""]
[null,"","","","","","","","","","","","","",""]
[null,"","","","","","","","","","","","","",""]
[null,"","","","","","","","","","","","","",""]
[null,"","","","","","","","","","","","","",""]
[null,"","","","","","","","","","","","","",""]
[null,"","","","","","","","","","","","","",""]
[null,"","","","","","","","","","","","","",""]

{"sheet":"Ledig (5)","index":15,"n_rows":69,"n_cols":18,"rows_kept":69,"cut":false,"hidden":false,"merged":[[8,7,8,11],[8,12,8,16]]}
[]
[null,null,null,null,{"$f":"+'K2'!E2","v":"Namsosrennet i hopp og kombinert 01.02.2026"}]
[]
[]
[null,null,null,null,{"$f":"\"K\"&F6","v":"K120"},null,"Ledig klasse"]
[null,null,null,null,"K-punkt:",120,"meter"]
[null,null,null,null,"Meterverdi:",{"$f":"VLOOKUP(F6,Meterverdier!A:B,2,FALSE)","v":1.8},"poeng/meter"]
[]
[null,null,null,null,null,null,null,"1. omgang",null,null,null,null,"2. omgang"]
[null,null,"Start-",null,null,"Hopp/",null,null,null,null,null,null,null,null,null,null,null,"Poeng"]
[null,"Plassering","nr.","Navn","Klubb","Komb","F.år","Lengde","A","B","C","Poeng","Lengde","A","B","C","Poeng","totalt"]
[null,{"$f":"IF(R12=\"\",\"\",RANK(R12,$R$12:$R$27,0)+COUNTIFS($R$12:R12,R12)-1)","v":1},167,"Ingrid Græsli","Tydal il","Komb","A J15",61.5,16.5,16,17,{"$f":"IF(H12=\"\",0,60+$F$7*(H12-$F$6)+SUM(I12:K12))","v":4.2000000000000028},62.5,17,16.5,17.5,{"$f":"IF(M12=\"\",\"\",60+$F$7*(M12-$F$6)+SUM(N12:P12))","v":7.5},{"$f":"IF(AND(ISNUMBER(L12),ISNUMBER(Q12)),L12+Q12,0)","v":11.700000000000003}]
[null,{"$f":"IF(R13=\"\",\"\",RANK(R13,$R$12:$R$27,0)+COUNTIFS($R$12:R13,R13)-1)","v":2},null,null,null,null,null,null,null,null,null,0,null,null,null,null,{"$f":"IF(M13=\"\",\"\",60+$F$7*(M13-$F$6)+SUM(N13:P13))","v":""},0]
[null,{"$f":"IF(R14=\"\",\"\",RANK(R14,$R$12:$R$27,0)+COUNTIFS($R$12:R14,R14)-1)","v":3},null,null,null,null,null,null,null,null,null,0,null,null,null,null,{"$f":"IF(M14=\"\",\"\",60+$F$7*(M14-$F$6)+SUM(N14:P14))","v":""},0]
[null,{"$f":"IF(R15=\"\",\"\",RANK(R15,$R$12:$R$27,0)+COUNTIFS($R$12:R15,R15)-1)","v":4},null,null,null,null,null,null,null,null,null,0,null,null,null,null,{"$f":"IF(M15=\"\",\"\",60+$F$7*(M15-$F$6)+SUM(N15:P15))","v":""},0]
[null,{"$f":"IF(R16=\"\",\"\",RANK(R16,$R$12:$R$27,0)+COUNTIFS($R$12:R16,R16)-1)","v":5},null,null,null,null,null,null,null,null,null,0,null,null,null,null,"",0]
[null,{"$f":"IF(R17=\"\",\"\",RANK(R17,$R$12:$R$27,0)+COUNTIFS($R$12:R17,R17)-1)","v":6},null,null,null,null,null,null,null,null,null,0,null,null,null,null,"",0]
[null,{"$f":"IF(R18=\"\",\"\",RANK(R18,$R$12:$R$27,0)+COUNTIFS($R$12:R18,R18)-1)","v":7},null,null,null,null,null,null,null,null,null,0,null,null,null,null,"",0]
[null,{"$f":"IF(R19=\"\",\"\",RANK(R19,$R$12:$R$27,0)+COUNTIFS($R$12:R19,R19)-1)","v":8},null,null,null,null,null,null,null,null,null,0,null,null,null,null,"",0]
[null,{"$f":"IF(R20=\"\",\"\",RANK(R20,$R$12:$R$27,0)+COUNTIFS($R$12:R20,R20)-1)","v":9},null,null,null,null,null,null,null,null,null,0,null,null,null,null,"",0]
[null,{"$f":"IF(R21=\"\",\"\",RANK(R21,$R$12:$R$27,0)+COUNTIFS($R$12:R21,R21)-1)","v":10},null,null,null,null,null,null,null,null,null,0,null,null,null,null,"",0]
[null,{"$f":"IF(R22=\"\",\"\",RANK(R22,$R$12:$R$27,0)+COUNTIFS($R$12:R22,R22)-1)","v":11},null,null,null,null,null,null,null,null,null,0,null,null,null,null,"",0]
[null,{"$f":"IF(R23=\"\",\"\",RANK(R23,$R$12:$R$27,0)+COUNTIFS($R$12:R23,R23)-1)","v":12},null,null,null,null,null,null,null,null,null,0,null,null,null,null,"",0]
[null,{"$f":"IF(R24=\"\",\"\",RANK(R24,$R$12:$R$27,0)+COUNTIFS($R$12:R24,R24)-1)","v":13},null,null,null,null,null,null,null,null,null,0,null,null,null,null,"",0]
[null,{"$f":"IF(R25=\"\",\"\",RANK(R25,$R$12:$R$27,0)+COUNTIFS($R$12:R25,R25)-1)","v":14},null,null,null,null,null,null,null,null,null,0,null,null,null,null,"",0]
[null,{"$f":"IF(R26=\"\",\"\",RANK(R26,$R$12:$R$27,0)+COUNTIFS($R$12:R26,R26)-1)","v":15},null,null,null,null,null,null,null,null,null,0,null,null,null,null,"",0]
[null,{"$f":"IF(R27=\"\",\"\",RANK(R27,$R$12:$R$27,0)+COUNTIFS($R$12:R27,R27)-1)","v":16},null,null,null,null,null,null,null,null,null,0,null,null,null,null,"",0]
[null,null,null,null,null,null,null,null,null,null,{"$f":"IF(G28=\"\",\"\",60+$F$7*(G28-$F$6)+SUM(H28:J28))","v":""},null,null,null,null,{"$f":"IF(L28=\"\",\"\",60+$F$7*(L28-$F$6)+SUM(M28:O28))","v":""},{"$f":"IF(AND(ISNUMBER(K28),ISNUMBER(P28)),K28+P28,\"\")","v":""}]
[]
[null,null,null,null,"Startliste kombinert - individuell kompakt"]
[]
[null,"Plass. Hopp\n 1. omg","Start nr.","Navn","Klubb","F.år","Poeng hopp","Start tid","Tid i mål\nMM:SS,T",null,null,"Plassering"]
[null,{"$f":"IF(COUNTIF($F$12:$F$27,\"Komb\")>0,1,\"\")","v":1},{"$f":"_xlfn._xlws.SORT(_xlfn.HSTACK(_xlfn._xlws.FILTER($C$12:$E$27,$F$12:$F$27=\"Komb\",$L$12:$L$27>0),_xlfn._xlws.FILTER($G$12:$G$27,$F$12:$F$27=\"Komb\",$L$12:$L$27>0),_xlfn._xlws.FILTER($L$12:$L$27,$F$12:$F$27=\"Komb\",$L$12:$L$27>0)),5,-1)","v":167},"Ingrid Græsli","Tydal il","A J15",4.2000000000000028,{"$f":"TIME(0,0,0)","v":"00:00:00"},"00:04:29.800",null,null,{"$f":"IF(C33=\"\",\"\",RANK(I33,$I$33:$I$48,1)+COUNTIF($I$33:I33,I33)-1)","v":1}]
[null,{"$f":"IFERROR(IF(B33+1>COUNTIF($F$12:$F$27,\"Komb\"),\"\",B33+1),\"\")","v":""},null,null,null,null,null,{"$f":"IF(B34=\"\",\"\",H33+TIME(0,0,6))","v":""},null,null,null,{"$f":"IF(C34=\"\",\"\",RANK(I34,$I$33:$I$48,1)+COUNTIF($I$33:I34,I34)-1)","v":""}]
[null,{"$f":"IFERROR(IF(B34+1>COUNTIF($F$12:$F$27,\"Komb\"),\"\",B34+1),\"\")","v":""},null,null,null,null,null,{"$f":"IF(B35=\"\",\"\",H34+TIME(0,0,6))","v":""},null,null,null,{"$f":"IF(C35=\"\",\"\",RANK(I35,$I$33:$I$48,1)+COUNTIF($I$33:I35,I35)-1)","v":""}]
[null,"",null,null,null,null,null,"",null,null,null,{"$f":"IF(C36=\"\",\"\",RANK(I36,$I$33:$I$48,1)+COUNTIF($I$33:I36,I36)-1)","v":""}]
[null,"",null,null,null,null,null,"",null,null,null,{"$f":"IF(C37=\"\",\"\",RANK(I37,$I$33:$I$48,1)+COUNTIF($I$33:I37,I37)-1)","v":""}]
[null,"",null,null,null,null,null,"",null,null,null,{"$f":"IF(C38=\"\",\"\",RANK(I38,$I$33:$I$48,1)+COUNTIF($I$33:I38,I38)-1)","v":""}]
[null,"",null,null,null,null,null,"",null,null,null,{"$f":"IF(C39=\"\",\"\",RANK(I39,$I$33:$I$48,1)+COUNTIF($I$33:I39,I39)-1)","v":""}]
[null,"",null,null,null,null,null,"",null,null,null,{"$f":"IF(C40=\"\",\"\",RANK(I40,$I$33:$I$48,1)+COUNTIF($I$33:I40,I40)-1)","v":""}]
[null,"",null,null,null,null,null,"",null,null,null,{"$f":"IF(C41=\"\",\"\",RANK(I41,$I$33:$I$48,1)+COUNTIF($I$33:I41,I41)-1)","v":""}]
[null,"",null,null,null,null,null,"",null,null,null,{"$f":"IF(C42=\"\",\"\",RANK(I42,$I$33:$I$48,1)+COUNTIF($I$33:I42,I42)-1)","v":""}]
[null,"",null,null,null,null,null,"",null,null,null,{"$f":"IF(C43=\"\",\"\",RANK(I43,$I$33:$I$48,1)+COUNTIF($I$33:I43,I43)-1)","v":""}]
[null,"",null,null,null,null,null,"",null,null,null,{"$f":"IF(C44=\"\",\"\",RANK(I44,$I$33:$I$48,1)+COUNTIF($I$33:I44,I44)-1)","v":""}]
[null,"",null,null,null,null,null,"",null,null,null,{"$f":"IF(C45=\"\",\"\",RANK(I45,$I$33:$I$48,1)+COUNTIF($I$33:I45,I45)-1)","v":""}]
[null,"",null,null,null,null,null,"",null,null,null,{"$f":"IF(C46=\"\",\"\",RANK(I46,$I$33:$I$48,1)+COUNTIF($I$33:I46,I46)-1)","v":""}]
[null,"",null,null,null,null,null,"",null,null,null,{"$f":"IF(C47=\"\",\"\",RANK(I47,$I$33:$I$48,1)+COUNTIF($I$33:I47,I47)-1)","v":""}]
[null,"",null,null,null,null,null,"",null,null,null,{"$f":"IF(C48=\"\",\"\",RANK(I48,$I$33:$I$48,1)+COUNTIF($I$33:I48,I48)-1)","v":""}]
[]
[]
[null,null,null,null,"Resultatliste kombinert - individuell kompakt"]
[]
[null,"Plass","Start nr.","Navn","Klubb","F.år","Lengde","A","B","C","Poeng\nHopp","Starttid\nlangrenn","Tid\nlangr",null,"Tid i mål"]
[null,{"$f":"IF(COUNT($I$33:$I$48)>0,1,\"\")","v":1},{"$f":"IF(B54=\"\",\"\",_xlfn.XLOOKUP($B54,$L$33:$L$48,$C$33:$C$48,\"\",0,1))","v":167},{"$f":"IF(C54=\"\",\"\",_xlfn.XLOOKUP($C54,$C$33:$C$48,D$33:D$48,\"\",0,1))","v":"Ingrid Græsli"},"Tydal il","A J15",{"$f":"IF($C54=\"\",\"\",_xlfn.XLOOKUP($C54,$C$12:$C$27,H$12:H$27,\"\",0,1))","v":61.5},{"$f":"IF($C54=\"\",\"\",_xlfn.XLOOKUP($C54,$C$12:$C$27,I$12:I$27,\"\",0,1))","v":16.5},16,17,4.2000000000000028,{"$f":"_xlfn.XLOOKUP(C54,$C$32:$C$48,$H$32:$H$48,\"\",0,1)","v":"00:00:00"},{"$f":"IF(C54=\"\",\"\",_xlfn.XLOOKUP(C54,$C$32:$C$48,$I$32:$I$48,\"\",0,1)-L54)","v":"00:04:29.800"},null,{"$f":"VLOOKUP(C54,C33:I48,7,FALSE)","v":"00:04:29.800"}]
[null,{"$f":"IFERROR(IF(B54+1>COUNT($I$33:$I$48),\"\",B54+1),\"\")","v":""},{"$f":"IF(B55=\"\",\"\",_xlfn.XLOOKUP($B55,$L$33:$L$48,$C$33:$C$48,\"\",0,1))","v":""},"","","",{"$f":"IF($C55=\"\",\"\",_xlfn.XLOOKUP($C55,$C$12:$C$27,H$12:H$27,\"\",0,1))","v":""},"","","","",{"$f":"_xlfn.XLOOKUP(C55,$C$32:$C$48,$H$32:$H$48,\"\",0,1)","v":""},{"$f":"IF(C55=\"\",\"\",_xlfn.XLOOKUP(C55,$C$32:$C$48,$I$32:$I$48,\"\",0,1)-L55)","v":""},{"$f":"IF(C55=\"\",\"\",\"+\")","v":""},{"$f":"IF(C55=\"\",\"\",VLOOKUP($C55,$C$33:$I$48,7,0)-VLOOKUP($C$54,$C$33:$I$48,7,0))","v":""}]
[null,{"$f":"IFERROR(IF(B55+1>COUNT($I$33:$I$48),\"\",B55+1),\"\")","v":""},"","","","","","","","","","","","",{"$f":"IF(C56=\"\",\"\",VLOOKUP($C56,$C$33:$I$48,7,0)-VLOOKUP($C$54,$C$33:$I$48,7,0))","v":""}]
[null,"","","","","","","","","","","","","",""]
[null,"","","","","","","","","","","","","",""]
[null,"","","","","","","","","","","","","",""]
[null,"","","","","","","","","","","","","",""]
[null,"","","","","","","","","","","","","",""]
[null,"","","","","","","","","","","","","",""]
[null,"","","","","","","","","","","","","",""]
[null,"","","","","","","","","","","","","",""]
[null,"","","","","","","","","","","","","",""]
[null,"","","","","","","","","","","","","",""]
[null,"","","","","","","","","","","","","",""]
[null,"","","","","","","","","","","","","",""]
[null,"","","","","","","","","","","","","",""]

{"sheet":"Ledig (6)","index":16,"n_rows":69,"n_cols":18,"rows_kept":69,"cut":false,"hidden":false,"merged":[[8,7,8,11],[8,12,8,16]]}
[]
[null,null,null,null,{"$f":"+'K2'!E2","v":"Namsosrennet i hopp og kombinert 01.02.2026"}]
[]
[]
[null,null,null,null,{"$f":"\"K\"&F6","v":"K120"},null,"Ledig klasse"]
[null,null,null,null,"K-punkt:",120,"meter"]
[null,null,null,null,"Meterverdi:",{"$f":"VLOOKUP(F6,Meterverdier!A:B,2,FALSE)","v":1.8},"poeng/meter"]
[]
[null,null,null,null,null,null,null,"1. omgang",null,null,null,null,"2. omgang"]
[null,null,"Start-",null,null,"Hopp/",null,null,null,null,null,null,null,null,null,null,null,"Poeng"]
[null,"Plassering","nr.","Navn","Klubb","Komb","F.år","Lengde","A","B","C","Poeng","Lengde","A","B","C","Poeng","totalt"]
[null,{"$f":"IF(R12=\"\",\"\",RANK(R12,$R$12:$R$27,0)+COUNTIFS($R$12:R12,R12)-1)","v":1},167,"Ingrid Græsli","Tydal il","Komb","A J15",61.5,16.5,16,17,{"$f":"IF(H12=\"\",0,60+$F$7*(H12-$F$6)+SUM(I12:K12))","v":4.2000000000000028},62.5,17,16.5,17.5,{"$f":"IF(M12=\"\",\"\",60+$F$7*(M12-$F$6)+SUM(N12:P12))","v":7.5},{"$f":"IF(AND(ISNUMBER(L12),ISNUMBER(Q12)),L12+Q12,0)","v":11.700000000000003}]
[null,{"$f":"IF(R13=\"\",\"\",RANK(R13,$R$12:$R$27,0)+COUNTIFS($R$12:R13,R13)-1)","v":2},null,null,null,null,null,null,null,null,null,0,null,null,null,null,{"$f":"IF(M13=\"\",\"\",60+$F$7*(M13-$F$6)+SUM(N13:P13))","v":""},0]
[null,{"$f":"IF(R14=\"\",\"\",RANK(R14,$R$12:$R$27,0)+COUNTIFS($R$12:R14,R14)-1)","v":3},null,null,null,null,null,null,null,null,null,0,null,null,null,null,{"$f":"IF(M14=\"\",\"\",60+$F$7*(M14-$F$6)+SUM(N14:P14))","v":""},0]
[null,{"$f":"IF(R15=\"\",\"\",RANK(R15,$R$12:$R$27,0)+COUNTIFS($R$12:R15,R15)-1)","v":4},null,null,null,null,null,null,null,null,null,0,null,null,null,null,{"$f":"IF(M15=\"\",\"\",60+$F$7*(M15-$F$6)+SUM(N15:P15))","v":""},0]
[null,{"$f":"IF(R16=\"\",\"\",RANK(R16,$R$12:$R$27,0)+COUNTIFS($R$12:R16,R16)-1)","v":5},null,null,null,null,null,null,null,null,null,0,null,null,null,null,"",0]
[null,{"$f":"IF(R17=\"\",\"\",RANK(R17,$R$12:$R$27,0)+COUNTIFS($R$12:R17,R17)-1)","v":6},null,null,null,null,null,null,null,null,null,0,null,null,null,null,"",0]
[null,{"$f":"IF(R18=\"\",\"\",RANK(R18,$R$12:$R$27,0)+COUNTIFS($R$12:R18,R18)-1)","v":7},null,null,null,null,null,null,null,null,null,0,null,null,null,null,"",0]
[null,{"$f":"IF(R19=\"\",\"\",RANK(R19,$R$12:$R$27,0)+COUNTIFS($R$12:R19,R19)-1)","v":8},null,null,null,null,null,null,null,null,null,0,null,null,null,null,"",0]
[null,{"$f":"IF(R20=\"\",\"\",RANK(R20,$R$12:$R$27,0)+COUNTIFS($R$12:R20,R20)-1)","v":9},null,null,null,null,null,null,null,null,null,0,null,null,null,null,"",0]
[null,{"$f":"IF(R21=\"\",\"\",RANK(R21,$R$12:$R$27,0)+COUNTIFS($R$12:R21,R21)-1)","v":10},null,null,null,null,null,null,null,null,null,0,null,null,null,null,"",0]
[null,{"$f":"IF(R22=\"\",\"\",RANK(R22,$R$12:$R$27,0)+COUNTIFS($R$12:R22,R22)-1)","v":11},null,null,null,null,null,null,null,null,null,0,null,null,null,null,"",0]
[null,{"$f":"IF(R23=\"\",\"\",RANK(R23,$R$12:$R$27,0)+COUNTIFS($R$12:R23,R23)-1)","v":12},null,null,null,null,null,null,null,null,null,0,null,null,null,null,"",0]
[null,{"$f":"IF(R24=\"\",\"\",RANK(R24,$R$12:$R$27,0)+COUNTIFS($R$12:R24,R24)-1)","v":13},null,null,null,null,null,null,null,null,null,0,null,null,null,null,"",0]
[null,{"$f":"IF(R25=\"\",\"\",RANK(R25,$R$12:$R$27,0)+COUNTIFS($R$12:R25,R25)-1)","v":14},null,null,null,null,null,null,null,null,null,0,null,null,null,null,"",0]
[null,{"$f":"IF(R26=\"\",\"\",RANK(R26,$R$12:$R$27,0)+COUNTIFS($R$12:R26,R26)-1)","v":15},null,null,null,null,null,null,null,null,null,0,null,null,null,null,"",0]
[null,{"$f":"IF(R27=\"\",\"\",RANK(R27,$R$12:$R$27,0)+COUNTIFS($R$12:R27,R27)-1)","v":16},null,null,null,null,null,null,null,null,null,0,null,null,null,null,"",0]
[null,null,null,null,null,null,null,null,null,null,{"$f":"IF(G28=\"\",\"\",60+$F$7*(G28-$F$6)+SUM(H28:J28))","v":""},null,null,null,null,{"$f":"IF(L28=\"\",\"\",60+$F$7*(L28-$F$6)+SUM(M28:O28))","v":""},{"$f":"IF(AND(ISNUMBER(K28),ISNUMBER(P28)),K28+P28,\"\")","v":""}]
[]
[null,null,null,null,"Startliste kombinert - individuell kompakt"]
[]
[null,"Plass. Hopp\n 1. omg","Start nr.","Navn","Klubb","F.år","Poeng hopp","Start tid","Tid i mål\nMM:SS,T",null,null,"Plassering"]
[null,{"$f":"IF(COUNTIF($F$12:$F$27,\"Komb\")>0,1,\"\")","v":1},{"$f":"_xlfn._xlws.SORT(_xlfn.HSTACK(_xlfn._xlws.FILTER($C$12:$E$27,$F$12:$F$27=\"Komb\",$L$12:$L$27>0),_xlfn._xlws.FILTER($G$12:$G$27,$F$12:$F$27=\"Komb\",$L$12:$L$27>0),_xlfn._xlws.FILTER($L$12:$L$27,$F$12:$F$27=\"Komb\",$L$12:$L$27>0)),5,-1)","v":167},"Ingrid Græsli","Tydal il","A J15",4.2000000000000028,{"$f":"TIME(0,0,0)","v":"00:00:00"},"00:04:29.800",null,null,{"$f":"IF(C33=\"\",\"\",RANK(I33,$I$33:$I$48,1)+COUNTIF($I$33:I33,I33)-1)","v":1}]
[null,{"$f":"IFERROR(IF(B33+1>COUNTIF($F$12:$F$27,\"Komb\"),\"\",B33+1),\"\")","v":""},null,null,null,null,null,{"$f":"IF(B34=\"\",\"\",H33+TIME(0,0,6))","v":""},null,null,null,{"$f":"IF(C34=\"\",\"\",RANK(I34,$I$33:$I$48,1)+COUNTIF($I$33:I34,I34)-1)","v":""}]
[null,{"$f":"IFERROR(IF(B34+1>COUNTIF($F$12:$F$27,\"Komb\"),\"\",B34+1),\"\")","v":""},null,null,null,null,null,{"$f":"IF(B35=\"\",\"\",H34+TIME(0,0,6))","v":""},null,null,null,{"$f":"IF(C35=\"\",\"\",RANK(I35,$I$33:$I$48,1)+COUNTIF($I$33:I35,I35)-1)","v":""}]
[null,"",null,null,null,null,null,"",null,null,null,{"$f":"IF(C36=\"\",\"\",RANK(I36,$I$33:$I$48,1)+COUNTIF($I$33:I36,I36)-1)","v":""}]
[null,"",null,null,null,null,null,"",null,null,null,{"$f":"IF(C37=\"\",\"\",RANK(I37,$I$33:$I$48,1)+COUNTIF($I$33:I37,I37)-1)","v":""}]
[null,"",null,null,null,null,null,"",null,null,null,{"$f":"IF(C38=\"\",\"\",RANK(I38,$I$33:$I$48,1)+COUNTIF($I$33:I38,I38)-1)","v":""}]
[null,"",null,null,null,null,null,"",null,null,null,{"$f":"IF(C39=\"\",\"\",RANK(I39,$I$33:$I$48,1)+COUNTIF($I$33:I39,I39)-1)","v":""}]
[null,"",null,null,null,null,null,"",null,null,null,{"$f":"IF(C40=\"\",\"\",RANK(I40,$I$33:$I$48,1)+COUNTIF($I$33:I40,I40)-1)","v":""}]
[null,"",null,null,null,null,null,"",null,null,null,{"$f":"IF(C41=\"\",\"\",RANK(I41,$I$33:$I$48,1)+COUNTIF($I$33:I41,I41)-1)","v":""}]
[null,"",null,null,null,null,null,"",null,null,null,{"$f":"IF(C42=\"\",\"\",RANK(I42,$I$33:$I$48,1)+COUNTIF($I$33:I42,I42)-1)","v":""}]
[null,"",null,null,null,null,null,"",null,null,null,{"$f":"IF(C43=\"\",\"\",RANK(I43,$I$33:$I$48,1)+COUNTIF($I$33:I43,I43)-1)","v":""}]
[null,"",null,null,null,null,null,"",null,null,null,{"$f":"IF(C44=\"\",\"\",RANK(I44,$I$33:$I$48,1)+COUNTIF($I$33:I44,I44)-1)","v":""}]
[null,"",null,null,null,null,null,"",null,null,null,{"$f":"IF(C45=\"\",\"\",RANK(I45,$I$33:$I$48,1)+COUNTIF($I$33:I45,I45)-1)","v":""}]
[null,"",null,null,null,null,null,"",null,null,null,{"$f":"IF(C46=\"\",\"\",RANK(I46,$I$33:$I$48,1)+COUNTIF($I$33:I46,I46)-1)","v":""}]
[null,"",null,null,null,null,null,"",null,null,null,{"$f":"IF(C47=\"\",\"\",RANK(I47,$I$33:$I$48,1)+COUNTIF($I$33:I47,I47)-1)","v":""}]
[null,"",null,null,null,null,null,"",null,null,null,{"$f":"IF(C48=\"\",\"\",RANK(I48,$I$33:$I$48,1)+COUNTIF($I$33:I48,I48)-1)","v":""}]
[]
[]
[null,null,null,null,"Resultatliste kombinert - individuell kompakt"]
[]
[null,"Plass","Start nr.","Navn","Klubb","F.år","Lengde","A","B","C","Poeng\nHopp","Starttid\nlangrenn","Tid\nlangr",null,"Tid i mål"]
[null,{"$f":"IF(COUNT($I$33:$I$48)>0,1,\"\")","v":1},{"$f":"IF(B54=\"\",\"\",_xlfn.XLOOKUP($B54,$L$33:$L$48,$C$33:$C$48,\"\",0,1))","v":167},{"$f":"IF(C54=\"\",\"\",_xlfn.XLOOKUP($C54,$C$33:$C$48,D$33:D$48,\"\",0,1))","v":"Ingrid Græsli"},"Tydal il","A J15",{"$f":"IF($C54=\"\",\"\",_xlfn.XLOOKUP($C54,$C$12:$C$27,H$12:H$27,\"\",0,1))","v":61.5},{"$f":"IF($C54=\"\",\"\",_xlfn.XLOOKUP($C54,$C$12:$C$27,I$12:I$27,\"\",0,1))","v":16.5},16,17,4.2000000000000028,{"$f":"_xlfn.XLOOKUP(C54,$C$32:$C$48,$H$32:$H$48,\"\",0,1)","v":"00:00:00"},{"$f":"IF(C54=\"\",\"\",_xlfn.XLOOKUP(C54,$C$32:$C$48,$I$32:$I$48,\"\",0,1)-L54)","v":"00:04:29.800"},null,{"$f":"VLOOKUP(C54,C33:I48,7,FALSE)","v":"00:04:29.800"}]
[null,{"$f":"IFERROR(IF(B54+1>COUNT($I$33:$I$48),\"\",B54+1),\"\")","v":""},{"$f":"IF(B55=\"\",\"\",_xlfn.XLOOKUP($B55,$L$33:$L$48,$C$33:$C$48,\"\",0,1))","v":""},"","","",{"$f":"IF($C55=\"\",\"\",_xlfn.XLOOKUP($C55,$C$12:$C$27,H$12:H$27,\"\",0,1))","v":""},"","","","",{"$f":"_xlfn.XLOOKUP(C55,$C$32:$C$48,$H$32:$H$48,\"\",0,1)","v":""},{"$f":"IF(C55=\"\",\"\",_xlfn.XLOOKUP(C55,$C$32:$C$48,$I$32:$I$48,\"\",0,1)-L55)","v":""},{"$f":"IF(C55=\"\",\"\",\"+\")","v":""},{"$f":"IF(C55=\"\",\"\",VLOOKUP($C55,$C$33:$I$48,7,0)-VLOOKUP($C$54,$C$33:$I$48,7,0))","v":""}]
[null,{"$f":"IFERROR(IF(B55+1>COUNT($I$33:$I$48),\"\",B55+1),\"\")","v":""},"","","","","","","","","","","","",{"$f":"IF(C56=\"\",\"\",VLOOKUP($C56,$C$33:$I$48,7,0)-VLOOKUP($C$54,$C$33:$I$48,7,0))","v":""}]
[null,"","","","","","","","","","","","","",""]
[null,"","","","","","","","","","","","","",""]
[null,"","","","","","","","","","","","","",""]
[null,"","","","","","","","","","","","","",""]
[null,"","","","","","","","","","","","","",""]
[null,"","","","","","","","","","","","","",""]
[null,"","","","","","","","","","","","","",""]
[null,"","","","","","","","","","","","","",""]
[null,"","","","","","","","","","","","","",""]
[null,"","","","","","","","","","","","","",""]
[null,"","","","","","","","","","","","","",""]
[null,"","","","","","","","","","","","","",""]
[null,"","","","","","","","","","","","","",""]

{"sheet":"K65 RCB G","index":17,"n_rows":69,"n_cols":18,"rows_kept":69,"cut":false,"hidden":true,"merged":[[8,7,8,11],[8,12,8,16]]}
[]
[null,null,null,null,"Granåsenrennet - SMN 1 Trøndercup i hopp og kombinert 11.02.2024"]
[]
[]
[null,null,null,null,{"$f":"\"K\"&F6","v":"K65"},null,"RCB Gutter"]
[null,null,null,null,"K-punkt:",65,"meter"]
[null,null,null,null,"Meterverdi:",{"$f":"VLOOKUP(F6,Meterverdier!A:B,2,FALSE)","v":2.4},"poeng/meter"]
[]
[null,null,null,null,null,null,null,"1. omgang",null,null,null,null,"2. omgang"]
[null,null,"Start-",null,null,"Hopp/",null,null,null,null,null,null,null,null,null,null,null,"Poeng"]
[null,"Plassering","nr.","Navn","Klubb","Komb","F.år","Lengde","A","B","C","Poeng","Lengde","A","B","C","Poeng","totalt"]
[null,{"$f":"IF(R12=\"\",\"\",RANK(R12,$R$12:$R$27,0)+COUNTIFS($R$12:R12,R12)-1)","v":1},null,null,null,null,null,null,null,null,null,{"$f":"IF(H12=\"\",0,60+$F$7*(H12-$F$6)+SUM(I12:K12))","v":0},null,null,null,null,{"$f":"IF(M12=\"\",\"\",60+$F$7*(M12-$F$6)+SUM(N12:P12))","v":""},{"$f":"IF(AND(ISNUMBER(L12),ISNUMBER(Q12)),L12+Q12,0)","v":0}]
[null,{"$f":"IF(R13=\"\",\"\",RANK(R13,$R$12:$R$27,0)+COUNTIFS($R$12:R13,R13)-1)","v":2},null,null,null,null,null,null,null,null,null,0,null,null,null,null,{"$f":"IF(M13=\"\",\"\",60+$F$7*(M13-$F$6)+SUM(N13:P13))","v":""},0]
[null,{"$f":"IF(R14=\"\",\"\",RANK(R14,$R$12:$R$27,0)+COUNTIFS($R$12:R14,R14)-1)","v":3},null,null,null,null,null,null,null,null,null,0,null,null,null,null,{"$f":"IF(M14=\"\",\"\",60+$F$7*(M14-$F$6)+SUM(N14:P14))","v":""},0]
[null,{"$f":"IF(R15=\"\",\"\",RANK(R15,$R$12:$R$27,0)+COUNTIFS($R$12:R15,R15)-1)","v":4},null,null,null,null,null,null,null,null,null,0,null,null,null,null,{"$f":"IF(M15=\"\",\"\",60+$F$7*(M15-$F$6)+SUM(N15:P15))","v":""},0]
[null,{"$f":"IF(R16=\"\",\"\",RANK(R16,$R$12:$R$27,0)+COUNTIFS($R$12:R16,R16)-1)","v":5},null,null,null,null,null,null,null,null,null,0,null,null,null,null,"",0]
[null,{"$f":"IF(R17=\"\",\"\",RANK(R17,$R$12:$R$27,0)+COUNTIFS($R$12:R17,R17)-1)","v":6},null,null,null,null,null,null,null,null,null,0,null,null,null,null,"",0]
[null,{"$f":"IF(R18=\"\",\"\",RANK(R18,$R$12:$R$27,0)+COUNTIFS($R$12:R18,R18)-1)","v":7},null,null,null,null,null,null,null,null,null,0,null,null,null,null,"",0]
[null,{"$f":"IF(R19=\"\",\"\",RANK(R19,$R$12:$R$27,0)+COUNTIFS($R$12:R19,R19)-1)","v":8},null,null,null,null,null,null,null,null,null,0,null,null,null,null,"",0]
[null,{"$f":"IF(R20=\"\",\"\",RANK(R20,$R$12:$R$27,0)+COUNTIFS($R$12:R20,R20)-1)","v":9},null,null,null,null,null,null,null,null,null,0,null,null,null,null,"",0]
[null,{"$f":"IF(R21=\"\",\"\",RANK(R21,$R$12:$R$27,0)+COUNTIFS($R$12:R21,R21)-1)","v":10},null,null,null,null,null,null,null,null,null,0,null,null,null,null,"",0]
[null,{"$f":"IF(R22=\"\",\"\",RANK(R22,$R$12:$R$27,0)+COUNTIFS($R$12:R22,R22)-1)","v":11},null,null,null,null,null,null,null,null,null,0,null,null,null,null,"",0]
[null,{"$f":"IF(R23=\"\",\"\",RANK(R23,$R$12:$R$27,0)+COUNTIFS($R$12:R23,R23)-1)","v":12},null,null,null,null,null,null,null,null,null,0,null,null,null,null,"",0]
[null,{"$f":"IF(R24=\"\",\"\",RANK(R24,$R$12:$R$27,0)+COUNTIFS($R$12:R24,R24)-1)","v":13},null,null,null,null,null,null,null,null,null,0,null,null,null,null,"",0]
[null,{"$f":"IF(R25=\"\",\"\",RANK(R25,$R$12:$R$27,0)+COUNTIFS($R$12:R25,R25)-1)","v":14},null,null,null,null,null,null,null,null,null,0,null,null,null,null,"",0]
[null,{"$f":"IF(R26=\"\",\"\",RANK(R26,$R$12:$R$27,0)+COUNTIFS($R$12:R26,R26)-1)","v":15},null,null,null,null,null,null,null,null,null,0,null,null,null,null,"",0]
[null,{"$f":"IF(R27=\"\",\"\",RANK(R27,$R$12:$R$27,0)+COUNTIFS($R$12:R27,R27)-1)","v":16},null,null,null,null,null,null,null,null,null,0,null,null,null,null,"",0]
[null,null,null,null,null,null,null,null,null,null,{"$f":"IF(G28=\"\",\"\",60+$F$7*(G28-$F$6)+SUM(H28:J28))","v":""},null,null,null,null,{"$f":"IF(L28=\"\",\"\",60+$F$7*(L28-$F$6)+SUM(M28:O28))","v":""},{"$f":"IF(AND(ISNUMBER(K28),ISNUMBER(P28)),K28+P28,\"\")","v":""}]
[]
[null,null,null,null,"Startliste kombinert - individuell kompakt"]
[]
[null,"Plass. Hopp\n 1. omg","Start nr.","Navn","Klubb","F.år","Poeng hopp","Start tid","Tid i mål\nMM:SS,T",null,null,"Plassering"]
[null,{"$f":"IF(COUNTIF($F$12:$F$27,\"Komb\")>0,1,\"\")","v":""},{"$f":"_xlfn._xlws.SORT(_xlfn.HSTACK(_xlfn._xlws.FILTER($C$12:$E$27,$F$12:$F$27=\"Komb\",$L$12:$L$27>0),_xlfn._xlws.FILTER($G$12:$G$27,$F$12:$F$27=\"Komb\",$L$12:$L$27>0),_xlfn._xlws.FILTER($L$12:$L$27,$F$12:$F$27=\"Komb\",$L$12:$L$27>0)),5,-1)","v":{"$error":"#VALUE!"}},null,null,null,null,{"$f":"TIME(0,0,0)","v":"00:00:00"},"00:01:11.300",null,null,{"$f":"IF(C33=\"\",\"\",RANK(I33,$I$33:$I$48,1)+COUNTIF($I$33:I33,I33)-1)","v":{"$error":"#VALUE!"}}]
[null,{"$f":"IFERROR(IF(B33+1>COUNTIF($F$12:$F$27,\"Komb\"),\"\",B33+1),\"\")","v":""},null,null,null,null,null,{"$f":"IF(B34=\"\",\"\",H33+TIME(0,0,6))","v":""},"00:01:10.100",null,null,{"$f":"IF(C34=\"\",\"\",RANK(I34,$I$33:$I$48,1)+COUNTIF($I$33:I34,I34)-1)","v":""}]
[null,{"$f":"IFERROR(IF(B34+1>COUNTIF($F$12:$F$27,\"Komb\"),\"\",B34+1),\"\")","v":""},null,null,null,null,null,{"$f":"IF(B35=\"\",\"\",H34+TIME(0,0,6))","v":""},"00:02:03.400",null,null,{"$f":"IF(C35=\"\",\"\",RANK(I35,$I$33:$I$48,1)+COUNTIF($I$33:I35,I35)-1)","v":""}]
[null,"",null,null,null,null,null,"",null,null,null,{"$f":"IF(C36=\"\",\"\",RANK(I36,$I$33:$I$48,1)+COUNTIF($I$33:I36,I36)-1)","v":""}]
[null,"",null,null,null,null,null,"",null,null,null,{"$f":"IF(C37=\"\",\"\",RANK(I37,$I$33:$I$48,1)+COUNTIF($I$33:I37,I37)-1)","v":""}]
[null,"",null,null,null,null,null,"",null,null,null,{"$f":"IF(C38=\"\",\"\",RANK(I38,$I$33:$I$48,1)+COUNTIF($I$33:I38,I38)-1)","v":""}]
[null,"",null,null,null,null,null,"",null,null,null,{"$f":"IF(C39=\"\",\"\",RANK(I39,$I$33:$I$48,1)+COUNTIF($I$33:I39,I39)-1)","v":""}]
[null,"",null,null,null,null,null,"",null,null,null,{"$f":"IF(C40=\"\",\"\",RANK(I40,$I$33:$I$48,1)+COUNTIF($I$33:I40,I40)-1)","v":""}]
[null,"",null,null,null,null,null,"",null,null,null,{"$f":"IF(C41=\"\",\"\",RANK(I41,$I$33:$I$48,1)+COUNTIF($I$33:I41,I41)-1)","v":""}]
[null,"",null,null,null,null,null,"",null,null,null,{"$f":"IF(C42=\"\",\"\",RANK(I42,$I$33:$I$48,1)+COUNTIF($I$33:I42,I42)-1)","v":""}]
[null,"",null,null,null,null,null,"",null,null,null,{"$f":"IF(C43=\"\",\"\",RANK(I43,$I$33:$I$48,1)+COUNTIF($I$33:I43,I43)-1)","v":""}]
[null,"",null,null,null,null,null,"",null,null,null,{"$f":"IF(C44=\"\",\"\",RANK(I44,$I$33:$I$48,1)+COUNTIF($I$33:I44,I44)-1)","v":""}]
[null,"",null,null,null,null,null,"",null,null,null,{"$f":"IF(C45=\"\",\"\",RANK(I45,$I$33:$I$48,1)+COUNTIF($I$33:I45,I45)-1)","v":""}]
[null,"",null,null,null,null,null,"",null,null,null,{"$f":"IF(C46=\"\",\"\",RANK(I46,$I$33:$I$48,1)+COUNTIF($I$33:I46,I46)-1)","v":""}]
[null,"",null,null,null,null,null,"",null,null,null,{"$f":"IF(C47=\"\",\"\",RANK(I47,$I$33:$I$48,1)+COUNTIF($I$33:I47,I47)-1)","v":""}]
[null,"",null,null,null,null,null,"",null,null,null,{"$f":"IF(C48=\"\",\"\",RANK(I48,$I$33:$I$48,1)+COUNTIF($I$33:I48,I48)-1)","v":""}]
[]
[]
[null,null,null,null,"Resultatliste kombinert - individuell kompakt"]
[]
[null,"Plass","Start nr.","Navn","Klubb","F.år","Lengde","A","B","C","Poeng\nHopp","Starttid\nlangrenn","Tid\nlangr",null,"Tid i mål"]
[null,{"$f":"IF(COUNT($I$33:$I$48)>0,1,\"\")","v":1},{"$f":"IF(B54=\"\",\"\",_xlfn.XLOOKUP($B54,$L$33:$L$48,$C$33:$C$48,\"\",0,1))","v":""},{"$f":"IF(C54=\"\",\"\",_xlfn.XLOOKUP($C54,$C$33:$C$48,D$33:D$48,\"\",0,1))","v":""},{"$f":"IF(D54=\"\",\"\",_xlfn.XLOOKUP($C54,$C$33:$C$48,E$33:E$48,\"\",0,1))","v":""},"",{"$f":"IF($C54=\"\",\"\",_xlfn.XLOOKUP($C54,$C$12:$C$27,H$12:H$27,\"\",0,1))","v":""},{"$f":"IF($C54=\"\",\"\",_xlfn.XLOOKUP($C54,$C$12:$C$27,I$12:I$27,\"\",0,1))","v":""},"","","",{"$f":"_xlfn.XLOOKUP(C54,$C$32:$C$48,$H$32:$H$48,\"\",0,1)","v":""},{"$f":"IF(C54=\"\",\"\",_xlfn.XLOOKUP(C54,$C$32:$C$48,$I$32:$I$48,\"\",0,1)-L54)","v":""},null,{"$f":"VLOOKUP(C54,C33:I48,7,FALSE)","v":{"$error":"#N/A"}}]
[null,{"$f":"IFERROR(IF(B54+1>COUNT($I$33:$I$48),\"\",B54+1),\"\")","v":2},{"$f":"IF(B55=\"\",\"\",_xlfn.XLOOKUP($B55,$L$33:$L$48,$C$33:$C$48,\"\",0,1))","v":""},"","","",{"$f":"IF($C55=\"\",\"\",_xlfn.XLOOKUP($C55,$C$12:$C$27,H$12:H$27,\"\",0,1))","v":""},"","","","",{"$f":"_xlfn.XLOOKUP(C55,$C$32:$C$48,$H$32:$H$48,\"\",0,1)","v":""},{"$f":"IF(C55=\"\",\"\",_xlfn.XLOOKUP(C55,$C$32:$C$48,$I$32:$I$48,\"\",0,1)-L55)","v":""},{"$f":"IF(C55=\"\",\"\",\"+\")","v":""},{"$f":"IF(C55=\"\",\"\",VLOOKUP($C55,$C$33:$I$48,7,0)-VLOOKUP($C$54,$C$33:$I$48,7,0))","v":""}]
[null,{"$f":"IFERROR(IF(B55+1>COUNT($I$33:$I$48),\"\",B55+1),\"\")","v":3},"","","","","","","","","","","","",{"$f":"IF(C56=\"\",\"\",VLOOKUP($C56,$C$33:$I$48,7,0)-VLOOKUP($C$54,$C$33:$I$48,7,0))","v":""}]
[null,"","","","","","","","","","","","","",""]
[null,"","","","","","","","","","","","","",""]
[null,"","","","","","","","","","","","","",""]
[null,"","","","","","","","","","","","","",""]
[null,"","","","","","","","","","","","","",""]
[null,"","","","","","","","","","","","","",""]
[null,"","","","","","","","","","","","","",""]
[null,"","","","","","","","","","","","","",""]
[null,"","","","","","","","","","","","","",""]
[null,"","","","","","","","","","","","","",""]
[null,"","","","","","","","","","","","","",""]
[null,"","","","","","","","","","","","","",""]
[null,"","","","","","","","","","","","","",""]

{"sheet":"K65 RCB J","index":18,"n_rows":69,"n_cols":18,"rows_kept":69,"cut":false,"hidden":true,"merged":[[8,7,8,11],[8,12,8,16]]}
[]
[null,null,null,null,"Granåsenrennet - SMN 1 Trøndercup i hopp og kombinert 11.02.2024"]
[]
[]
[null,null,null,null,{"$f":"\"K\"&F6","v":"K65"},null,"RCB Jenter"]
[null,null,null,null,"K-punkt:",65,"meter"]
[null,null,null,null,"Meterverdi:",{"$f":"VLOOKUP(F6,Meterverdier!A:B,2,FALSE)","v":2.4},"poeng/meter"]
[]
[null,null,null,null,null,null,null,"1. omgang",null,null,null,null,"2. omgang"]
[null,null,"Start-",null,null,"Hopp/",null,null,null,null,null,null,null,null,null,null,null,"Poeng"]
[null,"Plassering","nr.","Navn","Klubb","Komb","F.år","Lengde","A","B","C","Poeng","Lengde","A","B","C","Poeng","totalt"]
[null,{"$f":"IF(R12=\"\",\"\",RANK(R12,$R$12:$R$27,0)+COUNTIFS($R$12:R12,R12)-1)","v":1},null,null,null,null,null,null,null,null,null,{"$f":"IF(H12=\"\",0,60+$F$7*(H12-$F$6)+SUM(I12:K12))","v":0},null,null,null,null,{"$f":"IF(M12=\"\",\"\",60+$F$7*(M12-$F$6)+SUM(N12:P12))","v":""},{"$f":"IF(AND(ISNUMBER(L12),ISNUMBER(Q12)),L12+Q12,0)","v":0}]
[null,{"$f":"IF(R13=\"\",\"\",RANK(R13,$R$12:$R$27,0)+COUNTIFS($R$12:R13,R13)-1)","v":2},null,null,null,null,null,null,null,null,null,0,null,null,null,null,{"$f":"IF(M13=\"\",\"\",60+$F$7*(M13-$F$6)+SUM(N13:P13))","v":""},0]
[null,{"$f":"IF(R14=\"\",\"\",RANK(R14,$R$12:$R$27,0)+COUNTIFS($R$12:R14,R14)-1)","v":3},null,null,null,null,null,null,null,null,null,0,null,null,null,null,{"$f":"IF(M14=\"\",\"\",60+$F$7*(M14-$F$6)+SUM(N14:P14))","v":""},0]
[null,{"$f":"IF(R15=\"\",\"\",RANK(R15,$R$12:$R$27,0)+COUNTIFS($R$12:R15,R15)-1)","v":4},null,null,null,null,null,null,null,null,null,0,null,null,null,null,{"$f":"IF(M15=\"\",\"\",60+$F$7*(M15-$F$6)+SUM(N15:P15))","v":""},0]
[null,{"$f":"IF(R16=\"\",\"\",RANK(R16,$R$12:$R$27,0)+COUNTIFS($R$12:R16,R16)-1)","v":5},null,null,null,null,null,null,null,null,null,0,null,null,null,null,{"$f":"IF(M16=\"\",\"\",60+$F$7*(M16-$F$6)+SUM(N16:P16))","v":""},0]
[null,{"$f":"IF(R17=\"\",\"\",RANK(R17,$R$12:$R$27,0)+COUNTIFS($R$12:R17,R17)-1)","v":6},null,null,null,null,null,null,null,null,null,0,null,null,null,null,{"$f":"IF(M17=\"\",\"\",60+$F$7*(M17-$F$6)+SUM(N17:P17))","v":""},0]
[null,{"$f":"IF(R18=\"\",\"\",RANK(R18,$R$12:$R$27,0)+COUNTIFS($R$12:R18,R18)-1)","v":7},null,null,null,null,null,null,null,null,null,0,null,null,null,null,"",0]
[null,{"$f":"IF(R19=\"\",\"\",RANK(R19,$R$12:$R$27,0)+COUNTIFS($R$12:R19,R19)-1)","v":8},null,null,null,null,null,null,null,null,null,0,null,null,null,null,"",0]
[null,{"$f":"IF(R20=\"\",\"\",RANK(R20,$R$12:$R$27,0)+COUNTIFS($R$12:R20,R20)-1)","v":9},null,null,null,null,null,null,null,null,null,0,null,null,null,null,"",0]
[null,{"$f":"IF(R21=\"\",\"\",RANK(R21,$R$12:$R$27,0)+COUNTIFS($R$12:R21,R21)-1)","v":10},null,null,null,null,null,null,null,null,null,0,null,null,null,null,"",0]
[null,{"$f":"IF(R22=\"\",\"\",RANK(R22,$R$12:$R$27,0)+COUNTIFS($R$12:R22,R22)-1)","v":11},null,null,null,null,null,null,null,null,null,0,null,null,null,null,"",0]
[null,{"$f":"IF(R23=\"\",\"\",RANK(R23,$R$12:$R$27,0)+COUNTIFS($R$12:R23,R23)-1)","v":12},null,null,null,null,null,null,null,null,null,0,null,null,null,null,"",0]
[null,{"$f":"IF(R24=\"\",\"\",RANK(R24,$R$12:$R$27,0)+COUNTIFS($R$12:R24,R24)-1)","v":13},null,null,null,null,null,null,null,null,null,0,null,null,null,null,"",0]
[null,{"$f":"IF(R25=\"\",\"\",RANK(R25,$R$12:$R$27,0)+COUNTIFS($R$12:R25,R25)-1)","v":14},null,null,null,null,null,null,null,null,null,0,null,null,null,null,"",0]
[null,{"$f":"IF(R26=\"\",\"\",RANK(R26,$R$12:$R$27,0)+COUNTIFS($R$12:R26,R26)-1)","v":15},null,null,null,null,null,null,null,null,null,0,null,null,null,null,"",0]
[null,{"$f":"IF(R27=\"\",\"\",RANK(R27,$R$12:$R$27,0)+COUNTIFS($R$12:R27,R27)-1)","v":16},null,null,null,null,null,null,null,null,null,0,null,null,null,null,"",0]
[null,null,null,null,null,null,null,null,null,null,{"$f":"IF(G28=\"\",\"\",60+$F$7*(G28-$F$6)+SUM(H28:J28))","v":""},null,null,null,null,{"$f":"IF(L28=\"\",\"\",60+$F$7*(L28-$F$6)+SUM(M28:O28))","v":""},{"$f":"IF(AND(ISNUMBER(K28),ISNUMBER(P28)),K28+P28,\"\")","v":""}]
[]
[null,null,null,null,"Startliste kombinert - individuell kompakt"]
[]
[null,"Plass. Hopp\n 1. omg","Start nr.","Navn","Klubb","F.år","Poeng hopp","Start tid","Tid i mål\nMM:SS,T",null,null,"Plassering"]
[null,{"$f":"IF(COUNTIF($F$12:$F$27,\"Komb\")>0,1,\"\")","v":""},{"$f":"_xlfn._xlws.SORT(_xlfn.HSTACK(_xlfn._xlws.FILTER($C$12:$E$27,$F$12:$F$27=\"Komb\",$L$12:$L$27>0),_xlfn._xlws.FILTER($G$12:$G$27,$F$12:$F$27=\"Komb\",$L$12:$L$27>0),_xlfn._xlws.FILTER($L$12:$L$27,$F$12:$F$27=\"Komb\",$L$12:$L$27>0)),5,-1)","v":{"$error":"#VALUE!"}},null,null,null,null,{"$f":"TIME(0,0,0)","v":"00:00:00"},"00:01:11.300",null,null,{"$f":"IF(C33=\"\",\"\",RANK(I33,$I$33:$I$48,1)+COUNTIF($I$33:I33,I33)-1)","v":{"$error":"#VALUE!"}}]
[null,{"$f":"IFERROR(IF(B33+1>COUNTIF($F$12:$F$27,\"Komb\"),\"\",B33+1),\"\")","v":""},null,null,null,null,null,{"$f":"IF(B34=\"\",\"\",H33+TIME(0,0,6))","v":""},"00:01:10.100",null,null,{"$f":"IF(C34=\"\",\"\",RANK(I34,$I$33:$I$48,1)+COUNTIF($I$33:I34,I34)-1)","v":""}]
[null,{"$f":"IFERROR(IF(B34+1>COUNTIF($F$12:$F$27,\"Komb\"),\"\",B34+1),\"\")","v":""},null,null,null,null,null,{"$f":"IF(B35=\"\",\"\",H34+TIME(0,0,6))","v":""},"00:02:03.400",null,null,{"$f":"IF(C35=\"\",\"\",RANK(I35,$I$33:$I$48,1)+COUNTIF($I$33:I35,I35)-1)","v":""}]
[null,"",null,null,null,null,null,"","00:01:23.400",null,null,{"$f":"IF(C36=\"\",\"\",RANK(I36,$I$33:$I$48,1)+COUNTIF($I$33:I36,I36)-1)","v":""}]
[null,"",null,null,null,null,null,"","00:02:12.900",null,null,{"$f":"IF(C37=\"\",\"\",RANK(I37,$I$33:$I$48,1)+COUNTIF($I$33:I37,I37)-1)","v":""}]
[null,"",null,null,null,null,null,"",null,null,null,{"$f":"IF(C38=\"\",\"\",RANK(I38,$I$33:$I$48,1)+COUNTIF($I$33:I38,I38)-1)","v":""}]
[null,"",null,null,null,null,null,"",null,null,null,{"$f":"IF(C39=\"\",\"\",RANK(I39,$I$33:$I$48,1)+COUNTIF($I$33:I39,I39)-1)","v":""}]
[null,"",null,null,null,null,null,"",null,null,null,{"$f":"IF(C40=\"\",\"\",RANK(I40,$I$33:$I$48,1)+COUNTIF($I$33:I40,I40)-1)","v":""}]
[null,"",null,null,null,null,null,"",null,null,null,{"$f":"IF(C41=\"\",\"\",RANK(I41,$I$33:$I$48,1)+COUNTIF($I$33:I41,I41)-1)","v":""}]
[null,"",null,null,null,null,null,"",null,null,null,{"$f":"IF(C42=\"\",\"\",RANK(I42,$I$33:$I$48,1)+COUNTIF($I$33:I42,I42)-1)","v":""}]
[null,"",null,null,null,null,null,"",null,null,null,{"$f":"IF(C43=\"\",\"\",RANK(I43,$I$33:$I$48,1)+COUNTIF($I$33:I43,I43)-1)","v":""}]
[null,"",null,null,null,null,null,"",null,null,null,{"$f":"IF(C44=\"\",\"\",RANK(I44,$I$33:$I$48,1)+COUNTIF($I$33:I44,I44)-1)","v":""}]
[null,"",null,null,null,null,null,"",null,null,null,{"$f":"IF(C45=\"\",\"\",RANK(I45,$I$33:$I$48,1)+COUNTIF($I$33:I45,I45)-1)","v":""}]
[null,"",null,null,null,null,null,"",null,null,null,{"$f":"IF(C46=\"\",\"\",RANK(I46,$I$33:$I$48,1)+COUNTIF($I$33:I46,I46)-1)","v":""}]
[null,"",null,null,null,null,null,"",null,null,null,{"$f":"IF(C47=\"\",\"\",RANK(I47,$I$33:$I$48,1)+COUNTIF($I$33:I47,I47)-1)","v":""}]
[null,"",null,null,null,null,null,"",null,null,null,{"$f":"IF(C48=\"\",\"\",RANK(I48,$I$33:$I$48,1)+COUNTIF($I$33:I48,I48)-1)","v":""}]
[]
[]
[null,null,null,null,"Resultatliste kombinert - individuell kompakt"]
[]
[null,"Plass","Start nr.","Navn","Klubb","F.år","Lengde","A","B","C","Poeng\nHopp","Starttid\nlangrenn","Tid\nlangr",null,"Tid i mål"]
[null,{"$f":"IF(COUNT($I$33:$I$48)>0,1,\"\")","v":1},{"$f":"IF(B54=\"\",\"\",_xlfn.XLOOKUP($B54,$L$33:$L$48,$C$33:$C$48,\"\",0,1))","v":""},{"$f":"IF(C54=\"\",\"\",_xlfn.XLOOKUP($C54,$C$33:$C$48,D$33:D$48,\"\",0,1))","v":""},{"$f":"IF(D54=\"\",\"\",_xlfn.XLOOKUP($C54,$C$33:$C$48,E$33:E$48,\"\",0,1))","v":""},"",{"$f":"IF($C54=\"\",\"\",_xlfn.XLOOKUP($C54,$C$12:$C$27,H$12:H$27,\"\",0,1))","v":""},{"$f":"IF($C54=\"\",\"\",_xlfn.XLOOKUP($C54,$C$12:$C$27,I$12:I$27,\"\",0,1))","v":""},"","","",{"$f":"_xlfn.XLOOKUP(C54,$C$32:$C$48,$H$32:$H$48,\"\",0,1)","v":""},{"$f":"IF(C54=\"\",\"\",_xlfn.XLOOKUP(C54,$C$32:$C$48,$I$32:$I$48,\"\",0,1)-L54)","v":""},null,{"$f":"VLOOKUP(C54,C33:I48,7,FALSE)","v":{"$error":"#N/A"}}]
[null,{"$f":"IFERROR(IF(B54+1>COUNT($I$33:$I$48),\"\",B54+1),\"\")","v":2},{"$f":"IF(B55=\"\",\"\",_xlfn.XLOOKUP($B55,$L$33:$L$48,$C$33:$C$48,\"\",0,1))","v":""},"","","",{"$f":"IF($C55=\"\",\"\",_xlfn.XLOOKUP($C55,$C$12:$C$27,H$12:H$27,\"\",0,1))","v":""},"","","","",{"$f":"_xlfn.XLOOKUP(C55,$C$32:$C$48,$H$32:$H$48,\"\",0,1)","v":""},{"$f":"IF(C55=\"\",\"\",_xlfn.XLOOKUP(C55,$C$32:$C$48,$I$32:$I$48,\"\",0,1)-L55)","v":""},{"$f":"IF(C55=\"\",\"\",\"+\")","v":""},{"$f":"IF(C55=\"\",\"\",VLOOKUP($C55,$C$33:$I$48,7,0)-VLOOKUP($C$54,$C$33:$I$48,7,0))","v":""}]
[null,{"$f":"IFERROR(IF(B55+1>COUNT($I$33:$I$48),\"\",B55+1),\"\")","v":3},"","","","","","","","","","","","",{"$f":"IF(C56=\"\",\"\",VLOOKUP($C56,$C$33:$I$48,7,0)-VLOOKUP($C$54,$C$33:$I$48,7,0))","v":""}]
[null,4,"","","","","","","","","","","","",""]
[null,5,"","","","","","","","","","","","",""]
[null,"","","","","","","","","","","","","",""]
[null,"","","","","","","","","","","","","",""]
[null,"","","","","","","","","","","","","",""]
[null,"","","","","","","","","","","","","",""]
[null,"","","","","","","","","","","","","",""]
[null,"","","","","","","","","","","","","",""]
[null,"","","","","","","","","","","","","",""]
[null,"","","","","","","","","","","","","",""]
[null,"","","","","","","","","","","","","",""]
[null,"","","","","","","","","","","","","",""]
[null,"","","","","","","","","","","","","",""]

{"sheet":"Meterverdier","index":19,"n_rows":231,"n_cols":2,"rows_kept":231,"cut":false,"hidden":true,"merged":[]}
["Bakkestørrelse"]
[1,{"$f":"IF(A2<20,5.2,IF(A2<25,4.8,IF(A2<30,4.4,IF(A2<35,4,IF(A2<40,3.6,IF(A2<50,3.2,IF(A2<50,3.2,IF(A2<60,2.8,IF(A2<70,2.4,IF(A2<80,2.2,IF(A2<100,2,IF(A2<170,1.8,1.2))))))))))))","v":5.2}]
[2,{"$f":"IF(A3<20,5.2,IF(A3<25,4.8,IF(A3<30,4.4,IF(A3<35,4,IF(A3<40,3.6,IF(A3<50,3.2,IF(A3<50,3.2,IF(A3<60,2.8,IF(A3<70,2.4,IF(A3<80,2.2,IF(A3<100,2,IF(A3<170,1.8,1.2))))))))))))","v":5.2}]
[3,5.2]
[4,5.2]
[5,5.2]
[6,5.2]
[7,5.2]
[8,5.2]
[9,5.2]
[10,5.2]
[11,5.2]
[12,5.2]
[13,5.2]
[14,5.2]
[15,5.2]
[16,5.2]
[17,5.2]
[18,5.2]
[19,5.2]
[20,4.8]
[21,4.8]
[22,4.8]
[23,4.8]
[24,4.8]
[25,4.4000000000000004]
[26,4.4000000000000004]
[27,4.4000000000000004]
[28,4.4000000000000004]
[29,4.4000000000000004]
[30,4]
[31,4]
[32,4]
[33,4]
[34,4]
[35,3.6]
[36,3.6]
[37,3.6]
[38,3.6]
[39,3.6]
[40,3.2]
[41,3.2]
[42,3.2]
[43,3.2]
[44,3.2]
[45,3.2]
[46,3.2]
[47,3.2]
[48,3.2]
[49,3.2]
[50,2.8]
[51,2.8]
[52,2.8]
[53,2.8]
[54,2.8]
[55,2.8]
[56,2.8]
[57,2.8]
[58,2.8]
[59,2.8]
[60,2.4]
[61,2.4]
[62,2.4]
[63,2.4]
[64,2.4]
[65,2.4]
[66,{"$f":"IF(A67<20,5.2,IF(A67<25,4.8,IF(A67<30,4.4,IF(A67<35,4,IF(A67<40,3.6,IF(A67<50,3.2,IF(A67<50,3.2,IF(A67<60,2.8,IF(A67<70,2.4,IF(A67<80,2.2,IF(A67<100,2,IF(A67<170,1.8,1.2))))))))))))","v":2.4}]
[67,2.4]
[68,2.4]
[69,2.4]
[70,2.2000000000000002]
[71,2.2000000000000002]
[72,2.2000000000000002]
[73,2.2000000000000002]
[74,2.2000000000000002]
[75,2.2000000000000002]
[76,2.2000000000000002]
[77,2.2000000000000002]
[78,2.2000000000000002]
[79,2.2000000000000002]
[80,2]
[81,2]
[82,2]
[83,2]
[84,2]
[85,2]
[86,2]
[87,2]
[88,2]
[89,2]
[90,2]
[91,2]
[92,2]
[93,2]
[94,2]
[95,2]
[96,2]
[97,2]
[98,2]
[99,2]
[100,1.8]
[101,1.8]
[102,1.8]
[103,1.8]
[104,1.8]
[105,1.8]
[106,1.8]
[107,1.8]
[108,1.8]
[109,1.8]
[110,1.8]
[111,1.8]
[112,1.8]
[113,1.8]
[114,1.8]
[115,1.8]
[116,1.8]
[117,1.8]
[118,1.8]
[119,1.8]
[120,1.8]
[121,1.8]
[122,1.8]
[123,1.8]
[124,1.8]
[125,1.8]
[126,1.8]
[127,1.8]
[128,1.8]
[129,1.8]
[130,{"$f":"IF(A131<20,5.2,IF(A131<25,4.8,IF(A131<30,4.4,IF(A131<35,4,IF(A131<40,3.6,IF(A131<50,3.2,IF(A131<50,3.2,IF(A131<60,2.8,IF(A131<70,2.4,IF(A131<80,2.2,IF(A131<100,2,IF(A131<170,1.8,1.2))))))))))))","v":1.8}]
[131,1.8]
[132,1.8]
[133,1.8]
[134,1.8]
[135,1.8]
[136,1.8]
[137,1.8]
[138,1.8]
[139,1.8]
[140,1.8]
[141,1.8]
[142,1.8]
[143,1.8]
[144,1.8]
[145,1.8]
[146,1.8]
[147,1.8]
[148,1.8]
[149,1.8]
[150,1.8]
[151,1.8]
[152,1.8]
[153,1.8]
[154,1.8]
[155,1.8]
[156,1.8]
[157,1.8]
[158,1.8]
[159,1.8]
[160,1.8]
[161,1.8]
[162,1.8]
[163,1.8]
[164,1.8]
[165,1.8]
[166,1.8]
[167,1.8]
[168,1.8]
[169,1.8]
[170,1.2]
[171,1.2]
[172,1.2]
[173,1.2]
[174,1.2]
[175,1.2]
[176,1.2]
[177,1.2]
[178,1.2]
[179,1.2]
[180,1.2]
[181,1.2]
[182,1.2]
[183,1.2]
[184,1.2]
[185,1.2]
[186,1.2]
[187,1.2]
[188,1.2]
[189,1.2]
[190,1.2]
[191,1.2]
[192,1.2]
[193,1.2]
[194,{"$f":"IF(A195<20,5.2,IF(A195<25,4.8,IF(A195<30,4.4,IF(A195<35,4,IF(A195<40,3.6,IF(A195<50,3.2,IF(A195<50,3.2,IF(A195<60,2.8,IF(A195<70,2.4,IF(A195<80,2.2,IF(A195<100,2,IF(A195<170,1.8,1.2))))))))))))","v":1.2}]
[195,1.2]
[196,1.2]
[197,1.2]
[198,1.2]
[199,1.2]
[200,1.2]
[201,1.2]
[202,1.2]
[203,1.2]
[204,1.2]
[205,1.2]
[206,1.2]
[207,1.2]
[208,1.2]
[209,1.2]
[210,1.2]
[211,1.2]
[212,1.2]
[213,1.2]
[214,1.2]
[215,1.2]
[216,1.2]
[217,1.2]
[218,1.2]
[219,1.2]
[220,1.2]
[221,1.2]
[222,1.2]
[223,1.2]
[224,1.2]
[225,1.2]
[226,1.2]
[227,1.2]
[228,1.2]
[229,1.2]
[230,1.2]