{"text_format":"1","workbook":"xlsx","n_sheets":20,"sheets":["K2","K5-K8","K 10","K15","K25 G","K25 J","K45 G","K45 J","K40 RCB G","K40 RCB J","K65 G","K65 J","Ledig (2)","Ledig (3)","Ledig (4)","Ledig (5)","Ledig (6)","K65 RCB G","K65 RCB J","Meterverdier"],"not_rendered":{"charts":0,"images":4,"macros":1,"external_links":0,"defined_names":38,"comments":0,"pivot_tables":0},"unopened":[],"bounds":{"document_bytes":16777216,"sheet_cells":100000,"rows_first":2000,"rows_last":500,"rows_between":2000,"halvings":0,"cell_chars":16384,"cell_head_chars":4096},"cells_cut":0,"cells_raw":0,"read":"whole","date_system":"1900"}

{"sheet":"K2","index":0,"n_rows":69,"n_cols":18,"rows_kept":69,"cut":false,"hidden":false,"merged":[[8,7,8,11],[8,12,8,16]]}
[]
[null,null,null,null,"Namsosrennet i hopp og kombinert 01.02.2026"]
[]
[]
[null,null,null,null,{"$f":"\"K\"&F6","v":"K2"},null,"Åpen klasse"]
[null,null,null,null,"K-punkt:",2,"meter"]
[null,null,null,null,"Meterverdi:",{"$f":"VLOOKUP(F6,Meterverdier!A:B,2,FALSE)","v":5.2},"poeng/meter"]
[]
[null,null,null,null,null,null,null,"1. omgang",null,null,null,null,"2. omgang"]
[null,null,"Start-",null,null,"Hopp/",null,null,null,null,null,null,null,null,null,null,null,"Poeng"]
{"$rows_left_out":60}
{"sheet":"K5-K8","index":1,"n_rows":72,"n_cols":18,"rows_kept":72,"cut":false,"hidden":false,"merged":[[8,7,8,11],[8,12,8,16]]}
[]
[null,null,null,null,{"$f":"+'K2'!E2","v":"Namsosrennet i hopp og kombinert 01.02.2026"}]
[]
[]
[null,null,null,null,{"$f":"\"K\"&F6","v":"K8"},null,"Åpen klasse"]
[null,null,null,null,"K-punkt:",8,"meter"]
[null,null,null,null,"Meterverdi:",{"$f":"VLOOKUP(F6,Meterverdier!A:B,2,FALSE)","v":5.2},"poeng/meter"]
[]
[null,null,null,null,null,null,null,"1. omgang",null,null,null,null,"2. omgang"]
[null,null,"Start-",null,null,"Hopp/",null,null,null,null,null,null,null,null,null,null,null,"Poeng"]
{"$rows_left_out":63}
{"sheet":"K 10","index":2,"n_rows":68,"n_cols":18,"rows_kept":68,"cut":false,"hidden":false,"merged":[[8,7,8,11],[8,12,8,16]]}
[]
[null,null,null,null,{"$f":"+'K2'!E2","v":"Namsosrennet i hopp og kombinert 01.02.2026"}]
[]
[]
[null,null,null,null,{"$f":"\"K\"&F6","v":"K10"},null,"Åpen klasse"]
[null,null,null,null,"K-punkt:",10,"meter"]
[null,null,null,null,"Meterverdi:",5.2,"poeng/meter"]
[]
[null,null,null,null,null,null,null,"1. omgang",null,null,null,null,"2. omgang"]
[null,null,"Start-",null,null,"Hopp/",null,null,null,null,null,null,null,null,null,null,null,"Poeng"]
{"$rows_left_out":59}
{"sheet":"K15","index":3,"n_rows":68,"n_cols":18,"rows_kept":68,"cut":false,"hidden":false,"merged":[[8,7,8,11],[8,12,8,16]]}
[]
[null,null,null,null,{"$f":"+'K2'!E2","v":"Namsosrennet i hopp og kombinert 01.02.2026"}]
[]
[]
[null,null,null,null,{"$f":"\"K\"&F6","v":"K15"},null,"Åpen klasse"]
[null,null,null,null,"K-punkt:",15,"meter"]
[null,null,null,null,"Meterverdi:",{"$f":"VLOOKUP(F6,Meterverdier!A:B,2,FALSE)","v":5.2},"poeng/meter"]
[]
[null,null,null,null,null,null,null,"1. omgang",null,null,null,null,"2. omgang"]
[null,null,"Start-",null,null,"Hopp/",null,null,null,null,null,null,null,null,null,null,null,"Poeng"]
{"$rows_left_out":59}
{"sheet":"K25 G","index":4,"n_rows":69,"n_cols":18,"rows_kept":69,"cut":false,"hidden":false,"merged":[[8,7,8,11],[8,12,8,16]]}
[]
[null,null,null,null,{"$f":"+'K2'!E2","v":"Namsosrennet i hopp og kombinert 01.02.2026"}]
[]
[]
[null,null,null,null,{"$f":"\"K\"&F6","v":"K25"},null,"Gutter"]
[null,null,null,null,"K-punkt:",25,"meter"]
[null,null,null,null,"Meterverdi:",{"$f":"VLOOKUP(F6,Meterverdier!A:B,2,FALSE)","v":4.4000000000000004},"poeng/meter"]
[]
[null,null,null,null,null,null,null,"1. omgang",null,null,null,null,"2. omgang"]
[null,null,"Start-",null,null,"Hopp/",null,null,null,null,null,null,null,null,null,null,null,"Poeng"]
{"$rows_left_out":60}
{"sheet":"K25 J","index":5,"n_rows":69,"n_cols":18,"rows_kept":69,"cut":false,"hidden":false,"merged":[[8,7,8,11],[8,12,8,16]]}
[]
[null,null,null,null,{"$f":"+'K2'!E2","v":"Namsosrennet i hopp og kombinert 01.02.2026"}]
[]
[]
[null,null,null,null,{"$f":"\"K\"&F6","v":"K25"},null,"Jenter"]
[null,null,null,null,"K-punkt:",25,"meter"]
[null,null,null,null,"Meterverdi:",{"$f":"VLOOKUP(F6,Meterverdier!A:B,2,FALSE)","v":4.4000000000000004},"poeng/meter"]
[]
[null,null,null,null,null,null,null,"1. omgang",null,null,null,null,"2. omgang"]
[null,null,"Start-",null,null,"Hopp/",null,null,null,null,null,null,null,null,null,null,null,"Poeng"]
{"$rows_left_out":60}
{"sheet":"K45 G","index":6,"n_rows":68,"n_cols":18,"rows_kept":68,"cut":false,"hidden":false,"merged":[[8,7,8,11],[8,12,8,16]]}
[]
[null,null,null,null,{"$f":"+'K2'!E2","v":"Namsosrennet i hopp og kombinert 01.02.2026"}]
[]
[]
[null,null,null,null,{"$f":"\"K\"&F6","v":"K45"},null,"Gutter"]
[null,null,null,null,"K-punkt:",45,"meter"]
[null,null,null,null,"Meterverdi:",{"$f":"VLOOKUP(F6,Meterverdier!A:B,2,FALSE)","v":3.2},"poeng/meter"]
[]
[null,null,null,null,null,null,null,"1. omgang",null,null,null,null,"2. omgang"]
[null,null,"Start-",null,null,"Hopp/",null,null,null,null,null,null,null,null,null,null,null,"Poeng"]
{"$rows_left_out":59}
{"sheet":"K45 J","index":7,"n_rows":65,"n_cols":18,"rows_kept":65,"cut":false,"hidden":false,"merged":[[8,7,8,11],[8,12,8,16]]}
[]
[null,null,null,null,{"$f":"+'K2'!E2","v":"Namsosrennet i hopp og kombinert 01.02.2026"}]
[]
[]
[null,null,null,null,{"$f":"\"K\"&F6","v":"K45"},null,"Jenter"]
[null,null,null,null,"K-punkt:",45,"meter"]
[null,null,null,null,"Meterverdi:",{"$f":"VLOOKUP(F6,Meterverdier!A:B,2,FALSE)","v":3.2},"poeng/meter"]
[]
[null,null,null,null,null,null,null,"1. omgang",null,null,null,null,"2. omgang"]
[null,null,"Start-",null,null,"Hopp/",null,null,null,null,null,null,null,null,null,null,null,"Poeng"]
{"$rows_left_out":56}
{"sheet":"K40 RCB G","index":8,"n_rows":69,"n_cols":18,"rows_kept":69,"cut":false,"hidden":true,"merged":[[8,7,8,11],[8,12,8,16]]}
[]
[null,null,null,null,"Granåsenrennet - SMN 1 Trøndercup i hopp og kombinert 11.02.2024"]
[]
[]
[null,null,null,null,{"$f":"\"K\"&F6","v":"K40"},null,"RCB Gutter"]
[null,null,null,null,"K-punkt:",40,"meter"]
[null,null,null,null,"Meterverdi:",{"$f":"VLOOKUP(F6,Meterverdier!A:B,2,FALSE)","v":3.2},"poeng/meter"]
[]
[null,null,null,null,null,null,null,"1. omgang",null,null,null,null,"2. omgang"]
[null,null,"Start-",null,null,"Hopp/",null,null,null,null,null,null,null,null,null,null,null,"Poeng"]
{"$rows_left_out":60}
{"sheet":"K40 RCB J","index":9,"n_rows":69,"n_cols":18,"rows_kept":69,"cut":false,"hidden":true,"merged":[[8,7,8,11],[8,12,8,16]]}
[]
[null,null,null,null,"Granåsenrennet - SMN 1 Trøndercup i hopp og kombinert 11.02.2024"]
[]
[]
[null,null,null,null,{"$f":"\"K\"&F6","v":"K40"},null,"RCB Jenter"]
[null,null,null,null,"K-punkt:",40,"meter"]
[null,null,null,null,"Meterverdi:",{"$f":"VLOOKUP(F6,Meterverdier!A:B,2,FALSE)","v":3.2},"poeng/meter"]
[]
[null,null,null,null,null,null,null,"1. omgang",null,null,null,null,"2. omgang"]
[null,null,"Start-",null,null,"Hopp/",null,null,null,null,null,null,null,null,null,null,null,"Poeng"]
{"$rows_left_out":60}
{"sheet":"K65 G","index":10,"n_rows":70,"n_cols":20,"rows_kept":70,"cut":false,"hidden":false,"merged":[[8,7,8,11],[8,12,8,16]]}
[]
[null,null,null,null,{"$f":"+'K2'!E2","v":"Namsosrennet i hopp og kombinert 01.02.2026"}]
[]
[]
[null,null,null,null,{"$f":"\"K\"&F6","v":"K65"},null,"RCA Gutter"]
[null,null,null,null,"K-punkt:",65,"meter"]
[null,null,null,null,"Meterverdi:",{"$f":"VLOOKUP(F6,Meterverdier!A:B,2,FALSE)","v":2.4},"poeng/meter"]
[]
[null,null,null,null,null,null,null,"1. omgang",null,null,null,null,"2. omgang"]
[null,null,"Start-",null,null,"Hopp/",null,null,null,null,null,null,null,null,null,null,null,"Poeng"]
{"$rows_left_out":61}
{"sheet":"K65 J","index":11,"n_rows":69,"n_cols":18,"rows_kept":69,"cut":false,"hidden":false,"merged":[[8,7,8,11],[8,12,8,16]]}
[]
[null,null,null,null,{"$f":"+'K2'!E2","v":"Namsosrennet i hopp og kombinert 01.02.2026"}]
[]
[]
[null,null,null,null,{"$f":"\"K\"&F6","v":"K65"},null,"RCA Jenter"]
[null,null,null,null,"K-punkt:",65,"meter"]
[null,null,null,null,"Meterverdi:",{"$f":"VLOOKUP(F6,Meterverdier!A:B,2,FALSE)","v":2.4},"poeng/meter"]
[]
[null,null,null,null,null,null,null,"1. omgang",null,null,null,null,"2. omgang"]
[null,null,"Start-",null,null,"Hopp/",null,null,null,null,null,null,null,null,null,null,null,"Poeng"]
{"$rows_left_out":60}
{"sheet":"Ledig (2)","index":12,"n_rows":70,"n_cols":18,"rows_kept":70,"cut":false,"hidden":false,"merged":[[8,7,8,11],[8,12,8,16]]}
[]
[null,null,null,null,{"$f":"+'K2'!E2","v":"Namsosrennet i hopp og kombinert 01.02.2026"}]
[]
[]
[null,null,null,null,{"$f":"\"K\"&F6","v":"K45"},null,"Steinkjerrennet 31.01.2026"]
[null,null,null,null,"K-punkt:",45,"meter"]
[null,null,null,null,"Meterverdi:",{"$f":"VLOOKUP(F6,Meterverdier!A:B,2,FALSE)","v":3.2},"poeng/meter"]
[]
[null,null,null,null,null,null,null,"1. omgang",null,null,null,null,"2. omgang"]
[null,null,"Start-",null,null,"Hopp/",null,null,null,null,null,null,null,null,null,null,null,"Poeng"]
{"$rows_left_out":61}
{"sheet":"Ledig (3)","index":13,"n_rows":69,"n_cols":18,"rows_kept":69,"cut":false,"hidden":false,"merged":[[8,7,8,11],[8,12,8,16]]}
[]
[null,null,null,null,{"$f":"+'K2'!E2","v":"Namsosrennet i hopp og kombinert 01.02.2026"}]
[]
[]
[null,null,null,null,{"$f":"\"K\"&F6","v":"K65"},null,"Steinkjerrennet 31.01.2026"]
[null,null,null,null,"K-punkt:",65,"meter"]
[null,null,null,null,"Meterverdi:",{"$f":"VLOOKUP(F6,Meterverdier!A:B,2,FALSE)","v":2.4},"poeng/meter"]
[]
[null,null,null,null,null,null,null,"1. omgang",null,null,null,null,"2. omgang"]
[null,null,"Start-",null,null,"Hopp/",null,null,null,null,null,null,null,null,null,null,null,"Poeng"]
{"$rows_left_out":60}
{"sheet":"Ledig (4)","index":14,"n_rows":69,"n_cols":18,"rows_kept":69,"cut":false,"hidden":false,"merged":[[8,7,8,11],[8,12,8,16]]}
[]
[null,null,null,null,{"$f":"+'K2'!E2","v":"Namsosrennet i hopp og kombinert 01.02.2026"}]
[]
[]
[null,null,null,null,{"$f":"\"K\"&F6","v":"K120"},null,"Ledig klasse"]
[null,null,null,null,"K-punkt:",120,"meter"]
[null,null,null,null,"Meterverdi:",{"$f":"VLOOKUP(F6,Meterverdier!A:B,2,FALSE)","v":1.8},"poeng/meter"]
[]
[null,null,null,null,null,null,null,"1. omgang",null,null,null,null,"2. omgang"]
[null,null,"Start-",null,null,"Hopp/",null,null,null,null,null,null,null,null,null,null,null,"Poeng"]
{"$rows_left_out":60}
{"sheet":"Ledig (5)","index":15,"n_rows":69,"n_cols":18,"rows_kept":69,"cut":false,"hidden":false,"merged":[[8,7,8,11],[8,12,8,16]]}
[]
[null,null,null,null,{"$f":"+'K2'!E2","v":"Namsosrennet i hopp og kombinert 01.02.2026"}]
[]
[]
[null,null,null,null,{"$f":"\"K\"&F6","v":"K120"},null,"Ledig klasse"]
[null,null,null,null,"K-punkt:",120,"meter"]
[null,null,null,null,"Meterverdi:",{"$f":"VLOOKUP(F6,Meterverdier!A:B,2,FALSE)","v":1.8},"poeng/meter"]
[]
[null,null,null,null,null,null,null,"1. omgang",null,null,null,null,"2. omgang"]
[null,null,"Start-",null,null,"Hopp/",null,null,null,null,null,null,null,null,null,null,null,"Poeng"]
{"$rows_left_out":60}
{"sheet":"Ledig (6)","index":16,"n_rows":69,"n_cols":18,"rows_kept":69,"cut":false,"hidden":false,"merged":[[8,7,8,11],[8,12,8,16]]}
[]
[null,null,null,null,{"$f":"+'K2'!E2","v":"Namsosrennet i hopp og kombinert 01.02.2026"}]
[]
[]
[null,null,null,null,{"$f":"\"K\"&F6","v":"K120"},null,"Ledig klasse"]
[null,null,null,null,"K-punkt:",120,"meter"]
[null,null,null,null,"Meterverdi:",{"$f":"VLOOKUP(F6,Meterverdier!A:B,2,FALSE)","v":1.8},"poeng/meter"]
[]
[null,null,null,null,null,null,null,"1. omgang",null,null,null,null,"2. omgang"]
[null,null,"Start-",null,null,"Hopp/",null,null,null,null,null,null,null,null,null,null,null,"Poeng"]
{"$rows_left_out":60}
{"sheet":"K65 RCB G","index":17,"n_rows":69,"n_cols":18,"rows_kept":69,"cut":false,"hidden":true,"merged":[[8,7,8,11],[8,12,8,16]]}
[]
[null,null,null,null,"Granåsenrennet - SMN 1 Trøndercup i hopp og kombinert 11.02.2024"]
[]
[]
[null,null,null,null,{"$f":"\"K\"&F6","v":"K65"},null,"RCB Gutter"]
[null,null,null,null,"K-punkt:",65,"meter"]
[null,null,null,null,"Meterverdi:",{"$f":"VLOOKUP(F6,Meterverdier!A:B,2,FALSE)","v":2.4},"poeng/meter"]
[]
[null,null,null,null,null,null,null,"1. omgang",null,null,null,null,"2. omgang"]
[null,null,"Start-",null,null,"Hopp/",null,null,null,null,null,null,null,null,null,null,null,"Poeng"]
{"$rows_left_out":60}
{"sheet":"K65 RCB J","index":18,"n_rows":69,"n_cols":18,"rows_kept":69,"cut":false,"hidden":true,"merged":[[8,7,8,11],[8,12,8,16]]}
[]
[null,null,null,null,"Granåsenrennet - SMN 1 Trøndercup i hopp og kombinert 11.02.2024"]
[]
[]
[null,null,null,null,{"$f":"\"K\"&F6","v":"K65"},null,"RCB Jenter"]
[null,null,null,null,"K-punkt:",65,"meter"]
[null,null,null,null,"Meterverdi:",{"$f":"VLOOKUP(F6,Meterverdier!A:B,2,FALSE)","v":2.4},"poeng/meter"]
[]
[null,null,null,null,null,null,null,"1. omgang",null,null,null,null,"2. omgang"]
[null,null,"Start-",null,null,"Hopp/",null,null,null,null,null,null,null,null,null,null,null,"Poeng"]
{"$rows_left_out":60}
{"sheet":"Meterverdier","index":19,"n_rows":231,"n_cols":2,"rows_kept":231,"cut":false,"hidden":true,"merged":[]}
["Bakkestørrelse"]
[1,{"$f":"IF(A2<20,5.2,IF(A2<25,4.8,IF(A2<30,4.4,IF(A2<35,4,IF(A2<40,3.6,IF(A2<50,3.2,IF(A2<50,3.2,IF(A2<60,2.8,IF(A2<70,2.4,IF(A2<80,2.2,IF(A2<100,2,IF(A2<170,1.8,1.2))))))))))))","v":5.2}]
[2,{"$f":"IF(A3<20,5.2,IF(A3<25,4.8,IF(A3<30,4.4,IF(A3<35,4,IF(A3<40,3.6,IF(A3<50,3.2,IF(A3<50,3.2,IF(A3<60,2.8,IF(A3<70,2.4,IF(A3<80,2.2,IF(A3<100,2,IF(A3<170,1.8,1.2))))))))))))","v":5.2}]
[3,5.2]
[4,5.2]
[5,5.2]
[6,5.2]
[7,5.2]
[8,5.2]
[9,5.2]
{"$rows_left_out":221}